Test results for 5.2.4-dev [failed]
| From: | noreply@php.net | Date: | Thu, 28 Jun 2007 07:05:45 +0000 |
| Subject: | Test results for 5.2.4-dev [failed] | ||
| Groups: | php.qa | ||
| Request: | Send a blank email to php-qa+get-37324@lists.php.net to get a copy of this message | ||
=====================================================================
FAILED TEST SUMMARY
---------------------------------------------------------------------
Bug #30638 (localeconv returns wrong LC_NUMERIC settings) (ok to fail on MacOS X)
[tests/lang/bug30638.phpt]
Bug #38474 (getAttribute select attribute by order, even when prefixed) (OK to fail with libxml2
< 2.6.2x) [ext/dom/tests/bug38474.phpt]
Test array_keys() function [ext/standard/tests/array/array_keys.phpt]
Sort with SORT_LOCALE_STRING [ext/standard/tests/array/locale_sort.phpt]
Test filegroup() function: basic functionality [ext/standard/tests/file/filegroup_basic.phpt]
Test fileowner() function: basic functionality [ext/standard/tests/file/fileowner_basic.phpt]
Test filesize() function: usage variations [ext/standard/tests/file/filesize_variation.phpt]
Test readlink() and realpath functions: basic functionality
[ext/standard/tests/file/readlink_realpath_basic.phpt]
Test readlink() and realpath() functions: error conditions
[ext/standard/tests/file/readlink_realpath_error.phpt]
Test readlink() and realpath() functions: usage variation
[ext/standard/tests/file/readlink_realpath_variation.phpt]
Test symlink(), linkinfo(), link() and is_link() functions : error conditions
[ext/standard/tests/file/symlink_link_linkinfo_is_link_error.phpt]
Test symlink(), linkinfo(), link() and is_link() functions : usage variations
[ext/standard/tests/file/symlink_link_linkinfo_is_link_variation.phpt]
Test gettype() & settype() functions : usage variations
[ext/standard/tests/general_functions/gettype_settype_variation2.phpt]
htmlentities() test 2 (setlocale / fr_FR.ISO-8859-15)
[ext/standard/tests/strings/htmlentities02.phpt] (warn: possibly braindead libc)
htmlentities() test 4 (setlocale / ja_JP.EUC-JP) [ext/standard/tests/strings/htmlentities04.phpt]
htmlentities() test 15 (setlocale / KOI8-R) [ext/standard/tests/strings/htmlentities15.phpt]
Generic pack()/unpack() tests [ext/standard/tests/strings/pack.phpt]
=====================================================================
=====================================================================
TEST RESULT SUMMARY
---------------------------------------------------------------------
Exts skipped : 45
Exts tested : 34
---------------------------------------------------------------------
Number of tests : 3465 2202
Tests skipped : 1263 ( 36.5%) --------
Tests warned : 1 ( 0.0%) ( 0.0%)
Tests failed : 16 ( 0.5%) ( 0.7%)
Tests passed : 2185 ( 63.1%) ( 99.2%)
---------------------------------------------------------------------
Time taken : 383 seconds
=====================================================================
=====================================================================
FAILED TEST SUMMARY
---------------------------------------------------------------------
Bug #30638 (localeconv returns wrong LC_NUMERIC settings) (ok to fail on MacOS X)
[tests/lang/bug30638.phpt]
Bug #38474 (getAttribute select attribute by order, even when prefixed) (OK to fail with libxml2
< 2.6.2x) [ext/dom/tests/bug38474.phpt]
Test array_keys() function [ext/standard/tests/array/array_keys.phpt]
Sort with SORT_LOCALE_STRING [ext/standard/tests/array/locale_sort.phpt]
Test filegroup() function: basic functionality [ext/standard/tests/file/filegroup_basic.phpt]
Test fileowner() function: basic functionality [ext/standard/tests/file/fileowner_basic.phpt]
Test filesize() function: usage variations [ext/standard/tests/file/filesize_variation.phpt]
Test readlink() and realpath functions: basic functionality
[ext/standard/tests/file/readlink_realpath_basic.phpt]
Test readlink() and realpath() functions: error conditions
[ext/standard/tests/file/readlink_realpath_error.phpt]
Test readlink() and realpath() functions: usage variation
[ext/standard/tests/file/readlink_realpath_variation.phpt]
Test symlink(), linkinfo(), link() and is_link() functions : error conditions
[ext/standard/tests/file/symlink_link_linkinfo_is_link_error.phpt]
Test symlink(), linkinfo(), link() and is_link() functions : usage variations
[ext/standard/tests/file/symlink_link_linkinfo_is_link_variation.phpt]
Test gettype() & settype() functions : usage variations
[ext/standard/tests/general_functions/gettype_settype_variation2.phpt]
htmlentities() test 2 (setlocale / fr_FR.ISO-8859-15)
[ext/standard/tests/strings/htmlentities02.phpt] (warn: possibly braindead libc)
htmlentities() test 4 (setlocale / ja_JP.EUC-JP) [ext/standard/tests/strings/htmlentities04.phpt]
htmlentities() test 15 (setlocale / KOI8-R) [ext/standard/tests/strings/htmlentities15.phpt]
Generic pack()/unpack() tests [ext/standard/tests/strings/pack.phpt]
=====================================================================
================================================================================
/usr/local/php5.2-200706280430/tests/lang/bug30638.phpt
================================================================================
decimal_point: ,
thousands_sep:
================================================================================
002+ thousands_sep:
002- thousands_sep: .
================================================================================
================================================================================
/usr/local/php5.2-200706280430/ext/dom/tests/bug38474.phpt
================================================================================
foo
bar
foo2
bar
baz2
================================================================================
004+ bar
005+
006+
004- bar2
005- baz
008- baz
================================================================================
================================================================================
/usr/local/php5.2-200706280430/ext/standard/tests/array/array_keys.phpt
================================================================================
*** Testing array_keys() on basic array operation ***
array(5) {
[0]=>
string(1) "a"
[1]=>
string(1) "b"
[2]=>
int(2)
[3]=>
int(-23)
[4]=>
int(3)
}
*** Testing array_keys() on various arrays ***
-- Iteration 0 --
array(0) {
}
-- Iteration 1 --
array(1) {
[0]=>
int(0)
}
-- Iteration 2 --
array(1) {
[0]=>
int(0)
}
-- Iteration 3 --
array(1) {
[0]=>
string(5) "Hello"
}
-- Iteration 4 --
array(1) {
[0]=>
string(0) ""
}
-- Iteration 5 --
array(4) {
[0]=>
int(0)
[1]=>
int(1)
[2]=>
int(2)
[3]=>
string(1) "d"
}
-- Iteration 6 --
array(4) {
[0]=>
string(1) "a"
[1]=>
string(1) "b"
[2]=>
string(1) "c"
[3]=>
string(1) "d"
}
-- Iteration 7 --
array(4) {
[0]=>
int(0)
[1]=>
int(1)
[2]=>
int(2)
[3]=>
int(3)
}
-- Iteration 8 --
array(5) {
[0]=>
int(0)
[1]=>
int(1)
[2]=>
string(1) "a"
[3]=>
int(3)
[4]=>
int(5)
}
-- Iteration 9 --
array(5) {
[0]=>
int(1)
[1]=>
int(0)
[2]=>
string(0) ""
[3]=>
int(2)
[4]=>
int(3)
}
-- Iteration 10 --
array(3) {
[0]=>
string(1) "a"
[1]=>
string(2) "ab"
[2]=>
string(2) "cd"
}
-- Iteration 11 --
array(4) {
[0]=>
int(0)
[1]=>
int(1)
[2]=>
int(2)
[3]=>
string(0) ""
}
*** Testing array_keys() on all the types other than arrays ***
-- Loose type checking --
array(3) {
[0]=>
int(1)
[1]=>
int(-1)
[2]=>
string(3) "php"
}
-- strict type checking --
array(0) {
}
-- Loose type checking --
array(4) {
[0]=>
int(0)
[1]=>
int(2)
[2]=>
int(3)
[3]=>
string(0) ""
}
-- strict type checking --
array(0) {
}
-- Loose type checking --
array(1) {
[0]=>
int(1)
}
-- strict type checking --
array(0) {
}
-- Loose type checking --
array(4) {
[0]=>
int(0)
[1]=>
int(2)
[2]=>
string(3) "php"
[3]=>
string(0) ""
}
-- strict type checking --
array(0) {
}
-- Loose type checking --
array(1) {
[0]=>
int(-1)
}
-- strict type checking --
array(0) {
}
-- Loose type checking --
array(1) {
[0]=>
int(1)
}
-- strict type checking --
array(1) {
[0]=>
int(1)
}
-- Loose type checking --
array(1) {
[0]=>
int(0)
}
-- strict type checking --
array(1) {
[0]=>
int(0)
}
-- Loose type checking --
array(1) {
[0]=>
int(-1)
}
-- strict type checking --
array(1) {
[0]=>
int(-1)
}
-- Loose type checking --
array(3) {
[0]=>
int(2)
[1]=>
int(3)
[2]=>
string(0) ""
}
-- strict type checking --
array(1) {
[0]=>
int(2)
}
-- Loose type checking --
array(2) {
[0]=>
int(2)
[1]=>
int(3)
}
-- strict type checking --
array(1) {
[0]=>
int(3)
}
-- Loose type checking --
array(1) {
[0]=>
string(3) "php"
}
-- strict type checking --
array(1) {
[0]=>
string(3) "php"
}
-- Loose type checking --
array(2) {
[0]=>
int(2)
[1]=>
string(0) ""
}
-- strict type checking --
array(1) {
[0]=>
string(0) ""
}
*** Testing array_keys() with resource type ***
array(1) {
[0]=>
int(0)
}
array(1) {
[0]=>
int(0)
}
array(1) {
[0]=>
int(1)
}
array(1) {
[0]=>
int(1)
}
*** Testing array_keys() on range of values ***
array(4) {
[0]=>
int(2147483647)
[1]=>
int(-2147483647)
[2]=>
int(-2147483648)
[3]=>
int(0)
}
*** Testing array_keys() on an array created on the fly ***
array(3) {
[0]=>
string(1) "a"
[1]=>
string(1) "b"
[2]=>
string(1) "c"
}
array(0) {
}
*** Testing error conditions ***
Warning: array_keys(): The first argument should be an array in
/usr/local/php5.2-200706280430/ext/standard/tests/array/array_keys.php on line 89
NULL
Warning: array_keys(): The first argument should be an array in
/usr/local/php5.2-200706280430/ext/standard/tests/array/array_keys.php on line 90
NULL
Warning: array_keys(): The first argument should be an array in
/usr/local/php5.2-200706280430/ext/standard/tests/array/array_keys.php on line 91
NULL
Warning: Wrong parameter count for array_keys() in
/usr/local/php5.2-200706280430/ext/standard/tests/array/array_keys.php on line 92
NULL
Warning: Wrong parameter count for array_keys() in
/usr/local/php5.2-200706280430/ext/standard/tests/array/array_keys.php on line 93
NULL
Warning: Illegal offset type in
/usr/local/php5.2-200706280430/ext/standard/tests/array/array_keys.php on line 94
array(3) {
[0]=>
int(0)
[1]=>
int(1)
[2]=>
int(2)
}
Done
================================================================================
312+ int(-2147483647)
313+ [2]=>
313- [2]=>
314- int(-2147483647)
================================================================================
================================================================================
/usr/local/php5.2-200706280430/ext/standard/tests/array/locale_sort.phpt
================================================================================
array(13) {
["AB"]=>
string(7) "Alberta"
["BC"]=>
string(20) "Colombie-Britannique"
["MB"]=>
string(8) "Manitoba"
["NB"]=>
string(17) "Nouveau-Brunswick"
["NS"]=>
string(15) "Nouvelle-Écosse"
["NU"]=>
string(7) "Nunavut"
["ON"]=>
string(7) "Ontario"
["QC"]=>
string(6) "Québec"
["SK"]=>
string(12) "Saskatchewan"
["NL"]=>
string(23) "Terre-Neuve-et-Labrador"
["YT"]=>
string(19) "Territoire du Yukon"
["NT"]=>
string(25) "Territoires du Nord-Ouest"
["PE"]=>
string(21) "Île-du-Prince-Édouard"
}
================================================================================
006- ["PE"]=>
007- string(21) "Île-du-Prince-Édouard"
026+ ["PE"]=>
027+ string(21) "Île-du-Prince-Édouard"
================================================================================
================================================================================
/usr/local/php5.2-200706280430/ext/standard/tests/file/filegroup_basic.phpt
================================================================================
*** Testing filegroup(): basic functionality ***
-- Testing with the file or directory created by owner --
bool(false)
int(1004)
int(0)
int(1004)
int(1004)
-- Testing with the standard file or directory --
int(0)
int(0)
int(80)
*** Done ***
================================================================================
003+ bool(false)
004+ int(1004)
005+ int(0)
006+ int(1004)
007+ int(1004)
008+
009+ -- Testing with the standard file or directory --
003- array(4) {
004- ["name"]=>
005- string(%d) "%s"
006- ["passwd"]=>
007- string(1) "x"
008- ["members"]=>
009- array(0) {
010- }
011- ["gid"]=>
012- int(%d)
013- }
017- int(%d)
019- -- Testing with the standard file or directory --
020- int(0)
021- int(0)
022- int(0)
023-
================================================================================
================================================================================
/usr/local/php5.2-200706280430/ext/standard/tests/file/fileowner_basic.phpt
================================================================================
*** Testing fileowner(): basic functionality ***
-- Testing with the file or directory created by owner --
array(7) {
["name"]=>
string(4) "root"
["passwd"]=>
string(8) "********"
["uid"]=>
int(0)
["gid"]=>
int(0)
["gecos"]=>
string(20) "System Administrator"
["dir"]=>
string(17) "/private/var/root"
["shell"]=>
string(7) "/bin/sh"
}
int(1004)
int(0)
int(0)
int(0)
-- Testing with the standard file or directory --
int(0)
int(0)
int(0)
*** Done ***
================================================================================
007+ string(8) "********"
007- string(1) "x"
================================================================================
================================================================================
/usr/local/php5.2-200706280430/ext/standard/tests/file/filesize_variation.phpt
================================================================================
*** Testing filesize(): usage variations ***
*** Checking filesize() with different size of files ***
int(1024)
int(1025024)
int(2049024)
int(3073024)
int(4097024)
int(5121024)
int(6145024)
int(7169024)
int(8193024)
int(9217024)
*** Testing size of a dir, sub-dir and file with filesize() ***
-- Creating a base dir, and checking its size --
int(68)
-- Creating a file inside base dir, and checking dir & file size --
int(102)
int(1024)
-- Creating an empty sub-dir in base-dir, and checking size of base and sub dir --
int(102)
int(68)
-- Creating a file inside sub-dir, and checking size of base, subdir and file created --
int(102)
int(102)
int(12000)
-- Testing filesize() after truncating the file to a new length --
bool(true)
int(12000)
bool(true)
int(10800)
bool(true)
int(9600)
bool(true)
int(8400)
bool(true)
int(7200)
bool(true)
int(6000)
bool(true)
int(4800)
bool(true)
int(3600)
bool(true)
int(2400)
bool(true)
int(1200)
bool(true)
int(0)
bool(false)
int(0)
-- Testing filesize() with the data of possible chars --
-- opening the file in 'w' mode and get the size --
int(191)
int(191)
-- opening the file in 'wt' mode and get the size --
int(191)
int(191)
-- opening the file in 'a' mode, adding data and checking the file --
int(203)
-- opening the file in 'at' mode, adding data and checking the file --
int(216)
-- creating a hole and checking the size --
bool(true)
int(220)
-- writing data after hole and checking the size --
int(226)
-- opening the existing file in write mode --
int(0)
-- with empty file --
int(0)
*** Done ***
================================================================================
016+ int(68)
016- int(4096)
018+ int(102)
018- int(4096)
021+ int(102)
022+ int(68)
021- int(4096)
022- int(4096)
024+ int(102)
025+ int(102)
024- int(4096)
025- int(4096)
================================================================================
================================================================================
/usr/local/php5.2-200706280430/ext/standard/tests/file/readlink_realpath_basic.phpt
================================================================================
*** Testing readlink() and realpath(): with valid and invalid path ***
-- Iteration 1 --
string(111)
"/usr/local/php5.2-200706280430/ext/standard/tests/file/readlink_realpath_basic/home/readlink_realpath_basic.tmp"
string(111)
"/usr/local/php5.2-200706280430/ext/standard/tests/file/readlink_realpath_basic/home/readlink_realpath_basic.tmp"
-- Iteration 2 --
string(116)
"/usr/local/php5.2-200706280430/ext/standard/tests/file/readlink_realpath_basic/home/test/readlink_realpath_basic.tmp"
string(116)
"/usr/local/php5.2-200706280430/ext/standard/tests/file/readlink_realpath_basic/home/test/readlink_realpath_basic.tmp"
-- Iteration 3 --
string(116)
"/usr/local/php5.2-200706280430/ext/standard/tests/file/readlink_realpath_basic/home/test/readlink_realpath_basic.tmp"
string(116)
"/usr/local/php5.2-200706280430/ext/standard/tests/file/readlink_realpath_basic/home/test/readlink_realpath_basic.tmp"
-- Iteration 4 --
string(111)
"/usr/local/php5.2-200706280430/ext/standard/tests/file/readlink_realpath_basic/home/readlink_realpath_basic.tmp"
string(111)
"/usr/local/php5.2-200706280430/ext/standard/tests/file/readlink_realpath_basic/home/readlink_realpath_basic.tmp"
-- Iteration 5 --
Warning: readlink(): No such file or directory in
/usr/local/php5.2-200706280430/ext/standard/tests/file/readlink_realpath_basic.php on line 48
bool(false)
bool(false)
-- Iteration 6 --
Warning: readlink(): No such file or directory in
/usr/local/php5.2-200706280430/ext/standard/tests/file/readlink_realpath_basic.php on line 48
bool(false)
bool(false)
-- Iteration 7 --
Warning: readlink(): No such file or directory in
/usr/local/php5.2-200706280430/ext/standard/tests/file/readlink_realpath_basic.php on line 48
bool(false)
string(113)
"/usr/local/php5.2-200706280430/ext/standard/tests/file/readlink_realpath_basic/..readlink_realpath_basic_link.tmp"
-- Iteration 8 --
Warning: readlink(): Invalid argument in
/usr/local/php5.2-200706280430/ext/standard/tests/file/readlink_realpath_basic.php on line 48
bool(false)
string(116)
"/usr/local/php5.2-200706280430/ext/standard/tests/file/readlink_realpath_basic/home/test/readlink_realpath_basic.tmp"
*** Testing realpath() on filenames ***
-- Iteration 1 --
string(111)
"/usr/local/php5.2-200706280430/ext/standard/tests/file/readlink_realpath_basic/home/readlink_realpath_basic.tmp"
-- Iteration 2 --
string(106)
"/usr/local/php5.2-200706280430/ext/standard/tests/file/readlink_realpath_basic/readlink_realpath_basic.tmp"
-- Iteration 3 --
string(116)
"/usr/local/php5.2-200706280430/ext/standard/tests/file/readlink_realpath_basic/home/test/readlink_realpath_basic.tmp"
-- Iteration 4 --
string(106)
"/usr/local/php5.2-200706280430/ext/standard/tests/file/readlink_realpath_basic/readlink_realpath_basic.tmp"
-- Iteration 5 --
string(111)
"/usr/local/php5.2-200706280430/ext/standard/tests/file/readlink_realpath_basic/home/readlink_realpath_basic.tmp"
-- Iteration 6 --
bool(false)
-- Iteration 7 --
bool(false)
-- Iteration 8 --
string(106)
"/usr/local/php5.2-200706280430/ext/standard/tests/file/readlink_realpath_basic/readlink_realpath_basic.tmp"
Done
================================================================================
035+ string(113)
"/usr/local/php5.2-200706280430/ext/standard/tests/file/readlink_realpath_basic/..readlink_realpath_basic_link.tmp"
035- bool(false)
039+ Warning: readlink(): Invalid argument in
/usr/local/php5.2-200706280430/ext/standard/tests/file/readlink_realpath_basic.php on line 48
039- Warning: readlink(): Not a directory in %s on line %d
041+ string(116)
"/usr/local/php5.2-200706280430/ext/standard/tests/file/readlink_realpath_basic/home/test/readlink_realpath_basic.tmp"
041- bool(false)
067+ string(106)
"/usr/local/php5.2-200706280430/ext/standard/tests/file/readlink_realpath_basic/readlink_realpath_basic.tmp"
067- bool(false)
================================================================================
================================================================================
/usr/local/php5.2-200706280430/ext/standard/tests/file/readlink_realpath_error.phpt
================================================================================
*** Testing readlink(): error conditions ***
Warning: Wrong parameter count for readlink() in
/usr/local/php5.2-200706280430/ext/standard/tests/file/readlink_realpath_error.php on line 10
NULL
Warning: Wrong parameter count for readlink() in
/usr/local/php5.2-200706280430/ext/standard/tests/file/readlink_realpath_error.php on line 11
NULL
*** Testing readlink() on a non-existent link ***
Warning: readlink(): No such file or directory in
/usr/local/php5.2-200706280430/ext/standard/tests/file/readlink_realpath_error.php on line 14
bool(false)
*** Testing readlink() on existing file ***
Warning: readlink(): Invalid argument in
/usr/local/php5.2-200706280430/ext/standard/tests/file/readlink_realpath_error.php on line 17
bool(false)
*** Testing readlink() on existing directory ***
Warning: readlink(): Invalid argument in
/usr/local/php5.2-200706280430/ext/standard/tests/file/readlink_realpath_error.php on line 20
bool(false)
*** Testing realpath(): error conditions ***
Warning: Wrong parameter count for realpath() in
/usr/local/php5.2-200706280430/ext/standard/tests/file/readlink_realpath_error.php on line 23
NULL
Warning: Wrong parameter count for realpath() in
/usr/local/php5.2-200706280430/ext/standard/tests/file/readlink_realpath_error.php on line 24
NULL
*** Testing realpath() on a non-existent file ***
string(73) "/usr/local/php5.2-200706280430/ext/standard/tests/file/realpath_error.tmp"
Done
================================================================================
032+ string(73)
"/usr/local/php5.2-200706280430/ext/standard/tests/file/realpath_error.tmp"
032- bool(false)
================================================================================
================================================================================
/usr/local/php5.2-200706280430/ext/standard/tests/file/readlink_realpath_variation.phpt
================================================================================
*** Testing readlink() and realpath() : usage variations ***
*** Testing readlink() and realpath() with linkname stored inside a object ***
-- Testing readlink() and realpath() with softlink, linkname stored inside an object --
bool(true)
string(130)
"/usr/local/php5.2-200706280430/ext/standard/tests/file/readlink_realpath_variation/home/tests/link/readlink_realpath_variation.tmp"
string(130)
"/usr/local/php5.2-200706280430/ext/standard/tests/file/readlink_realpath_variation/home/tests/link/readlink_realpath_variation.tmp"
bool(true)
string(130)
"/usr/local/php5.2-200706280430/ext/standard/tests/file/readlink_realpath_variation/home/tests/link/readlink_realpath_variation.tmp"
string(130)
"/usr/local/php5.2-200706280430/ext/standard/tests/file/readlink_realpath_variation/home/tests/link/readlink_realpath_variation.tmp"
-- Testing readlink() and realpath() with hardlink, linkname stored inside an object --
bool(true)
Warning: readlink(): Invalid argument in
/usr/local/php5.2-200706280430/ext/standard/tests/file/readlink_realpath_variation.php on line 47
bool(false)
string(124)
"/usr/local/php5.2-200706280430/ext/standard/tests/file/readlink_realpath_variation/home/readlink_realpath_variation_link.tmp"
bool(true)
Warning: readlink(): Invalid argument in
/usr/local/php5.2-200706280430/ext/standard/tests/file/readlink_realpath_variation.php on line 50
bool(false)
string(91)
"/usr/local/php5.2-200706280430/ext/standard/tests/file/readlink_realpath_variation_link.tmp"
*** Testing readlink() and realpath() with linkname stored in an array ***
-- Testing readlink() and realpath() with softlink, linkname stored inside an array --
bool(true)
string(130)
"/usr/local/php5.2-200706280430/ext/standard/tests/file/readlink_realpath_variation/home/tests/link/readlink_realpath_variation.tmp"
string(130)
"/usr/local/php5.2-200706280430/ext/standard/tests/file/readlink_realpath_variation/home/tests/link/readlink_realpath_variation.tmp"
Warning: symlink(): No such file or directory in
/usr/local/php5.2-200706280430/ext/standard/tests/file/readlink_realpath_variation.php on line 68
bool(false)
Warning: readlink(): No such file or directory in
/usr/local/php5.2-200706280430/ext/standard/tests/file/readlink_realpath_variation.php on line 69
bool(false)
bool(false)
Warning:
unlink(/usr/local/php5.2-200706280430/ext/standard/tests/file/./readlink_realpath_variation/home/../home//tests//..//..//..//home//readlink_realpath_variation_link.tmp/):
No such file or directory in
/usr/local/php5.2-200706280430/ext/standard/tests/file/readlink_realpath_variation.php on line 74
-- Testing readlink() and realpath() with hardlink, linkname stored inside an array --
bool(true)
Warning: readlink(): Invalid argument in
/usr/local/php5.2-200706280430/ext/standard/tests/file/readlink_realpath_variation.php on line 79
bool(false)
string(135)
"/usr/local/php5.2-200706280430/ext/standard/tests/file/readlink_realpath_variation/home/tests/link/readlink_realpath_variation_link.tmp"
Warning: link(): No such file or directory in
/usr/local/php5.2-200706280430/ext/standard/tests/file/readlink_realpath_variation.php on line 81
bool(false)
Warning: readlink(): No such file or directory in
/usr/local/php5.2-200706280430/ext/standard/tests/file/readlink_realpath_variation.php on line 82
bool(false)
bool(false)
Warning:
unlink(/usr/local/php5.2-200706280430/ext/standard/tests/file/./readlink_realpath_variation/home/../home//tests//..//..//..//home//readlink_realpath_variation_link.tmp/):
No such file or directory in
/usr/local/php5.2-200706280430/ext/standard/tests/file/readlink_realpath_variation.php on line 87
*** Testing readlink() and realpath() with linkname as empty string, NULL and single space ***
-- Iteration1 --
Warning: readlink(): No such file or directory in
/usr/local/php5.2-200706280430/ext/standard/tests/file/readlink_realpath_variation.php on line 106
bool(false)
string(32) "/usr/local/php5.2-200706280430/ "
-- Iteration2 --
Warning: readlink(): No such file or directory in
/usr/local/php5.2-200706280430/ext/standard/tests/file/readlink_realpath_variation.php on line 106
bool(false)
string(32) "/usr/local/php5.2-200706280430/ "
-- Iteration3 --
Warning: readlink(): No such file or directory in
/usr/local/php5.2-200706280430/ext/standard/tests/file/readlink_realpath_variation.php on line 106
bool(false)
string(30) "/usr/local/php5.2-200706280430"
-- Iteration4 --
Warning: readlink(): No such file or directory in
/usr/local/php5.2-200706280430/ext/standard/tests/file/readlink_realpath_variation.php on line 106
bool(false)
string(30) "/usr/local/php5.2-200706280430"
-- Iteration5 --
Warning: readlink(): No such file or directory in
/usr/local/php5.2-200706280430/ext/standard/tests/file/readlink_realpath_variation.php on line 106
bool(false)
string(30) "/usr/local/php5.2-200706280430"
-- Iteration6 --
Warning: readlink(): No such file or directory in
/usr/local/php5.2-200706280430/ext/standard/tests/file/readlink_realpath_variation.php on line 106
bool(false)
string(30) "/usr/local/php5.2-200706280430"
Done
================================================================================
062+ string(32) "/usr/local/php5.2-200706280430/ "
062- bool(false)
067+ string(32) "/usr/local/php5.2-200706280430/ "
067- bool(false)
================================================================================
================================================================================
/usr/local/php5.2-200706280430/ext/standard/tests/file/symlink_link_linkinfo_is_link_error.phpt
================================================================================
*** Testing symlink() for error conditions ***
Warning: Wrong parameter count for symlink() in
/usr/local/php5.2-200706280430/ext/standard/tests/file/symlink_link_linkinfo_is_link_error.php on
line 25
NULL
Warning: Wrong parameter count for symlink() in
/usr/local/php5.2-200706280430/ext/standard/tests/file/symlink_link_linkinfo_is_link_error.php on
line 28
NULL
Warning: symlink(): Invalid argument in
/usr/local/php5.2-200706280430/ext/standard/tests/file/symlink_link_linkinfo_is_link_error.php on
line 31
bool(false)
Warning: symlink(): Invalid argument in
/usr/local/php5.2-200706280430/ext/standard/tests/file/symlink_link_linkinfo_is_link_error.php on
line 32
bool(false)
Warning: symlink(): Invalid argument in
/usr/local/php5.2-200706280430/ext/standard/tests/file/symlink_link_linkinfo_is_link_error.php on
line 33
bool(false)
Warning: symlink(): No such file or directory in
/usr/local/php5.2-200706280430/ext/standard/tests/file/symlink_link_linkinfo_is_link_error.php on
line 34
bool(false)
Warning: symlink(): No such file or directory in
/usr/local/php5.2-200706280430/ext/standard/tests/file/symlink_link_linkinfo_is_link_error.php on
line 35
bool(false)
Warning: symlink(): No such file or directory in
/usr/local/php5.2-200706280430/ext/standard/tests/file/symlink_link_linkinfo_is_link_error.php on
line 36
bool(false)
*** Testing linkinfo() for error conditions ***
Warning: Wrong parameter count for linkinfo() in
/usr/local/php5.2-200706280430/ext/standard/tests/file/symlink_link_linkinfo_is_link_error.php on
line 40
NULL
Warning: Wrong parameter count for linkinfo() in
/usr/local/php5.2-200706280430/ext/standard/tests/file/symlink_link_linkinfo_is_link_error.php on
line 43
NULL
Warning: linkinfo(): No such file or directory in
/usr/local/php5.2-200706280430/ext/standard/tests/file/symlink_link_linkinfo_is_link_error.php on
line 46
int(-1)
Warning: linkinfo(): No such file or directory in
/usr/local/php5.2-200706280430/ext/standard/tests/file/symlink_link_linkinfo_is_link_error.php on
line 47
int(-1)
Warning: linkinfo(): No such file or directory in
/usr/local/php5.2-200706280430/ext/standard/tests/file/symlink_link_linkinfo_is_link_error.php on
line 48
int(-1)
*** Testing link() for error conditions ***
Warning: Wrong parameter count for link() in
/usr/local/php5.2-200706280430/ext/standard/tests/file/symlink_link_linkinfo_is_link_error.php on
line 52
NULL
Warning: Wrong parameter count for link() in
/usr/local/php5.2-200706280430/ext/standard/tests/file/symlink_link_linkinfo_is_link_error.php on
line 55
NULL
Warning: link(): No such file or directory in
/usr/local/php5.2-200706280430/ext/standard/tests/file/symlink_link_linkinfo_is_link_error.php on
line 58
bool(false)
Warning: link(): No such file or directory in
/usr/local/php5.2-200706280430/ext/standard/tests/file/symlink_link_linkinfo_is_link_error.php on
line 59
bool(false)
Warning: link(): No such file or directory in
/usr/local/php5.2-200706280430/ext/standard/tests/file/symlink_link_linkinfo_is_link_error.php on
line 60
bool(false)
Warning: link(): No such file or directory in
/usr/local/php5.2-200706280430/ext/standard/tests/file/symlink_link_linkinfo_is_link_error.php on
line 61
bool(false)
Warning: link(): No such file or directory in
/usr/local/php5.2-200706280430/ext/standard/tests/file/symlink_link_linkinfo_is_link_error.php on
line 62
bool(false)
Warning: link(): No such file or directory in
/usr/local/php5.2-200706280430/ext/standard/tests/file/symlink_link_linkinfo_is_link_error.php on
line 63
bool(false)
*** Testing is_link() for error conditions ***
Warning: Wrong parameter count for is_link() in
/usr/local/php5.2-200706280430/ext/standard/tests/file/symlink_link_linkinfo_is_link_error.php on
line 67
NULL
Warning: Wrong parameter count for is_link() in
/usr/local/php5.2-200706280430/ext/standard/tests/file/symlink_link_linkinfo_is_link_error.php on
line 70
NULL
bool(false)
bool(false)
bool(false)
bool(false)
Done
================================================================================
009+ Warning: symlink(): Invalid argument in
/usr/local/php5.2-200706280430/ext/standard/tests/file/symlink_link_linkinfo_is_link_error.php on
line 31
009- Warning: symlink(): No such file or directory in %s on line %d
012+ Warning: symlink(): Invalid argument in
/usr/local/php5.2-200706280430/ext/standard/tests/file/symlink_link_linkinfo_is_link_error.php on
line 32
012- Warning: symlink(): No such file or directory in %s on line %d
015+ Warning: symlink(): Invalid argument in
/usr/local/php5.2-200706280430/ext/standard/tests/file/symlink_link_linkinfo_is_link_error.php on
line 33
015- Warning: symlink(): No such file or directory in %s on line %d
041+ Warning: linkinfo(): No such file or directory in
/usr/local/php5.2-200706280430/ext/standard/tests/file/symlink_link_linkinfo_is_link_error.php on
line 48
042+ int(-1)
043+
================================================================================
================================================================================
/usr/local/php5.2-200706280430/ext/standard/tests/file/symlink_link_linkinfo_is_link_variation.phpt
================================================================================
*** Testing symlink(), link(), linkinfo() and is_link() with linknames stored as members in an
object ***
-- Working with soft links --
bool(true)
int(234881026)
bool(true)
-- Working with hard links --
bool(true)
int(234881026)
bool(false)
*** Testing symlink(), link(), linkinfo() and is_link() with linknames stored as members of an array
***
-- Working with soft links --
bool(true)
int(234881026)
bool(true)
-- Working with hard links --
bool(true)
int(234881026)
bool(false)
*** Creating a hard link to a non-existent file ***
Warning: link(): No such file or directory in
/usr/local/php5.2-200706280430/ext/standard/tests/file/symlink_link_linkinfo_is_link_variation.php
on line 99
bool(false)
Warning: linkinfo(): No such file or directory in
/usr/local/php5.2-200706280430/ext/standard/tests/file/symlink_link_linkinfo_is_link_variation.php
on line 101
int(-1)
bool(false)
*** Accessing and updating data of file through soft link ***
bool(true)
-- Access data of the file through the soft link --
string(80)
"texttexttexttexttexttexttexttexttexttexttexttexttexttexttexttexttexttexttexttext"
-- Check size of soft link and file --
int(80)
int(80)
Soft link size remains same
-- Updating file with data through soft link --
string(91)
"texttexttexttexttexttexttexttexttexttexttexttexttexttexttexttexttexttexttexttextHello
World"
-- Check size of soft link and file --
int(91)
int(91)
Soft link size remains same
-- Updating file with data and check data through soft link --
string(11) "Hello World"
-- Check size of soft link and file --
int(11)
int(11)
Soft link size remains same
*** Accessing and updating data of file through hard link ***
-- Access data of the file through the hard link --
bool(true)
string(80)
"texttexttexttexttexttexttexttexttexttexttexttexttexttexttexttexttexttexttexttext"
-- Check size of hard link and file --
Size of file and hard link are same
-- Updating file with data through hard link --
string(91)
"texttexttexttexttexttexttexttexttexttexttexttexttexttexttexttexttexttexttexttextHello
World"
-- Check size of hard link and file --
Size of file and hard link are same
-- Updating file with data and check data through hard link --
string(11) "Hello World"
-- Check size of hard link and file --
int(11)
int(11)
Size of file and hard link are same
*** Testing linkinfo() and is_link() on non-existent link ***
bool(true)
bool(true)
Warning: linkinfo(): No such file or directory in
/usr/local/php5.2-200706280430/ext/standard/tests/file/symlink_link_linkinfo_is_link_variation.php
on line 264
int(-1)
bool(false)
*** Creating links in a directory without permission to allow the operation ***
bool(true)
-- Working with soft links --
bool(true)
int(234881026)
bool(true)
-- Working with hard links --
Warning: link(): File exists in
/usr/local/php5.2-200706280430/ext/standard/tests/file/symlink_link_linkinfo_is_link_variation.php
on line 284
bool(false)
int(234881026)
bool(true)
*** Create soft link to file and then to itself ***
bool(true)
Warning: symlink(): File exists in
/usr/local/php5.2-200706280430/ext/standard/tests/file/symlink_link_linkinfo_is_link_variation.php
on line 304
bool(false)
*** Create soft link to directory and then to itself ***
bool(true)
Warning: symlink(): File exists in
/usr/local/php5.2-200706280430/ext/standard/tests/file/symlink_link_linkinfo_is_link_variation.php
on line 312
bool(false)
*** Create hard link to file and then to itself ***
bool(true)
Warning: link(): File exists in
/usr/local/php5.2-200706280430/ext/standard/tests/file/symlink_link_linkinfo_is_link_variation.php
on line 320
bool(false)
*** Create hard link in different directory with same filename ***
Warning: link(): File exists in
/usr/local/php5.2-200706280430/ext/standard/tests/file/symlink_link_linkinfo_is_link_variation.php
on line 336
bool(false)
bool(true)
*** Create soft link in different directory with same filename ***
Warning: symlink(): File exists in
/usr/local/php5.2-200706280430/ext/standard/tests/file/symlink_link_linkinfo_is_link_variation.php
on line 356
bool(false)
bool(true)
*** Checking lstat() on soft link ***
bool(true)
array(26) {
[0]=>
int(234881026)
[1]=>
int(66242426)
[2]=>
int(41453)
[3]=>
int(1)
[4]=>
int(0)
[5]=>
int(1004)
[6]=>
int(0)
[7]=>
int(118)
[8]=>
int(1183014249)
[9]=>
int(1183014249)
[10]=>
int(1183014249)
[11]=>
int(4096)
[12]=>
int(8)
["dev"]=>
int(234881026)
["ino"]=>
int(66242426)
["mode"]=>
int(41453)
["nlink"]=>
int(1)
["uid"]=>
int(0)
["gid"]=>
int(1004)
["rdev"]=>
int(0)
["size"]=>
int(118)
["atime"]=>
int(1183014249)
["mtime"]=>
int(1183014249)
["ctime"]=>
int(1183014249)
["blksize"]=>
int(4096)
["blocks"]=>
int(8)
}
linkinfo() value matches lstat['dev']
*** Checking lstat() on hard link ***
bool(true)
array(26) {
[0]=>
int(234881026)
[1]=>
int(66242403)
[2]=>
int(33188)
[3]=>
int(2)
[4]=>
int(0)
[5]=>
int(1004)
[6]=>
int(0)
[7]=>
int(0)
[8]=>
int(1183014249)
[9]=>
int(1183014249)
[10]=>
int(1183014249)
[11]=>
int(4096)
[12]=>
int(0)
["dev"]=>
int(234881026)
["ino"]=>
int(66242403)
["mode"]=>
int(33188)
["nlink"]=>
int(2)
["uid"]=>
int(0)
["gid"]=>
int(1004)
["rdev"]=>
int(0)
["size"]=>
int(0)
["atime"]=>
int(1183014249)
["mtime"]=>
int(1183014249)
["ctime"]=>
int(1183014249)
["blksize"]=>
int(4096)
["blocks"]=>
int(0)
}
linkinfo() value matches lstat['dev']
*** Checking lstat() on a soft link to directory ***
bool(true)
array(26) {
[0]=>
int(234881026)
[1]=>
int(66242428)
[2]=>
int(41453)
[3]=>
int(1)
[4]=>
int(0)
[5]=>
int(1004)
[6]=>
int(0)
[7]=>
int(85)
[8]=>
int(1183014249)
[9]=>
int(1183014249)
[10]=>
int(1183014249)
[11]=>
int(4096)
[12]=>
int(8)
["dev"]=>
int(234881026)
["ino"]=>
int(66242428)
["mode"]=>
int(41453)
["nlink"]=>
int(1)
["uid"]=>
int(0)
["gid"]=>
int(1004)
["rdev"]=>
int(0)
["size"]=>
int(85)
["atime"]=>
int(1183014249)
["mtime"]=>
int(1183014249)
["ctime"]=>
int(1183014249)
["blksize"]=>
int(4096)
["blocks"]=>
int(8)
}
linkinfo() value matches lstat['dev']
Done
================================================================================
102+ bool(true)
103+ int(234881026)
104+ bool(true)
103- Warning: symlink(): Permission denied in %s on line %i
106+ -- Working with hard links --
107+
108+ Warning: link(): File exists in
/usr/local/php5.2-200706280430/ext/standard/tests/file/symlink_link_linkinfo_is_link_variation.php
on line 284
106- Warning: linkinfo(): Permission denied in %s on line %i
107- int(-1)
110+ int(234881026)
111+ bool(true)
110- -- Working with hard links --
112- Warning: link(): Permission denied in %s on line %i
113+ *** Create soft link to file and then to itself ***
114+ bool(true)
115+
116+ Warning: symlink(): File exists in
/usr/local/php5.2-200706280430/ext/standard/tests/file/symlink_link_linkinfo_is_link_variation.php
on line 304
117+ bool(false)
118+
119+ *** Create soft link to directory and then to itself ***
120+ bool(true)
121+
122+ Warning: symlink(): File exists in
/usr/local/php5.2-200706280430/ext/standard/tests/file/symlink_link_linkinfo_is_link_variation.php
on line 312
123+ bool(false)
124+
125+ *** Create hard link to file and then to itself ***
126+ bool(true)
127+
128+ Warning: link(): File exists in
/usr/local/php5.2-200706280430/ext/standard/tests/file/symlink_link_linkinfo_is_link_variation.php
on line 320
115- Warning: linkinfo(): Permission denied in %s on line %i
116- int(-1)
119- *** Create soft link to file and then to itself ***
121-
122- Warning: symlink(): File exists in %s on line %i
123- bool(false)
124-
125- *** Create soft link to directory and then to itself ***
126- bool(true)
127-
128- Warning: symlink(): File exists in %s on line %i
129- bool(false)
130-
131- *** Create hard link to file and then to itself ***
132- bool(true)
133-
134- Warning: link(): File exists in %s on line %i
135- bool(false)
136-
137- *** Create hard link in different directory with same filename ***
138-
139- Warning: link(): File exists in %s on line %i
140- bool(false)
141- bool(true)
142-
143- *** Create soft link in different directory with same filename ***
144-
145- Warning: symlink(): File exists in %s on line %i
146- bool(false)
147- bool(true)
148-
149- *** Checking lstat() on soft link ***
131+ *** Create hard link in different directory with same filename ***
133+ Warning: link(): File exists in
/usr/local/php5.2-200706280430/ext/standard/tests/file/symlink_link_linkinfo_is_link_variation.php
on line 336
135+ bool(true)
137+ *** Create soft link in different directory with same filename ***
138+
139+ Warning: symlink(): File exists in
/usr/local/php5.2-200706280430/ext/standard/tests/file/symlink_link_linkinfo_is_link_variation.php
on line 356
141+ bool(true)
143+ *** Checking lstat() on soft link ***
145+ array(26) {
146+ [0]=>
147+ int(234881026)
148+ [1]=>
149+ int(66242426)
150+ [2]=>
151+ int(41453)
152+ [3]=>
153+ int(1)
154+ [4]=>
155+ int(0)
156+ [5]=>
157+ int(1004)
158+ [6]=>
159+ int(0)
160+ [7]=>
161+ int(118)
162+ [8]=>
163+ int(1183014249)
164+ [9]=>
165+ int(1183014249)
166+ [10]=>
167+ int(1183014249)
168+ [11]=>
169+ int(4096)
170+ [12]=>
171+ int(8)
172+ ["dev"]=>
173+ int(234881026)
174+ ["ino"]=>
175+ int(66242426)
176+ ["mode"]=>
177+ int(41453)
178+ ["nlink"]=>
179+ int(1)
180+ ["uid"]=>
181+ int(0)
182+ ["gid"]=>
183+ int(1004)
184+ ["rdev"]=>
185+ int(0)
186+ ["size"]=>
187+ int(118)
188+ ["atime"]=>
189+ int(1183014249)
190+ ["mtime"]=>
191+ int(1183014249)
192+ ["ctime"]=>
193+ int(1183014249)
194+ ["blksize"]=>
195+ int(4096)
196+ ["blocks"]=>
197+ int(8)
198+ }
199+
200+ linkinfo() value matches lstat['dev']
201+
202+ *** Checking lstat() on hard link ***
159- int(1)
185- int(1)
208- *** Checking lstat() on hard link ***
212+ int(2)
218- int(2)
238+ int(2)
244- int(2)
261+ *** Checking lstat() on a soft link to directory ***
266-
271+ int(1)
297+ int(1)
319+ Done
267- *** Checking lstat() on a soft link to directory ***
268- bool(true)
269- array(26) {
270- [0]=>
271- int(%i)
272- [1]=>
273- int(%i)
274- [2]=>
275- int(%i)
276- [3]=>
277- int(1)
278- [4]=>
279- int(%i)
280- [5]=>
281- int(%i)
282- [6]=>
283- int(%i)
284- [7]=>
285- int(%i)
286- [8]=>
287- int(%i)
288- [9]=>
289- int(%i)
290- [10]=>
291- int(%i)
292- [11]=>
293- int(%i)
294- [12]=>
295- int(%i)
296- ["dev"]=>
297- int(%i)
298- ["ino"]=>
299- int(%i)
300- ["mode"]=>
301- int(%i)
302- ["nlink"]=>
303- int(1)
304- ["uid"]=>
305- int(%i)
306- ["gid"]=>
307- int(%i)
308- ["rdev"]=>
309- int(%i)
310- ["size"]=>
311- int(%i)
312- ["atime"]=>
313- int(%i)
314- ["mtime"]=>
315- int(%i)
316- ["ctime"]=>
317- int(%i)
318- ["blksize"]=>
319- int(%i)
320- ["blocks"]=>
321- int(%i)
322- }
323-
324- linkinfo() value matches lstat['dev']
325- Done
================================================================================
================================================================================
/usr/local/php5.2-200706280430/ext/standard/tests/general_functions/gettype_settype_variation2.phpt
================================================================================
8: Undefined variable: unset_var
8: Undefined variable: undef_var
*** Testing settype() & gettype() : usage variations ***
-- Setting type of data to integer --
-- Iteration 1 --
string(4) "NULL"
bool(true)
int(0)
string(7) "integer"
-- Iteration 2 --
string(7) "boolean"
bool(true)
int(0)
string(7) "integer"
-- Iteration 3 --
string(7) "boolean"
bool(true)
int(1)
string(7) "integer"
-- Iteration 4 --
string(7) "boolean"
bool(true)
int(1)
string(7) "integer"
-- Iteration 5 --
string(6) "string"
bool(true)
int(0)
string(7) "integer"
-- Iteration 6 --
string(6) "string"
bool(true)
int(0)
string(7) "integer"
-- Iteration 7 --
string(6) "string"
bool(true)
int(3)
string(7) "integer"
-- Iteration 8 --
string(6) "string"
bool(true)
int(0)
string(7) "integer"
-- Iteration 9 --
string(6) "string"
bool(true)
int(0)
string(7) "integer"
-- Iteration 10 --
string(6) "string"
bool(true)
int(0)
string(7) "integer"
-- Iteration 11 --
string(6) "string"
bool(true)
int(0)
string(7) "integer"
-- Iteration 12 --
string(6) "string"
bool(true)
int(10)
string(7) "integer"
-- Iteration 13 --
string(6) "string"
bool(true)
int(10)
string(7) "integer"
-- Iteration 14 --
string(6) "string"
bool(true)
int(10)
string(7) "integer"
-- Iteration 15 --
string(6) "string"
bool(true)
int(10)
string(7) "integer"
-- Iteration 16 --
string(6) "string"
bool(true)
int(1)
string(7) "integer"
-- Iteration 17 --
string(6) "string"
bool(true)
int(-1)
string(7) "integer"
-- Iteration 18 --
string(6) "string"
bool(true)
int(1)
string(7) "integer"
-- Iteration 19 --
string(6) "string"
bool(true)
int(1)
string(7) "integer"
-- Iteration 20 --
string(6) "string"
bool(true)
int(2147483647)
string(7) "integer"
-- Iteration 21 --
string(6) "string"
bool(true)
int(-1)
string(7) "integer"
-- Iteration 22 --
string(6) "string"
bool(true)
int(1)
string(7) "integer"
-- Iteration 23 --
string(6) "string"
bool(true)
int(-1)
string(7) "integer"
-- Iteration 24 --
string(6) "string"
bool(true)
int(1)
string(7) "integer"
-- Iteration 25 --
string(6) "string"
bool(true)
int(1)
string(7) "integer"
-- Iteration 26 --
string(6) "string"
bool(true)
int(2147483647)
string(7) "integer"
-- Iteration 27 --
string(6) "string"
bool(true)
int(-1)
string(7) "integer"
-- Iteration 28 --
string(6) "string"
bool(true)
int(0)
string(7) "integer"
-- Iteration 29 --
string(6) "string"
bool(true)
int(0)
string(7) "integer"
-- Iteration 30 --
string(6) "string"
bool(true)
int(0)
string(7) "integer"
-- Iteration 31 --
string(6) "string"
bool(true)
int(0)
string(7) "integer"
-- Iteration 32 --
string(6) "string"
bool(true)
int(123)
string(7) "integer"
-- Iteration 33 --
string(6) "string"
bool(true)
int(123)
string(7) "integer"
-- Iteration 34 --
string(6) "string"
bool(true)
int(-123)
string(7) "integer"
-- Iteration 35 --
string(6) "string"
bool(true)
int(123)
string(7) "integer"
-- Iteration 36 --
string(6) "string"
bool(true)
int(-123)
string(7) "integer"
-- Iteration 37 --
string(6) "string"
bool(true)
int(123)
string(7) "integer"
-- Iteration 38 --
string(6) "string"
bool(true)
int(0)
string(7) "integer"
-- Iteration 39 --
string(6) "string"
bool(true)
int(0)
string(7) "integer"
-- Iteration 40 --
string(6) "string"
bool(true)
int(0)
string(7) "integer"
-- Iteration 41 --
string(6) "string"
bool(true)
int(0)
string(7) "integer"
-- Iteration 42 --
string(6) "string"
bool(true)
int(0)
string(7) "integer"
-- Iteration 43 --
string(5) "array"
bool(true)
int(0)
string(7) "integer"
-- Iteration 44 --
string(5) "array"
bool(true)
int(1)
string(7) "integer"
-- Iteration 45 --
string(5) "array"
bool(true)
int(1)
string(7) "integer"
-- Iteration 46 --
string(5) "array"
bool(true)
int(1)
string(7) "integer"
-- Iteration 47 --
string(5) "array"
bool(true)
int(1)
string(7) "integer"
-- Iteration 48 --
string(6) "double"
bool(true)
int(-2147483648)
string(7) "integer"
-- Iteration 49 --
string(7) "integer"
bool(true)
int(2147483647)
string(7) "integer"
-- Iteration 50 --
string(6) "double"
bool(true)
int(-2147483647)
string(7) "integer"
-- Iteration 51 --
string(6) "double"
bool(true)
int(-1)
string(7) "integer"
-- Iteration 52 --
string(7) "integer"
bool(true)
int(85)
string(7) "integer"
-- Iteration 53 --
string(6) "double"
bool(true)
int(-1)
string(7) "integer"
-- Iteration 54 --
string(7) "integer"
bool(true)
int(-21903)
string(7) "integer"
-- Iteration 55 --
string(7) "integer"
bool(true)
int(365)
string(7) "integer"
-- Iteration 56 --
string(7) "integer"
bool(true)
int(-365)
string(7) "integer"
-- Iteration 57 --
string(6) "double"
bool(true)
int(-1)
string(7) "integer"
-- Iteration 58 --
string(6) "double"
bool(true)
int(100000)
string(7) "integer"
-- Iteration 59 --
string(6) "double"
bool(true)
int(-100000)
string(7) "integer"
-- Iteration 60 --
string(6) "double"
bool(true)
int(100000)
string(7) "integer"
-- Iteration 61 --
string(6) "double"
bool(true)
int(-100000)
string(7) "integer"
-- Iteration 62 --
string(6) "double"
bool(true)
int(-1)
string(7) "integer"
-- Iteration 63 --
string(6) "double"
bool(true)
int(0)
string(7) "integer"
-- Iteration 64 --
string(6) "double"
bool(true)
int(0)
string(7) "integer"
-- Iteration 65 --
string(6) "double"
bool(true)
int(500000)
string(7) "integer"
-- Iteration 66 --
string(6) "double"
bool(true)
int(-500000)
string(7) "integer"
-- Iteration 67 --
string(6) "double"
bool(true)
int(0)
string(7) "integer"
-- Iteration 68 --
string(6) "double"
bool(true)
int(500000)
string(7) "integer"
-- Iteration 69 --
string(6) "double"
bool(true)
int(-500000)
string(7) "integer"
-- Iteration 70 --
string(6) "double"
bool(true)
int(512000)
string(7) "integer"
-- Iteration 71 --
string(6) "double"
bool(true)
int(-512000)
string(7) "integer"
-- Iteration 72 --
string(6) "double"
bool(true)
int(0)
string(7) "integer"
-- Iteration 73 --
string(6) "double"
bool(true)
int(0)
string(7) "integer"
-- Iteration 74 --
string(6) "double"
bool(true)
int(512000)
string(7) "integer"
-- Iteration 75 --
string(6) "double"
bool(true)
int(-512000)
string(7) "integer"
-- Iteration 76 --
string(6) "object"
8: Object of class point could not be converted to int
bool(true)
int(1)
string(7) "integer"
-- Iteration 77 --
string(6) "object"
8: Object of class point could not be converted to int
bool(true)
int(1)
string(7) "integer"
-- Iteration 78 --
string(6) "object"
8: Object of class point could not be converted to int
bool(true)
int(1)
string(7) "integer"
-- Iteration 79 --
string(4) "NULL"
bool(true)
int(0)
string(7) "integer"
-- Iteration 80 --
string(4) "NULL"
bool(true)
int(0)
string(7) "integer"
-- Setting type of data to int --
-- Iteration 1 --
string(4) "NULL"
bool(true)
int(0)
string(7) "integer"
-- Iteration 2 --
string(7) "boolean"
bool(true)
int(0)
string(7) "integer"
-- Iteration 3 --
string(7) "boolean"
bool(true)
int(1)
string(7) "integer"
-- Iteration 4 --
string(7) "boolean"
bool(true)
int(1)
string(7) "integer"
-- Iteration 5 --
string(6) "string"
bool(true)
int(0)
string(7) "integer"
-- Iteration 6 --
string(6) "string"
bool(true)
int(0)
string(7) "integer"
-- Iteration 7 --
string(6) "string"
bool(true)
int(3)
string(7) "integer"
-- Iteration 8 --
string(6) "string"
bool(true)
int(0)
string(7) "integer"
-- Iteration 9 --
string(6) "string"
bool(true)
int(0)
string(7) "integer"
-- Iteration 10 --
string(6) "string"
bool(true)
int(0)
string(7) "integer"
-- Iteration 11 --
string(6) "string"
bool(true)
int(0)
string(7) "integer"
-- Iteration 12 --
string(6) "string"
bool(true)
int(10)
string(7) "integer"
-- Iteration 13 --
string(6) "string"
bool(true)
int(10)
string(7) "integer"
-- Iteration 14 --
string(6) "string"
bool(true)
int(10)
string(7) "integer"
-- Iteration 15 --
string(6) "string"
bool(true)
int(10)
string(7) "integer"
-- Iteration 16 --
string(6) "string"
bool(true)
int(1)
string(7) "integer"
-- Iteration 17 --
string(6) "string"
bool(true)
int(-1)
string(7) "integer"
-- Iteration 18 --
string(6) "string"
bool(true)
int(1)
string(7) "integer"
-- Iteration 19 --
string(6) "string"
bool(true)
int(1)
string(7) "integer"
-- Iteration 20 --
string(6) "string"
bool(true)
int(2147483647)
string(7) "integer"
-- Iteration 21 --
string(6) "string"
bool(true)
int(-1)
string(7) "integer"
-- Iteration 22 --
string(6) "string"
bool(true)
int(1)
string(7) "integer"
-- Iteration 23 --
string(6) "string"
bool(true)
int(-1)
string(7) "integer"
-- Iteration 24 --
string(6) "string"
bool(true)
int(1)
string(7) "integer"
-- Iteration 25 --
string(6) "string"
bool(true)
int(1)
string(7) "integer"
-- Iteration 26 --
string(6) "string"
bool(true)
int(2147483647)
string(7) "integer"
-- Iteration 27 --
string(6) "string"
bool(true)
int(-1)
string(7) "integer"
-- Iteration 28 --
string(6) "string"
bool(true)
int(0)
string(7) "integer"
-- Iteration 29 --
string(6) "string"
bool(true)
int(0)
string(7) "integer"
-- Iteration 30 --
string(6) "string"
bool(true)
int(0)
string(7) "integer"
-- Iteration 31 --
string(6) "string"
bool(true)
int(0)
string(7) "integer"
-- Iteration 32 --
string(6) "string"
bool(true)
int(123)
string(7) "integer"
-- Iteration 33 --
string(6) "string"
bool(true)
int(123)
string(7) "integer"
-- Iteration 34 --
string(6) "string"
bool(true)
int(-123)
string(7) "integer"
-- Iteration 35 --
string(6) "string"
bool(true)
int(123)
string(7) "integer"
-- Iteration 36 --
string(6) "string"
bool(true)
int(-123)
string(7) "integer"
-- Iteration 37 --
string(6) "string"
bool(true)
int(123)
string(7) "integer"
-- Iteration 38 --
string(6) "string"
bool(true)
int(0)
string(7) "integer"
-- Iteration 39 --
string(6) "string"
bool(true)
int(0)
string(7) "integer"
-- Iteration 40 --
string(6) "string"
bool(true)
int(0)
string(7) "integer"
-- Iteration 41 --
string(6) "string"
bool(true)
int(0)
string(7) "integer"
-- Iteration 42 --
string(6) "string"
bool(true)
int(0)
string(7) "integer"
-- Iteration 43 --
string(5) "array"
bool(true)
int(0)
string(7) "integer"
-- Iteration 44 --
string(5) "array"
bool(true)
int(1)
string(7) "integer"
-- Iteration 45 --
string(5) "array"
bool(true)
int(1)
string(7) "integer"
-- Iteration 46 --
string(5) "array"
bool(true)
int(1)
string(7) "integer"
-- Iteration 47 --
string(5) "array"
bool(true)
int(1)
string(7) "integer"
-- Iteration 48 --
string(6) "double"
bool(true)
int(-2147483648)
string(7) "integer"
-- Iteration 49 --
string(7) "integer"
bool(true)
int(2147483647)
string(7) "integer"
-- Iteration 50 --
string(6) "double"
bool(true)
int(-2147483647)
string(7) "integer"
-- Iteration 51 --
string(6) "double"
bool(true)
int(-1)
string(7) "integer"
-- Iteration 52 --
string(7) "integer"
bool(true)
int(85)
string(7) "integer"
-- Iteration 53 --
string(6) "double"
bool(true)
int(-1)
string(7) "integer"
-- Iteration 54 --
string(7) "integer"
bool(true)
int(-21903)
string(7) "integer"
-- Iteration 55 --
string(7) "integer"
bool(true)
int(365)
string(7) "integer"
-- Iteration 56 --
string(7) "integer"
bool(true)
int(-365)
string(7) "integer"
-- Iteration 57 --
string(6) "double"
bool(true)
int(-1)
string(7) "integer"
-- Iteration 58 --
string(6) "double"
bool(true)
int(100000)
string(7) "integer"
-- Iteration 59 --
string(6) "double"
bool(true)
int(-100000)
string(7) "integer"
-- Iteration 60 --
string(6) "double"
bool(true)
int(100000)
string(7) "integer"
-- Iteration 61 --
string(6) "double"
bool(true)
int(-100000)
string(7) "integer"
-- Iteration 62 --
string(6) "double"
bool(true)
int(-1)
string(7) "integer"
-- Iteration 63 --
string(6) "double"
bool(true)
int(0)
string(7) "integer"
-- Iteration 64 --
string(6) "double"
bool(true)
int(0)
string(7) "integer"
-- Iteration 65 --
string(6) "double"
bool(true)
int(500000)
string(7) "integer"
-- Iteration 66 --
string(6) "double"
bool(true)
int(-500000)
string(7) "integer"
-- Iteration 67 --
string(6) "double"
bool(true)
int(0)
string(7) "integer"
-- Iteration 68 --
string(6) "double"
bool(true)
int(500000)
string(7) "integer"
-- Iteration 69 --
string(6) "double"
bool(true)
int(-500000)
string(7) "integer"
-- Iteration 70 --
string(6) "double"
bool(true)
int(512000)
string(7) "integer"
-- Iteration 71 --
string(6) "double"
bool(true)
int(-512000)
string(7) "integer"
-- Iteration 72 --
string(6) "double"
bool(true)
int(0)
string(7) "integer"
-- Iteration 73 --
string(6) "double"
bool(true)
int(0)
string(7) "integer"
-- Iteration 74 --
string(6) "double"
bool(true)
int(512000)
string(7) "integer"
-- Iteration 75 --
string(6) "double"
bool(true)
int(-512000)
string(7) "integer"
-- Iteration 76 --
string(6) "object"
8: Object of class point could not be converted to int
bool(true)
int(1)
string(7) "integer"
-- Iteration 77 --
string(6) "object"
8: Object of class point could not be converted to int
bool(true)
int(1)
string(7) "integer"
-- Iteration 78 --
string(6) "object"
8: Object of class point could not be converted to int
bool(true)
int(1)
string(7) "integer"
-- Iteration 79 --
string(4) "NULL"
bool(true)
int(0)
string(7) "integer"
-- Iteration 80 --
string(4) "NULL"
bool(true)
int(0)
string(7) "integer"
Done
================================================================================
260+ int(-1)
260- int(-508130303)
270+ int(-1)
270- int(1952002105)
290+ int(-1)
290- int(343000682)
665+ int(-1)
665- int(-508130303)
675+ int(-1)
675- int(1952002105)
695+ int(-1)
695- int(343000682)
================================================================================
================================================================================
/usr/local/php5.2-200706280430/ext/standard/tests/strings/htmlentities02.phpt (warn: possibly
braindead libc)
================================================================================
string(24) "¼½¾"
================================================================================
001+ string(24) "¼½¾"
001- string(20) "ŒœŸ"
================================================================================
================================================================================
/usr/local/php5.2-200706280430/ext/standard/tests/strings/htmlentities04.phpt
================================================================================
string(42) "¡¢¡£¡¤"
================================================================================
001+ string(42) "¡¢¡£¡¤"
001- string(6) "¡¢¡£¡¤"
================================================================================
================================================================================
/usr/local/php5.2-200706280430/ext/standard/tests/strings/htmlentities15.phpt
================================================================================
string(9) "ÒÏÓËÏÛÎÙÊ"
string(63)
"ÒÏÓËÏÛÎÙÊ"
================================================================================
002+ string(63)
"ÒÏÓËÏÛÎÙÊ"
002- string(63)
"роскошный"
================================================================================
================================================================================
/usr/local/php5.2-200706280430/ext/standard/tests/strings/pack.phpt
================================================================================
Array
(
[1] => h
)
Array
(
[1] => hello world
)
"hello "
Array
(
[1] => 129
)
Array
(
[1] => 127
)
Array
(
[1] => 255
)
Array
(
[1] => 127
)
Array
(
[1] => 4
)
Array
(
[1] => 65534
)
Array
(
[1] => 0
)
Array
(
[1] => -1000
)
Array
(
[1] => -64434
)
Array
(
[1] => -1
)
Array
(
[1] => -2147483648
)
Array
(
[1] => 65534
)
Array
(
[1] => 0
)
Array
(
[1] => -2147483646
)
Array
(
[1] => -1
)
Array
(
[1] => -2147483648
)
Array
(
[1] => 65534
)
Array
(
[1] => 0
)
Array
(
[1] => -2147483646
)
Array
(
[1] => -1
)
Array
(
[1] => -2147483648
)
Array
(
[1] => -30000
)
Array
(
[1] => 65534
)
Array
(
[1] => 1
)
Array
(
[1] => 0
)
Array
(
[1] => 64536
)
Array
(
[1] => 1102
)
Array
(
[1] => 1
)
Array
(
[1] => 65534
)
Array
(
[1] => 0
)
Array
(
[1] => -2147483646
)
Array
(
[1] => -1
)
Array
(
[1] => -2147483648
)
Array
(
[1] => h
)
Array
(
[1] => hello world
)
Array
(
[1] => -127
)
Array
(
[1] => 127
)
Array
(
[1] => -1
)
Array
(
[1] => 127
)
Array
(
[1] => 3
)
Array
(
[1] => 65534
)
Array
(
[1] => 0
)
Array
(
[1] => -1000
)
Array
(
[1] => -64434
)
Array
(
[1] => -65535
)
Array
(
[1] => -2147483647
)
Array
(
[1] => 65534
)
Array
(
[1] => 0
)
Array
(
[1] => -2147483646
)
Array
(
[1] => -1
)
Array
(
[1] => -2147483648
)
Array
(
[1] => 65534
)
Array
(
[1] => 1
)
Array
(
[1] => 0
)
Array
(
[1] => 64536
)
Array
(
[1] => 1102
)
Array
(
[1] => 1
)
Array
(
[1] => 32767
)
Array
(
[1] => -1
)
Array
(
[1] => 0
)
Array
(
[1] => -1000
)
Array
(
[1] => 1102
)
Array
(
[1] => 1
)
Array
(
[1] => 65534
)
Array
(
[1] => 1
)
Array
(
[1] => 0
)
Array
(
[1] => 64536
)
Array
(
[1] => 1102
)
Array
(
[1] => 1
)
================================================================================
048+ [1] => -1
048- [1] => 0
088+ [1] => -1
088- [1] => 0
136+ [1] => -1
136- [1] => 0
208+ [1] => -1
208- [1] => 0
================================================================================
================================================================================
BUILD ENVIRONMENT
================================================================================
OS:
Darwin - Darwin spiralvinyl.com 8.7.0 Darwin Kernel Version 8.7.0: Fri May 26 15:20:53 PDT 2006;
root:xnu-792.6.76.obj~1/RELEASE_PPC Power Macintosh
Autoconf:
autoconf (GNU Autoconf) 2.59
Written by David J. MacKenzie and Akim Demaille.
Copyright (C) 2003 Free Software Foundation, Inc.
This is free software; see the source for copying conditions. There is NO
warranty; not even for MERCHANTABILITY or FITNESS FOR A PARTICULAR PURPOSE.
Bundled Libtool:
ltmain.sh (GNU libtool) 1.5.20 (1.1220.2.287 2005/08/31 18:54:15)
Copyright (C) 2005 Free Software Foundation, Inc.
This is free software; see the source for copying conditions. There is NO
warranty; not even for MERCHANTABILITY or FITNESS FOR A PARTICULAR PURPOSE.
System Libtool:
ltmain.sh (GNU libtool) 1.5 (1.1220 2003/04/05 19:32:58)
Copyright (C) 2003 Free Software Foundation, Inc.
This is free software; see the source for copying conditions. There is NO
warranty; not even for MERCHANTABILITY or FITNESS FOR A PARTICULAR PURPOSE.
Compiler:
Using built-in specs.
Target: powerpc-apple-darwin8
Configured with: /private/var/tmp/gcc/gcc-5026.obj~19/src/configure --disable-checking --prefix=/usr
--mandir=/share/man --enable-languages=c,objc,c++,obj-c++
--program-transform-name=/^[cg][^+.-]*$/s/$/-4.0/ --with-gxx-include-dir=/include/gcc/darwin/4.0/c++
--build=powerpc-apple-darwin8 --host=powerpc-apple-darwin8 --target=powerpc-apple-darwin8
Thread model: posix
gcc version 4.0.0 (Apple Computer, Inc. build 5026)
Bison:
GNU Bison version 1.28
Libraries:
User's E-mail: bryce at designapproach dot com
================================================================================
PHPINFO
================================================================================
phpinfo()
PHP Version => 5.2.4-dev
System => Darwin spiralvinyl.com 8.7.0 Darwin Kernel Version 8.7.0: Fri May 26 15:20:53 PDT 2006;
root:xnu-792.6.76.obj~1/RELEASE_PPC Power Macintosh
Build Date => Jun 27 2007 23:47:59
Configure Command => './configure' '--prefix=/usr/local'
'--mandir=/usr/share/man' '--infodir=/usr/share/info'
'--with-apxs2=/usr/local/apache2/bin/apxs' '--with-ldap=/usr'
'--with-kerberos=/usr' '--enable-cli' '--with-zlib'
'--with-iconv=/sw/' '--enable-trans-sid' '--with-xml'
'--with-gd' '--enable-exif' '--enable-ftp'
'--enable-mbstring' '--enable-dbx' '--enable-sockets'
'--with-iodbc=/usr' '--with-curl=/usr' '--with-mysql=/library/mysql'
'--with-pgsql=/usr/local/pgsql' '--enable-simplexml' '--with-dom=/sw/'
'--without-bundle-libxml' '--with-libxml-dir=/sw/' '--with-xsl=/sw/'
'--with-gd' '--with-jpeg-dir=/usr/local' '--with-png-dir=/sw/'
Server API => Command Line Interface
Virtual Directory Support => disabled
Configuration File (php.ini) Path => /usr/local/lib
Loaded Configuration File => /usr/local/lib/php.ini
PHP API => 20041225
PHP Extension => 20060613
Zend Extension => 220060519
Debug Build => no
Thread Safety => disabled
Zend Memory Manager => enabled
IPv6 Support => enabled
Registered PHP Streams => php, file, data, http, ftp, compress.zlib
Registered Stream Socket Transports => tcp, udp, unix, udg
Registered Stream Filters => string.rot13, string.toupper, string.tolower, string.strip_tags,
convert.*, consumed, convert.iconv.*, zlib.*
This program makes use of the Zend Scripting Language Engine:
Zend Engine v2.2.0, Copyright (c) 1998-2007 Zend Technologies
_______________________________________________________________________
Configuration
PHP Core
Directive => Local Value => Master Value
allow_call_time_pass_reference => On => On
allow_url_fopen => On => On
allow_url_include => Off => Off
always_populate_raw_post_data => Off => Off
arg_separator.input => & => &
arg_separator.output => & => &
asp_tags => Off => Off
auto_append_file => no value => no value
auto_globals_jit => On => On
auto_prepend_file => no value => no value
browscap => no value => no value
default_charset => no value => no value
default_mimetype => text/html => text/html
define_syslog_variables => Off => Off
disable_classes => no value => no value
disable_functions => no value => no value
display_errors => On => On
display_startup_errors => Off => Off
doc_root => no value => no value
docref_ext => no value => no value
docref_root => no value => no value
enable_dl => On => On
error_append_string => no value => no value
error_log => no value => no value
error_prepend_string => no value => no value
error_reporting => 6135 => 6135
expose_php => On => On
extension_dir => ./ => ./
file_uploads => On => On
highlight.bg => <font style="color: #FFFFFF">#FFFFFF</font> => <font
style="color: #FFFFFF">#FFFFFF</font>
highlight.comment => <font style="color: #FF8000">#FF8000</font> =>
<font style="color: #FF8000">#FF8000</font>
highlight.default => <font style="color: #0000BB">#0000BB</font> =>
<font style="color: #0000BB">#0000BB</font>
highlight.html => <font style="color: #000000">#000000</font> =>
<font style="color: #000000">#000000</font>
highlight.keyword => <font style="color: #007700">#007700</font> =>
<font style="color: #007700">#007700</font>
highlight.string => <font style="color: #DD0000">#DD0000</font> =>
<font style="color: #DD0000">#DD0000</font>
html_errors => Off => Off
ignore_repeated_errors => Off => Off
ignore_repeated_source => Off => Off
ignore_user_abort => Off => Off
implicit_flush => On => On
include_path => .:/php/includes:/usr/local/lib/php => .:/php/includes:/usr/local/lib/php
log_errors => Off => Off
log_errors_max_len => 1024 => 1024
magic_quotes_gpc => On => On
magic_quotes_runtime => Off => Off
magic_quotes_sybase => Off => Off
mail.force_extra_parameters => no value => no value
max_execution_time => 0 => 0
max_input_nesting_level => 64 => 64
max_input_time => -1 => -1
memory_limit => 64M => 64M
open_basedir => no value => no value
output_buffering => 0 => 0
output_handler => no value => no value
post_max_size => 8M => 8M
precision => 12 => 12
realpath_cache_size => 16K => 16K
realpath_cache_ttl => 120 => 120
register_argc_argv => On => On
register_globals => Off => Off
register_long_arrays => On => On
report_memleaks => On => On
report_zend_debug => Off => Off
safe_mode => Off => Off
safe_mode_exec_dir => no value => no value
safe_mode_gid => Off => Off
safe_mode_include_dir => no value => no value
sendmail_from => no value => no value
sendmail_path => /usr/sbin/sendmail -t -i => /usr/sbin/sendmail -t -i
serialize_precision => 100 => 100
short_open_tag => On => On
SMTP => localhost => localhost
smtp_port => 25 => 25
sql.safe_mode => Off => Off
track_errors => Off => Off
unserialize_callback_func => no value => no value
upload_max_filesize => 64M => 64M
upload_tmp_dir => no value => no value
user_dir => no value => no value
variables_order => GPCES => GPCES
xmlrpc_error_number => 0 => 0
xmlrpc_errors => Off => Off
y2k_compliance => On => On
zend.ze1_compatibility_mode => Off => Off
ctype
ctype functions => enabled
curl
cURL support => enabled
cURL Information => libcurl/7.13.1 OpenSSL/0.9.7i zlib/1.2.3
date
date/time support => enabled
"Olson" Timezone Database Version => 2007.5
Timezone Database => internal
Default timezone => America/Los_Angeles
Directive => Local Value => Master Value
date.default_latitude => 31.7667 => 31.7667
date.default_longitude => 35.2333 => 35.2333
date.sunrise_zenith => 90.583333 => 90.583333
date.sunset_zenith => 90.583333 => 90.583333
date.timezone => no value => no value
dom
DOM/XML => enabled
DOM/XML API Version => 20031129
libxml Version => 2.6.16
HTML Support => enabled
XPath Support => enabled
XPointer Support => enabled
Schema Support => enabled
RelaxNG Support => enabled
exif
EXIF Support => enabled
EXIF Version => 1.4 $Id: exif.c,v 1.173.2.5.2.20 2007/06/10 20:12:45 iliaa Exp $
Supported EXIF Version => 0220
Supported filetypes => JPEG,TIFF
filter
Input Validation and Filtering => enabled
Revision => $Revision: 1.52.2.39 $
Directive => Local Value => Master Value
filter.default => unsafe_raw => unsafe_raw
filter.default_flags => no value => no value
ftp
FTP support => enabled
gd
GD Support => enabled
GD Version => bundled (2.0.34 compatible)
GIF Read Support => enabled
GIF Create Support => enabled
JPG Support => enabled
PNG Support => enabled
WBMP Support => enabled
XBM Support => enabled
hash
hash support => enabled
Hashing Engines => md2 md4 md5 sha1 sha256 sha384 sha512 ripemd128 ripemd160 ripemd256 ripemd320
whirlpool tiger128,3 tiger160,3 tiger192,3 tiger128,4 tiger160,4 tiger192,4 snefru gost adler32
crc32 crc32b haval128,3 haval160,3 haval192,3 haval224,3 haval256,3 haval128,4 haval160,4 haval192,4
haval224,4 haval256,4 haval128,5 haval160,5 haval192,5 haval224,5 haval256,5
iconv
iconv support => enabled
iconv implementation => libiconv
iconv library version => 1.9
Directive => Local Value => Master Value
iconv.input_encoding => ISO-8859-1 => ISO-8859-1
iconv.internal_encoding => ISO-8859-1 => ISO-8859-1
iconv.output_encoding => ISO-8859-1 => ISO-8859-1
json
json support => enabled
json version => 1.2.1
ldap
LDAP Support => enabled
RCS Version => $Id: ldap.c,v 1.161.2.3.2.5 2007/04/30 21:40:02 tony2001 Exp $
Total Links => 0/unlimited
API Version => 3001
Vendor Name => OpenLDAP
Vendor Version => 20219
libxml
libXML support => active
libXML Version => 2.6.16
libXML streams => enabled
mbstring
Multibyte Support => enabled
Multibyte string engine => libmbfl
Multibyte (japanese) regex support => enabled
Multibyte regex (oniguruma) version => 4.4.4
Multibyte regex (oniguruma) backtrack check => On
mbstring extension makes use of "streamable kanji code filter and converter", which is
distributed under the GNU Lesser General Public License version 2.1.
Directive => Local Value => Master Value
mbstring.detect_order => no value => no value
mbstring.encoding_translation => Off => Off
mbstring.func_overload => 0 => 0
mbstring.http_input => pass => pass
mbstring.http_output => pass => pass
mbstring.internal_encoding => ISO-8859-1 => no value
mbstring.language => neutral => neutral
mbstring.strict_detection => Off => Off
mbstring.substitute_character => no value => no value
mysql
MySQL Support => enabled
Active Persistent Links => 0
Active Links => 0
Client API version => 4.0.21
MYSQL_MODULE_TYPE => external
MYSQL_SOCKET => /tmp/mysql.sock
MYSQL_INCLUDE => -I/library/mysql/include/mysql
MYSQL_LIBS => -L/library/mysql/lib/mysql -lmysqlclient
Directive => Local Value => Master Value
mysql.allow_persistent => On => On
mysql.connect_timeout => 60 => 60
mysql.default_host => no value => no value
mysql.default_password => no value => no value
mysql.default_port => no value => no value
mysql.default_socket => /tmp/mysql.sock => /tmp/mysql.sock
mysql.default_user => no value => no value
mysql.max_links => Unlimited => Unlimited
mysql.max_persistent => Unlimited => Unlimited
mysql.trace_mode => Off => Off
odbc
ODBC Support => enabled
Active Persistent Links => 0
Active Links => 0
ODBC library => iodbc
ODBC_INCLUDE => -I/usr/include
ODBC_LFLAGS => -L/usr/lib
ODBC_LIBS => -liodbc
Directive => Local Value => Master Value
odbc.allow_persistent => On => On
odbc.check_persistent => On => On
odbc.default_db => no value => no value
odbc.default_pw => no value => no value
odbc.default_user => no value => no value
odbc.defaultbinmode => return as is => return as is
odbc.defaultlrl => return up to 4096 bytes => return up to 4096 bytes
odbc.max_links => Unlimited => Unlimited
odbc.max_persistent => Unlimited => Unlimited
pcre
PCRE (Perl Compatible Regular Expressions) Support => enabled
PCRE Library Version => 7.2 2007-06-19
Directive => Local Value => Master Value
pcre.backtrack_limit => 100000 => 100000
pcre.recursion_limit => 100000 => 100000
PDO
PDO support => enabled
PDO drivers => sqlite2, sqlite
pdo_sqlite
PDO Driver for SQLite 3.x => enabled
PECL Module version => (bundled) 1.0.1 $Id: pdo_sqlite.c,v 1.10.2.6.2.2 2007/03/23 14:30:00 wez
Exp $
SQLite Library => 3.3.17
pgsql
PostgreSQL Support => enabled
PostgreSQL(libpq) Version => 8.1.4
Multibyte character support => enabled
SSL support => disabled
Active Persistent Links => 0
Active Links => 0
Directive => Local Value => Master Value
pgsql.allow_persistent => On => On
pgsql.auto_reset_persistent => Off => Off
pgsql.ignore_notice => Off => Off
pgsql.log_notice => Off => Off
pgsql.max_links => Unlimited => Unlimited
pgsql.max_persistent => Unlimited => Unlimited
posix
Revision => $Revision: 1.70.2.3.2.15 $
Reflection
Reflection => enabled
Version => $Id: php_reflection.c,v 1.164.2.33.2.39 2007/05/29 08:44:05 helly Exp $
session
Session Support => enabled
Registered save handlers => files user sqlite
Registered serializer handlers => php php_binary
Directive => Local Value => Master Value
session.auto_start => Off => Off
session.bug_compat_42 => On => On
session.bug_compat_warn => On => On
session.cache_expire => 180 => 180
session.cache_limiter => nocache => nocache
session.cookie_domain => no value => no value
session.cookie_httponly => Off => Off
session.cookie_lifetime => 0 => 0
session.cookie_path => / => /
session.cookie_secure => Off => Off
session.entropy_file => no value => no value
session.entropy_length => 0 => 0
session.gc_divisor => 100 => 100
session.gc_maxlifetime => 1440 => 1440
session.gc_probability => 1 => 1
session.hash_bits_per_character => 4 => 4
session.hash_function => 0 => 0
session.name => PHPSESSID => PHPSESSID
session.referer_check => no value => no value
session.save_handler => files => files
session.save_path => no value => no value
session.serialize_handler => php => php
session.use_cookies => On => On
session.use_only_cookies => Off => Off
session.use_trans_sid => 0 => 0
SimpleXML
Simplexml support => enabled
Revision => $Revision: 1.151.2.22.2.29 $
Schema support => enabled
sockets
Sockets Support => enabled
SPL
SPL support => enabled
Interfaces => Countable, OuterIterator, RecursiveIterator, SeekableIterator, SplObserver,
SplSubject
Classes => AppendIterator, ArrayIterator, ArrayObject, BadFunctionCallException,
BadMethodCallException, CachingIterator, DirectoryIterator, DomainException, EmptyIterator,
FilterIterator, InfiniteIterator, InvalidArgumentException, IteratorIterator, LengthException,
LimitIterator, LogicException, NoRewindIterator, OutOfBoundsException, OutOfRangeException,
OverflowException, ParentIterator, RangeException, RecursiveArrayIterator, RecursiveCachingIterator,
RecursiveDirectoryIterator, RecursiveFilterIterator, RecursiveIteratorIterator,
RecursiveRegexIterator, RegexIterator, RuntimeException, SimpleXMLIterator, SplFileInfo,
SplFileObject, SplObjectStorage, SplTempFileObject, UnderflowException, UnexpectedValueException
SQLite
SQLite support => enabled
PECL Module version => 2.0-dev $Id: sqlite.c,v 1.166.2.13.2.9 2007/05/19 17:58:22 iliaa Exp $
SQLite Library => 2.8.17
SQLite Encoding => iso8859
Directive => Local Value => Master Value
sqlite.assoc_case => 0 => 0
standard
Regex Library => Bundled library enabled
Dynamic Library Support => enabled
Path to sendmail => /usr/sbin/sendmail -t -i
Directive => Local Value => Master Value
assert.active => 1 => 1
assert.bail => 0 => 0
assert.callback => no value => no value
assert.quiet_eval => 0 => 0
assert.warning => 1 => 1
auto_detect_line_endings => 0 => 0
default_socket_timeout => 60 => 60
safe_mode_allowed_env_vars => PHP_ => PHP_
safe_mode_protected_env_vars => LD_LIBRARY_PATH => LD_LIBRARY_PATH
url_rewriter.tags => a=href,area=href,frame=src,input=src,form=,fieldset= =>
a=href,area=href,frame=src,input=src,form=,fieldset=
user_agent => no value => no value
tokenizer
Tokenizer Support => enabled
xml
XML Support => active
XML Namespace Support => active
libxml2 Version => 2.6.16
xmlreader
XMLReader => enabled
xmlwriter
XMLWriter => enabled
xsl
XSL => enabled
libxslt Version => 1.1.11
libxslt compiled against libxml Version => 2.6.16
EXSLT => enabled
libexslt Version => 1.1.11
zlib
ZLib Support => enabled
Stream Wrapper support => compress.zlib://
Stream Filter support => zlib.inflate, zlib.deflate
Compiled Version => 1.2.2
Linked Version => 1.2.3
Directive => Local Value => Master Value
zlib.output_compression => Off => Off
zlib.output_compression_level => -1 => -1
zlib.output_handler => no value => no value
Additional Modules
Module Name
Environment
Variable => Value
TEST_PHP_SRCDIR => /usr/local/php5.2-200706280430
SHELL => /bin/sh
TERM => xterm
MAKEFLAGS =>
SSH_CLIENT => deleted
SSH_TTY => deleted
USER => root
SUDO_USER => administrator
SUDO_UID => 501
SSH_AUTH_SOCK => deleted
__CF_USER_TEXT_ENCODING => 0x0:0:0
MAKELEVEL => 1
MFLAGS =>
PATH =>
/bin:/sbin:/usr/bin:/usr/sbin:/usr/local/apache/sbin:/usr/local/mysql/bin:/usr/local/apache/sbin:/usr/local/mysql/bin:/usr/local/apache/sbin:/usr/local/mysql/bin
MAIL => /var/mail/vinylstreet
_ => /usr/local/php5.2-200706280430/sapi/cli/php
PWD => /usr/local/php5.2-200706280430
TEST_PHP_EXECUTABLE => /usr/local/php5.2-200706280430/sapi/cli/php
SUDO_COMMAND => /usr/bin/make test
HOME => /Users/administrator
SHLVL => 4
LOGNAME => root
SSH_CONNECTION => deleted
SUDO_GID => 501
CC => gcc
PHP Variables
Variable => Value
_SERVER["TEST_PHP_SRCDIR"] => /usr/local/php5.2-200706280430
_SERVER["SHELL"] => /bin/sh
_SERVER["TERM"] => xterm
_SERVER["MAKEFLAGS"] =>
_SERVER["SSH_CLIENT"] => deleted
_SERVER["SSH_TTY"] => deleted
_SERVER["USER"] => root
_SERVER["SUDO_USER"] => administrator
_SERVER["SUDO_UID"] => 501
_SERVER["SSH_AUTH_SOCK"] => deleted
_SERVER["__CF_USER_TEXT_ENCODING"] => 0x0:0:0
_SERVER["MAKELEVEL"] => 1
_SERVER["MFLAGS"] =>
_SERVER["PATH"] =>
/bin:/sbin:/usr/bin:/usr/sbin:/usr/local/apache/sbin:/usr/local/mysql/bin:/usr/local/apache/sbin:/usr/local/mysql/bin:/usr/local/apache/sbin:/usr/local/mysql/bin
_SERVER["MAIL"] => /var/mail/vinylstreet
_SERVER["_"] => /usr/local/php5.2-200706280430/sapi/cli/php
_SERVER["PWD"] => /usr/local/php5.2-200706280430
_SERVER["TEST_PHP_EXECUTABLE"] => /usr/local/php5.2-200706280430/sapi/cli/php
_SERVER["SUDO_COMMAND"] => /usr/bin/make test
_SERVER["HOME"] => /Users/administrator
_SERVER["SHLVL"] => 4
_SERVER["LOGNAME"] => root
_SERVER["SSH_CONNECTION"] => deleted
_SERVER["SUDO_GID"] => 501
_SERVER["CC"] => gcc
_SERVER["PHP_SELF"] =>
_SERVER["SCRIPT_NAME"] =>
_SERVER["SCRIPT_FILENAME"] =>
_SERVER["PATH_TRANSLATED"] =>
_SERVER["DOCUMENT_ROOT"] =>
_SERVER["REQUEST_TIME"] => 1183014344
_SERVER["argv"] => Array
(
)
_SERVER["argc"] => 0
_ENV["TEST_PHP_SRCDIR"] => /usr/local/php5.2-200706280430
_ENV["SHELL"] => /bin/sh
_ENV["TERM"] => xterm
_ENV["MAKEFLAGS"] =>
_ENV["SSH_CLIENT"] => deleted
_ENV["SSH_TTY"] => deleted
_ENV["USER"] => root
_ENV["SUDO_USER"] => administrator
_ENV["SUDO_UID"] => 501
_ENV["SSH_AUTH_SOCK"] => deleted
_ENV["__CF_USER_TEXT_ENCODING"] => 0x0:0:0
_ENV["MAKELEVEL"] => 1
_ENV["MFLAGS"] =>
_ENV["PATH"] =>
/bin:/sbin:/usr/bin:/usr/sbin:/usr/local/apache/sbin:/usr/local/mysql/bin:/usr/local/apache/sbin:/usr/local/mysql/bin:/usr/local/apache/sbin:/usr/local/mysql/bin
_ENV["MAIL"] => /var/mail/vinylstreet
_ENV["_"] => /usr/local/php5.2-200706280430/sapi/cli/php
_ENV["PWD"] => /usr/local/php5.2-200706280430
_ENV["TEST_PHP_EXECUTABLE"] => /usr/local/php5.2-200706280430/sapi/cli/php
_ENV["SUDO_COMMAND"] => /usr/bin/make test
_ENV["HOME"] => /Users/administrator
_ENV["SHLVL"] => 4
_ENV["LOGNAME"] => root
_ENV["SSH_CONNECTION"] => deleted
_ENV["SUDO_GID"] => 501
_ENV["CC"] => gcc
PHP License
This program is free software; you can redistribute it and/or modify
it under the terms of the PHP License as published by the PHP Group
and included in the distribution in the file: LICENSE
This program is distributed in the hope that it will be useful,
but WITHOUT ANY WARRANTY; without even the implied warranty of
MERCHANTABILITY or FITNESS FOR A PARTICULAR PURPOSE.
If you did not receive a copy of the PHP license, or have any
questions about PHP licensing, please contact license@php.net.