Test results for 5.2.3 [failed]
| From: | noreply@php.net | Date: | Mon, 16 Jul 2007 19:27:02 +0000 |
| Subject: | Test results for 5.2.3 [failed] | ||
| Groups: | php.qa | ||
| Request: | Send a blank email to php-qa+get-40172@lists.php.net to get a copy of this message | ||
=====================================================================
FAILED TEST SUMMARY
---------------------------------------------------------------------
Bug #23584 (error line numbers off by one when using #!php) [tests/lang/bug23584.phpt]
double to string conversion tests [Zend/tests/double_to_string.phpt]
Bug #16069 (ICONV transliteration failure) [ext/iconv/tests/bug16069.phpt]
iconv stream filter [ext/iconv/tests/iconv_stream_filter.phpt]
via [ext/pdo_sqlite/tests/common.phpt]
SQLite PDO Common: Bug #34630 (inserting streams as LOBs) [ext/pdo_sqlite/tests/bug_34630.phpt]
via [ext/pdo_sqlite/tests/common.phpt]
SQLite PDO Common: Bug #34687 (query doesn't return error information)
[ext/pdo_sqlite/tests/bug_34687.phpt]
via [ext/pdo_sqlite/tests/common.phpt]
SQLite PDO Common: Bug #35671 (binding by name breakage) [ext/pdo_sqlite/tests/bug_35671.phpt]
via [ext/pdo_sqlite/tests/common.phpt]
SQLite PDO Common: Bug #36428 (Incorrect error message for PDO::fetchAll())
[ext/pdo_sqlite/tests/bug_36428.phpt]
via [ext/pdo_sqlite/tests/common.phpt]
SQLite PDO Common: Bug #36798 (Error parsing named parameters with queries containing high-ascii
chars) [ext/pdo_sqlite/tests/bug_36798.phpt]
via [ext/pdo_sqlite/tests/common.phpt]
SQLite PDO Common: Bug #38253 (PDO produces segfault with default fetch mode)
[ext/pdo_sqlite/tests/bug_38253.phpt]
via [ext/pdo_sqlite/tests/common.phpt]
SQLite PDO Common: Bug #38394 (Prepared statement error stops subsequent statements)
[ext/pdo_sqlite/tests/bug_38394.phpt]
via [ext/pdo_sqlite/tests/common.phpt]
SQLite PDO Common: Bug #39398 (Booleans are not automatically translated to integers)
[ext/pdo_sqlite/tests/bug_39398.phpt]
via [ext/pdo_sqlite/tests/common.phpt]
SQLite PDO Common: Bug #39656 (Crash when calling fetch() on a PDO statment object after
closeCursor()) [ext/pdo_sqlite/tests/bug_39656.phpt]
via [ext/pdo_sqlite/tests/common.phpt]
SQLite PDO Common: Bug #40285 (The prepare parser goes into an infinite loop on ': or ":)
[ext/pdo_sqlite/tests/bug_40285.phpt]
via [ext/pdo_sqlite/tests/common.phpt]
SQLite PDO Common: PDO::FETCH_ASSOC [ext/pdo_sqlite/tests/pdo_001.phpt]
via [ext/pdo_sqlite/tests/common.phpt]
SQLite PDO Common: PDO::FETCH_NUM [ext/pdo_sqlite/tests/pdo_002.phpt]
via [ext/pdo_sqlite/tests/common.phpt]
SQLite PDO Common: PDO::FETCH_BOTH [ext/pdo_sqlite/tests/pdo_003.phpt]
via [ext/pdo_sqlite/tests/common.phpt]
SQLite PDO Common: PDO::FETCH_OBJ [ext/pdo_sqlite/tests/pdo_004.phpt]
via [ext/pdo_sqlite/tests/common.phpt]
SQLite PDO Common: PDO::FETCH_CLASS [ext/pdo_sqlite/tests/pdo_005.phpt]
via [ext/pdo_sqlite/tests/common.phpt]
SQLite PDO Common: PDO::FETCH_GROUP [ext/pdo_sqlite/tests/pdo_006.phpt]
via [ext/pdo_sqlite/tests/common.phpt]
SQLite PDO Common: PDO::FETCH_UNIQUE [ext/pdo_sqlite/tests/pdo_007.phpt]
via [ext/pdo_sqlite/tests/common.phpt]
SQLite PDO Common: PDO::FETCH_UNIQUE conflict [ext/pdo_sqlite/tests/pdo_008.phpt]
via [ext/pdo_sqlite/tests/common.phpt]
SQLite PDO Common: PDO::FETCH_CLASSTYPE [ext/pdo_sqlite/tests/pdo_009.phpt]
via [ext/pdo_sqlite/tests/common.phpt]
SQLite PDO Common: PDO::FETCH_CLASSTYPE and GROUP/UNIQUE [ext/pdo_sqlite/tests/pdo_010.phpt]
via [ext/pdo_sqlite/tests/common.phpt]
SQLite PDO Common: PDO::FETCH_FUNC and statement overloading [ext/pdo_sqlite/tests/pdo_011.phpt]
via [ext/pdo_sqlite/tests/common.phpt]
SQLite PDO Common: PDOStatement::setFetchMode [ext/pdo_sqlite/tests/pdo_012.phpt]
via [ext/pdo_sqlite/tests/common.phpt]
SQLite PDO Common: PDOStatement iterator [ext/pdo_sqlite/tests/pdo_013.phpt]
via [ext/pdo_sqlite/tests/common.phpt]
SQLite PDO Common: PDOStatement SPL iterator [ext/pdo_sqlite/tests/pdo_014.phpt]
via [ext/pdo_sqlite/tests/common.phpt]
SQLite PDO Common: PDO::FETCH_COLUMN [ext/pdo_sqlite/tests/pdo_015.phpt]
via [ext/pdo_sqlite/tests/common.phpt]
SQLite PDO Common: PDO::FETCH_BOUND [ext/pdo_sqlite/tests/pdo_016.phpt]
via [ext/pdo_sqlite/tests/common.phpt]
SQLite PDO Common: PDO::FETCH_BOUND w/o : [ext/pdo_sqlite/tests/pdo_016a.phpt]
via [ext/pdo_sqlite/tests/common.phpt]
SQLite PDO Common: transactions [ext/pdo_sqlite/tests/pdo_017.phpt]
via [ext/pdo_sqlite/tests/common.phpt]
SQLite PDO Common: serializing [ext/pdo_sqlite/tests/pdo_018.phpt]
via [ext/pdo_sqlite/tests/common.phpt]
SQLite PDO Common: fetch() and while() [ext/pdo_sqlite/tests/pdo_019.phpt]
via [ext/pdo_sqlite/tests/common.phpt]
SQLite PDO Common: PDOStatement::columnCount [ext/pdo_sqlite/tests/pdo_020.phpt]
via [ext/pdo_sqlite/tests/common.phpt]
SQLite PDO Common: PDOStatement::execute with parameters [ext/pdo_sqlite/tests/pdo_021.phpt]
via [ext/pdo_sqlite/tests/common.phpt]
SQLite PDO Common: extending PDO [ext/pdo_sqlite/tests/pdo_023.phpt]
via [ext/pdo_sqlite/tests/common.phpt]
SQLite PDO Common: assert that bindParam does not modify parameter
[ext/pdo_sqlite/tests/pdo_024.phpt]
via [ext/pdo_sqlite/tests/common.phpt]
SQLite PDO Common: PDO::FETCH_INTO [ext/pdo_sqlite/tests/pdo_025.phpt]
via [ext/pdo_sqlite/tests/common.phpt]
SQLite PDO Common: extending PDO (2) [ext/pdo_sqlite/tests/pdo_026.phpt]
via [ext/pdo_sqlite/tests/common.phpt]
SQLite PDO Common: PDO::FETCH_LAZY [ext/pdo_sqlite/tests/pdo_027.phpt]
via [ext/pdo_sqlite/tests/common.phpt]
SQLite PDO Common: bindValue [ext/pdo_sqlite/tests/pdo_028.phpt]
via [ext/pdo_sqlite/tests/common.phpt]
SQLite PDO Common: extending PDO (3) [ext/pdo_sqlite/tests/pdo_029.phpt]
via [ext/pdo_sqlite/tests/common.phpt]
SQLite PDO Common: extending PDO (4) [ext/pdo_sqlite/tests/pdo_030.phpt]
via [ext/pdo_sqlite/tests/common.phpt]
SQLite PDO Common: PDOStatement SPL iterator [ext/pdo_sqlite/tests/pdo_031.phpt]
via [ext/pdo_sqlite/tests/common.phpt]
SQLite PDO Common: PDO::ATTR_CASE [ext/pdo_sqlite/tests/pdo_032.phpt]
via [ext/pdo_sqlite/tests/common.phpt]
SQLite PDO Common: PDO::quote() [ext/pdo_sqlite/tests/pdo_033.phpt]
via [ext/pdo_sqlite/tests/common.phpt]
SQLite PDO Common: PDO::FETCH_KEY_PAIR fetch mode test [ext/pdo_sqlite/tests/pdo_034.phpt]
via [ext/pdo_sqlite/tests/common.phpt]
SQLite PDO Common: PECL Bug #5217 (serialize/unserialze safety)
[ext/pdo_sqlite/tests/pecl_bug_5217.phpt]
via [ext/pdo_sqlite/tests/common.phpt]
SQLite PDO Common: PECL Bug #5772 (PDO::FETCH_FUNC breaks on mixed case func name)
[ext/pdo_sqlite/tests/pecl_bug_5772.phpt]
via [ext/pdo_sqlite/tests/common.phpt]
SQLite PDO Common: PECL Bug #5809 (PDOStatement::execute(array()) changes param)
[ext/pdo_sqlite/tests/pecl_bug_5809.phpt]
via [ext/sqlite/tests/pdo/common.phpt]
SQLite2 PDO Common: Bug #34630 (inserting streams as LOBs) [ext/sqlite/tests/pdo/bug_34630.phpt]
via [ext/sqlite/tests/pdo/common.phpt]
SQLite2 PDO Common: Bug #34687 (query doesn't return error information)
[ext/sqlite/tests/pdo/bug_34687.phpt]
via [ext/sqlite/tests/pdo/common.phpt]
SQLite2 PDO Common: Bug #35671 (binding by name breakage) [ext/sqlite/tests/pdo/bug_35671.phpt]
via [ext/sqlite/tests/pdo/common.phpt]
SQLite2 PDO Common: Bug #36428 (Incorrect error message for PDO::fetchAll())
[ext/sqlite/tests/pdo/bug_36428.phpt]
via [ext/sqlite/tests/pdo/common.phpt]
SQLite2 PDO Common: Bug #36798 (Error parsing named parameters with queries containing high-ascii
chars) [ext/sqlite/tests/pdo/bug_36798.phpt]
via [ext/sqlite/tests/pdo/common.phpt]
SQLite2 PDO Common: Bug #38253 (PDO produces segfault with default fetch mode)
[ext/sqlite/tests/pdo/bug_38253.phpt]
via [ext/sqlite/tests/pdo/common.phpt]
SQLite2 PDO Common: Bug #39398 (Booleans are not automatically translated to integers)
[ext/sqlite/tests/pdo/bug_39398.phpt]
via [ext/sqlite/tests/pdo/common.phpt]
SQLite2 PDO Common: Bug #39656 (Crash when calling fetch() on a PDO statment object after
closeCursor()) [ext/sqlite/tests/pdo/bug_39656.phpt]
via [ext/sqlite/tests/pdo/common.phpt]
SQLite2 PDO Common: Bug #40285 (The prepare parser goes into an infinite loop on ': or
":) [ext/sqlite/tests/pdo/bug_40285.phpt]
via [ext/sqlite/tests/pdo/common.phpt]
SQLite2 PDO Common: PDO::FETCH_ASSOC [ext/sqlite/tests/pdo/pdo_001.phpt]
via [ext/sqlite/tests/pdo/common.phpt]
SQLite2 PDO Common: PDO::FETCH_NUM [ext/sqlite/tests/pdo/pdo_002.phpt]
via [ext/sqlite/tests/pdo/common.phpt]
SQLite2 PDO Common: PDO::FETCH_BOTH [ext/sqlite/tests/pdo/pdo_003.phpt]
via [ext/sqlite/tests/pdo/common.phpt]
SQLite2 PDO Common: PDO::FETCH_OBJ [ext/sqlite/tests/pdo/pdo_004.phpt]
via [ext/sqlite/tests/pdo/common.phpt]
SQLite2 PDO Common: PDO::FETCH_CLASS [ext/sqlite/tests/pdo/pdo_005.phpt]
via [ext/sqlite/tests/pdo/common.phpt]
SQLite2 PDO Common: PDO::FETCH_GROUP [ext/sqlite/tests/pdo/pdo_006.phpt]
via [ext/sqlite/tests/pdo/common.phpt]
SQLite2 PDO Common: PDO::FETCH_UNIQUE [ext/sqlite/tests/pdo/pdo_007.phpt]
via [ext/sqlite/tests/pdo/common.phpt]
SQLite2 PDO Common: PDO::FETCH_UNIQUE conflict [ext/sqlite/tests/pdo/pdo_008.phpt]
via [ext/sqlite/tests/pdo/common.phpt]
SQLite2 PDO Common: PDO::FETCH_CLASSTYPE [ext/sqlite/tests/pdo/pdo_009.phpt]
via [ext/sqlite/tests/pdo/common.phpt]
SQLite2 PDO Common: PDO::FETCH_CLASSTYPE and GROUP/UNIQUE [ext/sqlite/tests/pdo/pdo_010.phpt]
via [ext/sqlite/tests/pdo/common.phpt]
SQLite2 PDO Common: PDO::FETCH_FUNC and statement overloading [ext/sqlite/tests/pdo/pdo_011.phpt]
via [ext/sqlite/tests/pdo/common.phpt]
SQLite2 PDO Common: PDOStatement::setFetchMode [ext/sqlite/tests/pdo/pdo_012.phpt]
via [ext/sqlite/tests/pdo/common.phpt]
SQLite2 PDO Common: PDOStatement iterator [ext/sqlite/tests/pdo/pdo_013.phpt]
via [ext/sqlite/tests/pdo/common.phpt]
SQLite2 PDO Common: PDOStatement SPL iterator [ext/sqlite/tests/pdo/pdo_014.phpt]
via [ext/sqlite/tests/pdo/common.phpt]
SQLite2 PDO Common: PDO::FETCH_COLUMN [ext/sqlite/tests/pdo/pdo_015.phpt]
via [ext/sqlite/tests/pdo/common.phpt]
SQLite2 PDO Common: PDO::FETCH_BOUND [ext/sqlite/tests/pdo/pdo_016.phpt]
via [ext/sqlite/tests/pdo/common.phpt]
SQLite2 PDO Common: PDO::FETCH_BOUND w/o : [ext/sqlite/tests/pdo/pdo_016a.phpt]
via [ext/sqlite/tests/pdo/common.phpt]
SQLite2 PDO Common: transactions [ext/sqlite/tests/pdo/pdo_017.phpt]
via [ext/sqlite/tests/pdo/common.phpt]
SQLite2 PDO Common: serializing [ext/sqlite/tests/pdo/pdo_018.phpt]
via [ext/sqlite/tests/pdo/common.phpt]
SQLite2 PDO Common: fetch() and while() [ext/sqlite/tests/pdo/pdo_019.phpt]
via [ext/sqlite/tests/pdo/common.phpt]
SQLite2 PDO Common: PDOStatement::columnCount [ext/sqlite/tests/pdo/pdo_020.phpt]
via [ext/sqlite/tests/pdo/common.phpt]
SQLite2 PDO Common: PDOStatement::execute with parameters [ext/sqlite/tests/pdo/pdo_021.phpt]
via [ext/sqlite/tests/pdo/common.phpt]
SQLite2 PDO Common: extending PDO [ext/sqlite/tests/pdo/pdo_023.phpt]
via [ext/sqlite/tests/pdo/common.phpt]
SQLite2 PDO Common: assert that bindParam does not modify parameter
[ext/sqlite/tests/pdo/pdo_024.phpt]
via [ext/sqlite/tests/pdo/common.phpt]
SQLite2 PDO Common: PDO::FETCH_INTO [ext/sqlite/tests/pdo/pdo_025.phpt]
via [ext/sqlite/tests/pdo/common.phpt]
SQLite2 PDO Common: extending PDO (2) [ext/sqlite/tests/pdo/pdo_026.phpt]
via [ext/sqlite/tests/pdo/common.phpt]
SQLite2 PDO Common: PDO::FETCH_LAZY [ext/sqlite/tests/pdo/pdo_027.phpt]
via [ext/sqlite/tests/pdo/common.phpt]
SQLite2 PDO Common: bindValue [ext/sqlite/tests/pdo/pdo_028.phpt]
via [ext/sqlite/tests/pdo/common.phpt]
SQLite2 PDO Common: extending PDO (3) [ext/sqlite/tests/pdo/pdo_029.phpt]
via [ext/sqlite/tests/pdo/common.phpt]
SQLite2 PDO Common: extending PDO (4) [ext/sqlite/tests/pdo/pdo_030.phpt]
via [ext/sqlite/tests/pdo/common.phpt]
SQLite2 PDO Common: PDOStatement SPL iterator [ext/sqlite/tests/pdo/pdo_031.phpt]
via [ext/sqlite/tests/pdo/common.phpt]
SQLite2 PDO Common: PDO::ATTR_CASE [ext/sqlite/tests/pdo/pdo_032.phpt]
via [ext/sqlite/tests/pdo/common.phpt]
SQLite2 PDO Common: PDO::quote() [ext/sqlite/tests/pdo/pdo_033.phpt]
via [ext/sqlite/tests/pdo/common.phpt]
SQLite2 PDO Common: PDO::FETCH_KEY_PAIR fetch mode test [ext/sqlite/tests/pdo/pdo_034.phpt]
via [ext/sqlite/tests/pdo/common.phpt]
SQLite2 PDO Common: PECL Bug #5217 (serialize/unserialze safety)
[ext/sqlite/tests/pdo/pecl_bug_5217.phpt]
via [ext/sqlite/tests/pdo/common.phpt]
SQLite2 PDO Common: PECL Bug #5772 (PDO::FETCH_FUNC breaks on mixed case func name)
[ext/sqlite/tests/pdo/pecl_bug_5772.phpt]
via [ext/sqlite/tests/pdo/common.phpt]
SQLite2 PDO Common: PECL Bug #5809 (PDOStatement::execute(array()) changes param)
[ext/sqlite/tests/pdo/pecl_bug_5809.phpt]
strripos() offset integer overflow [ext/standard/tests/strings/strripos_offset.phpt]
=====================================================================
=====================================================================
TEST RESULT SUMMARY
---------------------------------------------------------------------
Exts skipped : 55
Exts tested : 25
---------------------------------------------------------------------
Number of tests : 3345 2008
Tests skipped : 1337 ( 40.0%) --------
Tests warned : 0 ( 0.0%) ( 0.0%)
Tests failed : 98 ( 2.9%) ( 4.9%)
Tests passed : 1910 ( 57.1%) ( 95.1%)
---------------------------------------------------------------------
Time taken : 69 seconds
=====================================================================
=====================================================================
FAILED TEST SUMMARY
---------------------------------------------------------------------
Bug #23584 (error line numbers off by one when using #!php) [tests/lang/bug23584.phpt]
double to string conversion tests [Zend/tests/double_to_string.phpt]
Bug #16069 (ICONV transliteration failure) [ext/iconv/tests/bug16069.phpt]
iconv stream filter [ext/iconv/tests/iconv_stream_filter.phpt]
via [ext/pdo_sqlite/tests/common.phpt]
SQLite PDO Common: Bug #34630 (inserting streams as LOBs) [ext/pdo_sqlite/tests/bug_34630.phpt]
via [ext/pdo_sqlite/tests/common.phpt]
SQLite PDO Common: Bug #34687 (query doesn't return error information)
[ext/pdo_sqlite/tests/bug_34687.phpt]
via [ext/pdo_sqlite/tests/common.phpt]
SQLite PDO Common: Bug #35671 (binding by name breakage) [ext/pdo_sqlite/tests/bug_35671.phpt]
via [ext/pdo_sqlite/tests/common.phpt]
SQLite PDO Common: Bug #36428 (Incorrect error message for PDO::fetchAll())
[ext/pdo_sqlite/tests/bug_36428.phpt]
via [ext/pdo_sqlite/tests/common.phpt]
SQLite PDO Common: Bug #36798 (Error parsing named parameters with queries containing high-ascii
chars) [ext/pdo_sqlite/tests/bug_36798.phpt]
via [ext/pdo_sqlite/tests/common.phpt]
SQLite PDO Common: Bug #38253 (PDO produces segfault with default fetch mode)
[ext/pdo_sqlite/tests/bug_38253.phpt]
via [ext/pdo_sqlite/tests/common.phpt]
SQLite PDO Common: Bug #38394 (Prepared statement error stops subsequent statements)
[ext/pdo_sqlite/tests/bug_38394.phpt]
via [ext/pdo_sqlite/tests/common.phpt]
SQLite PDO Common: Bug #39398 (Booleans are not automatically translated to integers)
[ext/pdo_sqlite/tests/bug_39398.phpt]
via [ext/pdo_sqlite/tests/common.phpt]
SQLite PDO Common: Bug #39656 (Crash when calling fetch() on a PDO statment object after
closeCursor()) [ext/pdo_sqlite/tests/bug_39656.phpt]
via [ext/pdo_sqlite/tests/common.phpt]
SQLite PDO Common: Bug #40285 (The prepare parser goes into an infinite loop on ': or ":)
[ext/pdo_sqlite/tests/bug_40285.phpt]
via [ext/pdo_sqlite/tests/common.phpt]
SQLite PDO Common: PDO::FETCH_ASSOC [ext/pdo_sqlite/tests/pdo_001.phpt]
via [ext/pdo_sqlite/tests/common.phpt]
SQLite PDO Common: PDO::FETCH_NUM [ext/pdo_sqlite/tests/pdo_002.phpt]
via [ext/pdo_sqlite/tests/common.phpt]
SQLite PDO Common: PDO::FETCH_BOTH [ext/pdo_sqlite/tests/pdo_003.phpt]
via [ext/pdo_sqlite/tests/common.phpt]
SQLite PDO Common: PDO::FETCH_OBJ [ext/pdo_sqlite/tests/pdo_004.phpt]
via [ext/pdo_sqlite/tests/common.phpt]
SQLite PDO Common: PDO::FETCH_CLASS [ext/pdo_sqlite/tests/pdo_005.phpt]
via [ext/pdo_sqlite/tests/common.phpt]
SQLite PDO Common: PDO::FETCH_GROUP [ext/pdo_sqlite/tests/pdo_006.phpt]
via [ext/pdo_sqlite/tests/common.phpt]
SQLite PDO Common: PDO::FETCH_UNIQUE [ext/pdo_sqlite/tests/pdo_007.phpt]
via [ext/pdo_sqlite/tests/common.phpt]
SQLite PDO Common: PDO::FETCH_UNIQUE conflict [ext/pdo_sqlite/tests/pdo_008.phpt]
via [ext/pdo_sqlite/tests/common.phpt]
SQLite PDO Common: PDO::FETCH_CLASSTYPE [ext/pdo_sqlite/tests/pdo_009.phpt]
via [ext/pdo_sqlite/tests/common.phpt]
SQLite PDO Common: PDO::FETCH_CLASSTYPE and GROUP/UNIQUE [ext/pdo_sqlite/tests/pdo_010.phpt]
via [ext/pdo_sqlite/tests/common.phpt]
SQLite PDO Common: PDO::FETCH_FUNC and statement overloading [ext/pdo_sqlite/tests/pdo_011.phpt]
via [ext/pdo_sqlite/tests/common.phpt]
SQLite PDO Common: PDOStatement::setFetchMode [ext/pdo_sqlite/tests/pdo_012.phpt]
via [ext/pdo_sqlite/tests/common.phpt]
SQLite PDO Common: PDOStatement iterator [ext/pdo_sqlite/tests/pdo_013.phpt]
via [ext/pdo_sqlite/tests/common.phpt]
SQLite PDO Common: PDOStatement SPL iterator [ext/pdo_sqlite/tests/pdo_014.phpt]
via [ext/pdo_sqlite/tests/common.phpt]
SQLite PDO Common: PDO::FETCH_COLUMN [ext/pdo_sqlite/tests/pdo_015.phpt]
via [ext/pdo_sqlite/tests/common.phpt]
SQLite PDO Common: PDO::FETCH_BOUND [ext/pdo_sqlite/tests/pdo_016.phpt]
via [ext/pdo_sqlite/tests/common.phpt]
SQLite PDO Common: PDO::FETCH_BOUND w/o : [ext/pdo_sqlite/tests/pdo_016a.phpt]
via [ext/pdo_sqlite/tests/common.phpt]
SQLite PDO Common: transactions [ext/pdo_sqlite/tests/pdo_017.phpt]
via [ext/pdo_sqlite/tests/common.phpt]
SQLite PDO Common: serializing [ext/pdo_sqlite/tests/pdo_018.phpt]
via [ext/pdo_sqlite/tests/common.phpt]
SQLite PDO Common: fetch() and while() [ext/pdo_sqlite/tests/pdo_019.phpt]
via [ext/pdo_sqlite/tests/common.phpt]
SQLite PDO Common: PDOStatement::columnCount [ext/pdo_sqlite/tests/pdo_020.phpt]
via [ext/pdo_sqlite/tests/common.phpt]
SQLite PDO Common: PDOStatement::execute with parameters [ext/pdo_sqlite/tests/pdo_021.phpt]
via [ext/pdo_sqlite/tests/common.phpt]
SQLite PDO Common: extending PDO [ext/pdo_sqlite/tests/pdo_023.phpt]
via [ext/pdo_sqlite/tests/common.phpt]
SQLite PDO Common: assert that bindParam does not modify parameter
[ext/pdo_sqlite/tests/pdo_024.phpt]
via [ext/pdo_sqlite/tests/common.phpt]
SQLite PDO Common: PDO::FETCH_INTO [ext/pdo_sqlite/tests/pdo_025.phpt]
via [ext/pdo_sqlite/tests/common.phpt]
SQLite PDO Common: extending PDO (2) [ext/pdo_sqlite/tests/pdo_026.phpt]
via [ext/pdo_sqlite/tests/common.phpt]
SQLite PDO Common: PDO::FETCH_LAZY [ext/pdo_sqlite/tests/pdo_027.phpt]
via [ext/pdo_sqlite/tests/common.phpt]
SQLite PDO Common: bindValue [ext/pdo_sqlite/tests/pdo_028.phpt]
via [ext/pdo_sqlite/tests/common.phpt]
SQLite PDO Common: extending PDO (3) [ext/pdo_sqlite/tests/pdo_029.phpt]
via [ext/pdo_sqlite/tests/common.phpt]
SQLite PDO Common: extending PDO (4) [ext/pdo_sqlite/tests/pdo_030.phpt]
via [ext/pdo_sqlite/tests/common.phpt]
SQLite PDO Common: PDOStatement SPL iterator [ext/pdo_sqlite/tests/pdo_031.phpt]
via [ext/pdo_sqlite/tests/common.phpt]
SQLite PDO Common: PDO::ATTR_CASE [ext/pdo_sqlite/tests/pdo_032.phpt]
via [ext/pdo_sqlite/tests/common.phpt]
SQLite PDO Common: PDO::quote() [ext/pdo_sqlite/tests/pdo_033.phpt]
via [ext/pdo_sqlite/tests/common.phpt]
SQLite PDO Common: PDO::FETCH_KEY_PAIR fetch mode test [ext/pdo_sqlite/tests/pdo_034.phpt]
via [ext/pdo_sqlite/tests/common.phpt]
SQLite PDO Common: PECL Bug #5217 (serialize/unserialze safety)
[ext/pdo_sqlite/tests/pecl_bug_5217.phpt]
via [ext/pdo_sqlite/tests/common.phpt]
SQLite PDO Common: PECL Bug #5772 (PDO::FETCH_FUNC breaks on mixed case func name)
[ext/pdo_sqlite/tests/pecl_bug_5772.phpt]
via [ext/pdo_sqlite/tests/common.phpt]
SQLite PDO Common: PECL Bug #5809 (PDOStatement::execute(array()) changes param)
[ext/pdo_sqlite/tests/pecl_bug_5809.phpt]
via [ext/sqlite/tests/pdo/common.phpt]
SQLite2 PDO Common: Bug #34630 (inserting streams as LOBs) [ext/sqlite/tests/pdo/bug_34630.phpt]
via [ext/sqlite/tests/pdo/common.phpt]
SQLite2 PDO Common: Bug #34687 (query doesn't return error information)
[ext/sqlite/tests/pdo/bug_34687.phpt]
via [ext/sqlite/tests/pdo/common.phpt]
SQLite2 PDO Common: Bug #35671 (binding by name breakage) [ext/sqlite/tests/pdo/bug_35671.phpt]
via [ext/sqlite/tests/pdo/common.phpt]
SQLite2 PDO Common: Bug #36428 (Incorrect error message for PDO::fetchAll())
[ext/sqlite/tests/pdo/bug_36428.phpt]
via [ext/sqlite/tests/pdo/common.phpt]
SQLite2 PDO Common: Bug #36798 (Error parsing named parameters with queries containing high-ascii
chars) [ext/sqlite/tests/pdo/bug_36798.phpt]
via [ext/sqlite/tests/pdo/common.phpt]
SQLite2 PDO Common: Bug #38253 (PDO produces segfault with default fetch mode)
[ext/sqlite/tests/pdo/bug_38253.phpt]
via [ext/sqlite/tests/pdo/common.phpt]
SQLite2 PDO Common: Bug #39398 (Booleans are not automatically translated to integers)
[ext/sqlite/tests/pdo/bug_39398.phpt]
via [ext/sqlite/tests/pdo/common.phpt]
SQLite2 PDO Common: Bug #39656 (Crash when calling fetch() on a PDO statment object after
closeCursor()) [ext/sqlite/tests/pdo/bug_39656.phpt]
via [ext/sqlite/tests/pdo/common.phpt]
SQLite2 PDO Common: Bug #40285 (The prepare parser goes into an infinite loop on ': or
":) [ext/sqlite/tests/pdo/bug_40285.phpt]
via [ext/sqlite/tests/pdo/common.phpt]
SQLite2 PDO Common: PDO::FETCH_ASSOC [ext/sqlite/tests/pdo/pdo_001.phpt]
via [ext/sqlite/tests/pdo/common.phpt]
SQLite2 PDO Common: PDO::FETCH_NUM [ext/sqlite/tests/pdo/pdo_002.phpt]
via [ext/sqlite/tests/pdo/common.phpt]
SQLite2 PDO Common: PDO::FETCH_BOTH [ext/sqlite/tests/pdo/pdo_003.phpt]
via [ext/sqlite/tests/pdo/common.phpt]
SQLite2 PDO Common: PDO::FETCH_OBJ [ext/sqlite/tests/pdo/pdo_004.phpt]
via [ext/sqlite/tests/pdo/common.phpt]
SQLite2 PDO Common: PDO::FETCH_CLASS [ext/sqlite/tests/pdo/pdo_005.phpt]
via [ext/sqlite/tests/pdo/common.phpt]
SQLite2 PDO Common: PDO::FETCH_GROUP [ext/sqlite/tests/pdo/pdo_006.phpt]
via [ext/sqlite/tests/pdo/common.phpt]
SQLite2 PDO Common: PDO::FETCH_UNIQUE [ext/sqlite/tests/pdo/pdo_007.phpt]
via [ext/sqlite/tests/pdo/common.phpt]
SQLite2 PDO Common: PDO::FETCH_UNIQUE conflict [ext/sqlite/tests/pdo/pdo_008.phpt]
via [ext/sqlite/tests/pdo/common.phpt]
SQLite2 PDO Common: PDO::FETCH_CLASSTYPE [ext/sqlite/tests/pdo/pdo_009.phpt]
via [ext/sqlite/tests/pdo/common.phpt]
SQLite2 PDO Common: PDO::FETCH_CLASSTYPE and GROUP/UNIQUE [ext/sqlite/tests/pdo/pdo_010.phpt]
via [ext/sqlite/tests/pdo/common.phpt]
SQLite2 PDO Common: PDO::FETCH_FUNC and statement overloading [ext/sqlite/tests/pdo/pdo_011.phpt]
via [ext/sqlite/tests/pdo/common.phpt]
SQLite2 PDO Common: PDOStatement::setFetchMode [ext/sqlite/tests/pdo/pdo_012.phpt]
via [ext/sqlite/tests/pdo/common.phpt]
SQLite2 PDO Common: PDOStatement iterator [ext/sqlite/tests/pdo/pdo_013.phpt]
via [ext/sqlite/tests/pdo/common.phpt]
SQLite2 PDO Common: PDOStatement SPL iterator [ext/sqlite/tests/pdo/pdo_014.phpt]
via [ext/sqlite/tests/pdo/common.phpt]
SQLite2 PDO Common: PDO::FETCH_COLUMN [ext/sqlite/tests/pdo/pdo_015.phpt]
via [ext/sqlite/tests/pdo/common.phpt]
SQLite2 PDO Common: PDO::FETCH_BOUND [ext/sqlite/tests/pdo/pdo_016.phpt]
via [ext/sqlite/tests/pdo/common.phpt]
SQLite2 PDO Common: PDO::FETCH_BOUND w/o : [ext/sqlite/tests/pdo/pdo_016a.phpt]
via [ext/sqlite/tests/pdo/common.phpt]
SQLite2 PDO Common: transactions [ext/sqlite/tests/pdo/pdo_017.phpt]
via [ext/sqlite/tests/pdo/common.phpt]
SQLite2 PDO Common: serializing [ext/sqlite/tests/pdo/pdo_018.phpt]
via [ext/sqlite/tests/pdo/common.phpt]
SQLite2 PDO Common: fetch() and while() [ext/sqlite/tests/pdo/pdo_019.phpt]
via [ext/sqlite/tests/pdo/common.phpt]
SQLite2 PDO Common: PDOStatement::columnCount [ext/sqlite/tests/pdo/pdo_020.phpt]
via [ext/sqlite/tests/pdo/common.phpt]
SQLite2 PDO Common: PDOStatement::execute with parameters [ext/sqlite/tests/pdo/pdo_021.phpt]
via [ext/sqlite/tests/pdo/common.phpt]
SQLite2 PDO Common: extending PDO [ext/sqlite/tests/pdo/pdo_023.phpt]
via [ext/sqlite/tests/pdo/common.phpt]
SQLite2 PDO Common: assert that bindParam does not modify parameter
[ext/sqlite/tests/pdo/pdo_024.phpt]
via [ext/sqlite/tests/pdo/common.phpt]
SQLite2 PDO Common: PDO::FETCH_INTO [ext/sqlite/tests/pdo/pdo_025.phpt]
via [ext/sqlite/tests/pdo/common.phpt]
SQLite2 PDO Common: extending PDO (2) [ext/sqlite/tests/pdo/pdo_026.phpt]
via [ext/sqlite/tests/pdo/common.phpt]
SQLite2 PDO Common: PDO::FETCH_LAZY [ext/sqlite/tests/pdo/pdo_027.phpt]
via [ext/sqlite/tests/pdo/common.phpt]
SQLite2 PDO Common: bindValue [ext/sqlite/tests/pdo/pdo_028.phpt]
via [ext/sqlite/tests/pdo/common.phpt]
SQLite2 PDO Common: extending PDO (3) [ext/sqlite/tests/pdo/pdo_029.phpt]
via [ext/sqlite/tests/pdo/common.phpt]
SQLite2 PDO Common: extending PDO (4) [ext/sqlite/tests/pdo/pdo_030.phpt]
via [ext/sqlite/tests/pdo/common.phpt]
SQLite2 PDO Common: PDOStatement SPL iterator [ext/sqlite/tests/pdo/pdo_031.phpt]
via [ext/sqlite/tests/pdo/common.phpt]
SQLite2 PDO Common: PDO::ATTR_CASE [ext/sqlite/tests/pdo/pdo_032.phpt]
via [ext/sqlite/tests/pdo/common.phpt]
SQLite2 PDO Common: PDO::quote() [ext/sqlite/tests/pdo/pdo_033.phpt]
via [ext/sqlite/tests/pdo/common.phpt]
SQLite2 PDO Common: PDO::FETCH_KEY_PAIR fetch mode test [ext/sqlite/tests/pdo/pdo_034.phpt]
via [ext/sqlite/tests/pdo/common.phpt]
SQLite2 PDO Common: PECL Bug #5217 (serialize/unserialze safety)
[ext/sqlite/tests/pdo/pecl_bug_5217.phpt]
via [ext/sqlite/tests/pdo/common.phpt]
SQLite2 PDO Common: PECL Bug #5772 (PDO::FETCH_FUNC breaks on mixed case func name)
[ext/sqlite/tests/pdo/pecl_bug_5772.phpt]
via [ext/sqlite/tests/pdo/common.phpt]
SQLite2 PDO Common: PECL Bug #5809 (PDOStatement::execute(array()) changes param)
[ext/sqlite/tests/pdo/pecl_bug_5809.phpt]
strripos() offset integer overflow [ext/standard/tests/strings/strripos_offset.phpt]
=====================================================================
================================================================================
/root/src/php-5.2.3/tests/lang/bug23584.phpt
================================================================================
#!php
Notice: Undefined variable: foo in /root/src/php-5.2.3/tests/lang/bug23584.php on line 7
================================================================================
001+ #!php
001- Notice: Undefined variable:.*foo in .* on line 6
002+
003+ Notice: Undefined variable: foo in /root/src/php-5.2.3/tests/lang/bug23584.php on line 7
================================================================================
================================================================================
/root/src/php-5.2.3/Zend/tests/double_to_string.phpt
================================================================================
string(7) "2.9E+17"
string(7) "2.9E+14"
string(7) "2.9E+13"
string(14) "29000000000000"
string(14) "29000000000001"
string(13) "29000.7123123"
string(15) "239234242.71231"
string(16) "0.12345678901235"
string(14) "10000000000000"
string(7) "1.0E+14"
string(7) "1.0E+18"
string(7) "1.0E+14"
string(11) "10000000000"
string(7) "1.0E+15"
string(7) "1.0E+16"
string(1) "0"
Done
================================================================================
003+ string(7) "2.9E+13"
005- string(14) "29000000000001"
================================================================================
================================================================================
/root/src/php-5.2.3/ext/iconv/tests/bug16069.phpt
================================================================================
¥ß¥ê¥Ð¡¼¥ë¥ß¥ê¥Ð¡¼¥ë¥ß¥ê¥Ð¡¼¥ë¥ß¥ê¥Ð¡¼¥ë¥ß¥ê¥Ð¡¼¥ë¥ß¥ê¥Ð¡¼¥ë¥ß¥ê¥Ð¡¼¥ë¥ß¥ê¥Ð¡¼¥ë¥ß¥ê¥Ð¡¼¥ë¥ß¥ê¥Ð¡¼¥ë¥ß¥ê¥Ð¡¼¥ë¥ß¥ß¥ê¥Ð¡¼¥ë¥ß¥ê¥Ð¡¼¥ë¥ß¥ê¥Ð¡¼¥ë¥ß¥ê¥Ð¡¼¥ë¥ß¥ê¥Ð¡¼¥ë¥ß¥ê¥Ð¡¼¥ë¥ß¥ê¥Ð¡¼¥ë¥ß¥ê¥Ð¡¼¥ë¥ß¥ê¥Ð¡¼¥ë¥ß¥ê¥Ð¡¼¥ë¥ß¥ê¥Ð¡¼¥ë¥ß¥ê¥Ð¡¼¥ë¥ß¥ê¥Ð¡¼¥ë¥ß¥ê¥Ð¡¼¥ë¥ß¥ê¥Ð¡¼¥ë¥ß¥ê¥Ð¡¼¥ë¥ß¥ê¥Ð¡¼¥ë¥ß¥ê¥Ð¡¼¥ë¥ß¥ê¥Ð¡¼¥ë¥ß¥ê¥Ð¡¼¥ë¥ß¥ê¥Ð¡¼¥ë¥ß¥ê¥Ð¡¼¥ë¥ß¥ê¥Ð¡¼¥ë¥ß¥ê¥Ð¡¼¥ë¥ß¥ê¥Ð¡¼¥ë¥ß¥ê¥Ð¡¼¥ë¥ß¥ê¥Ð¡¼¥ë¥ß¥ê¥Ð¡¼¥ë¥ß¥ê¥Ð¡¼¥ë(¡ë§¥¡ë)
================================================================================
001+
¥ß¥ê¥Ð¡¼¥ë¥ß¥ê¥Ð¡¼¥ë¥ß¥ê¥Ð¡¼¥ë¥ß¥ê¥Ð¡¼¥ë¥ß¥ê¥Ð¡¼¥ë¥ß¥ê¥Ð¡¼¥ë¥ß¥ê¥Ð¡¼¥ë¥ß¥ê¥Ð¡¼¥ë¥ß¥ê¥Ð¡¼¥ë¥ß¥ê¥Ð¡¼¥ë¥ß¥ê¥Ð¡¼¥ë¥ß¥ß¥ê¥Ð¡¼¥ë¥ß¥ê¥Ð¡¼¥ë¥ß¥ê¥Ð¡¼¥ë¥ß¥ê¥Ð¡¼¥ë¥ß¥ê¥Ð¡¼¥ë¥ß¥ê¥Ð¡¼¥ë¥ß¥ê¥Ð¡¼¥ë¥ß¥ê¥Ð¡¼¥ë¥ß¥ê¥Ð¡¼¥ë¥ß¥ê¥Ð¡¼¥ë¥ß¥ê¥Ð¡¼¥ë¥ß¥ê¥Ð¡¼¥ë¥ß¥ê¥Ð¡¼¥ë¥ß¥ê¥Ð¡¼¥ë¥ß¥ê¥Ð¡¼¥ë¥ß¥ê¥Ð¡¼¥ë¥ß¥ê¥Ð¡¼¥ë¥ß¥ê¥Ð¡¼¥ë¥ß¥ê¥Ð¡¼¥ë¥ß¥ê¥Ð¡¼¥ë¥ß¥ê¥Ð¡¼¥ë¥ß¥ê¥Ð¡¼¥ë¥ß¥ê¥Ð¡¼¥ë¥ß¥ê¥Ð¡¼¥ë¥ß¥ê¥Ð¡¼¥ë¥ß¥ê¥Ð¡¼¥ë¥ß¥ê¥Ð¡¼¥ë¥ß¥ê¥Ð¡¼¥ë¥ß¥ê¥Ð¡¼¥ë(¡ë§¥¡ë)
001-
¥ß¥ê¥Ð¡¼¥ë¥ß¥ê¥Ð¡¼¥ë¥ß¥ê¥Ð¡¼¥ë¥ß¥ê¥Ð¡¼¥ë¥ß¥ê¥Ð¡¼¥ë¥ß¥ê¥Ð¡¼¥ë¥ß¥ê¥Ð¡¼¥ë¥ß¥ê¥Ð¡¼¥ë¥ß¥ê¥Ð¡¼¥ë¥ß¥ê¥Ð¡¼¥ë¥ß¥ê¥Ð¡¼¥ë¥ß¥ê¥Ð¡¼¥ë¥ß¥ê¥Ð¡¼¥ë¥ß¥ê¥Ð¡¼¥ë¥ß¥ê¥Ð¡¼¥ë¥ß¥ê¥Ð¡¼¥ë¥ß¥ê¥Ð¡¼¥ë¥ß¥ê¥Ð¡¼¥ë¥ß¥ê¥Ð¡¼¥ë¥ß¥ê¥Ð¡¼¥ë¥ß¥ê¥Ð¡¼¥ë¥ß¥ê¥Ð¡¼¥ë¥ß¥ê¥Ð¡¼¥ë¥ß¥ê¥Ð¡¼¥ë¥ß¥ê¥Ð¡¼¥ë¥ß¥ê¥Ð¡¼¥ë¥ß¥ê¥Ð¡¼¥ë¥ß¥ê¥Ð¡¼¥ë¥ß¥ê¥Ð¡¼¥ë¥ß¥ê¥Ð¡¼¥ë¥ß¥ê¥Ð¡¼¥ë¥ß¥ê¥Ð¡¼¥ë¥ß¥ê¥Ð¡¼¥ë¥ß¥ê¥Ð¡¼¥ë¥ß¥ê¥Ð¡¼¥ë¥ß¥ê¥Ð¡¼¥ë¥ß¥ê¥Ð¡¼¥ë¥ß¥ê¥Ð¡¼¥ë¥ß¥ê¥Ð¡¼¥ë¥ß¥ê¥Ð¡¼¥ë(¡ë§¥¡ë)
================================================================================
================================================================================
/root/src/php-5.2.3/ext/iconv/tests/iconv_stream_filter.phpt
================================================================================
string(20) "1b244224332473244b24"
string(10) "41244f1b28"
string(2) "42"
string(20) "a4b3a4f3a4cba4c1a4cf"
string(10) "69636f6e76"
string(2) "0a"
string(20) "1b244f24332466245824"
string(10) "4e24421b28"
string(2) "4f"
================================================================================
007+ string(20) "1b244f24332466245824"
008+ string(10) "4e24421b28"
009+ string(2) "4f"
007-
008- Warning: fread(): iconv stream filter ("ISO-2022-JP"=>"EUC-JP"): invalid
multibyte sequence in %s on line %d
009- string(0) ""
010- string(0) ""
011- string(0) ""
================================================================================
================================================================================
/root/src/php-5.2.3/ext/pdo/tests/bug_34630.phpt
================================================================================
# original source file: ext/pdo/tests/bug_34630.phpt
array(1) {
[0]=>
array(2) {
["id"]=>
string(1) "1"
["val"]=>
string(17) "I am the LOB data"
}
}
================================================================================
001+ # original source file: ext/pdo/tests/bug_34630.phpt
================================================================================
================================================================================
/root/src/php-5.2.3/ext/pdo/tests/bug_34687.phpt
================================================================================
# original source file: ext/pdo/tests/bug_34687.phpt
bool(false)
OK: HY000
================================================================================
001+ # original source file: ext/pdo/tests/bug_34687.phpt
================================================================================
================================================================================
/root/src/php-5.2.3/ext/pdo/tests/bug_35671.phpt
================================================================================
# original source file: ext/pdo/tests/bug_35671.phpt
array(1) {
[0]=>
array(3) {
["field1"]=>
string(2) "15"
["field2"]=>
string(2) "20"
["field3"]=>
string(2) "25"
}
}
================================================================================
001+ # original source file: ext/pdo/tests/bug_35671.phpt
================================================================================
================================================================================
/root/src/php-5.2.3/ext/pdo/tests/bug_36428.phpt
================================================================================
# original source file: ext/pdo/tests/bug_36428.phpt
array(1) {
[0]=>
object(SimpleXMLElement)#3 (1) {
["a"]=>
string(3) "xyz"
}
}
===DONE===
================================================================================
001+ # original source file: ext/pdo/tests/bug_36428.phpt
================================================================================
================================================================================
/root/src/php-5.2.3/ext/pdo/tests/bug_36798.phpt
================================================================================
# original source file: ext/pdo/tests/bug_36798.phpt
array(1) {
[0]=>
string(1) "Ã"
}
================================================================================
001+ # original source file: ext/pdo/tests/bug_36798.phpt
================================================================================
================================================================================
/root/src/php-5.2.3/ext/pdo/tests/bug_38253.phpt
================================================================================
# original source file: ext/pdo/tests/bug_38253.phpt
Warning: PDOStatement::fetchAll(): SQLSTATE[HY000]: General error: No fetch class specified in
/root/src/php-5.2.3/ext/pdo_sqlite/tests/bug_38253.php on line 14
Warning: PDOStatement::fetchAll(): SQLSTATE[HY000]: General error: 1 no such table: classtypes in
/root/src/php-5.2.3/ext/pdo_sqlite/tests/bug_38253.php on line 14
array(0) {
}
Warning: PDOStatement::fetchAll(): SQLSTATE[HY000]: General error: No fetch function specified in
/root/src/php-5.2.3/ext/pdo_sqlite/tests/bug_38253.php on line 24
Warning: PDOStatement::fetchAll(): SQLSTATE[HY000]: General error: 1 no such table: classtypes in
/root/src/php-5.2.3/ext/pdo_sqlite/tests/bug_38253.php on line 24
array(0) {
}
================================================================================
001+ # original source file: ext/pdo/tests/bug_38253.phpt
002+
================================================================================
================================================================================
/root/src/php-5.2.3/ext/pdo/tests/bug_38394.phpt
================================================================================
# original source file: ext/pdo/tests/bug_38394.phpt
array(2) {
[0]=>
array(3) {
["a"]=>
string(1) "1"
["b"]=>
string(1) "2"
["c"]=>
string(1) "3"
}
[1]=>
array(3) {
["a"]=>
string(1) "9"
["b"]=>
string(2) "10"
["c"]=>
string(2) "11"
}
}
===DONE===
================================================================================
001+ # original source file: ext/pdo/tests/bug_38394.phpt
================================================================================
================================================================================
/root/src/php-5.2.3/ext/pdo/tests/bug_39398.phpt
================================================================================
# original source file: ext/pdo/tests/bug_39398.phpt
array(1) {
[0]=>
array(1) {
["test"]=>
string(1) "1"
}
}
===DONE===
================================================================================
001+ # original source file: ext/pdo/tests/bug_39398.phpt
================================================================================
================================================================================
/root/src/php-5.2.3/ext/pdo/tests/bug_39656.phpt
================================================================================
# original source file: ext/pdo/tests/bug_39656.phpt
array(4) {
["id"]=>
string(1) "1"
[0]=>
string(1) "1"
["usr"]=>
string(4) "user"
[1]=>
string(4) "user"
}
bool(false)
Done
================================================================================
001+ # original source file: ext/pdo/tests/bug_39656.phpt
================================================================================
================================================================================
/root/src/php-5.2.3/ext/pdo/tests/bug_40285.phpt
================================================================================
# original source file: ext/pdo/tests/bug_40285.phpt
Done
================================================================================
001+ # original source file: ext/pdo/tests/bug_40285.phpt
================================================================================
================================================================================
/root/src/php-5.2.3/ext/pdo/tests/pdo_001.phpt
================================================================================
# original source file: ext/pdo/tests/pdo_001.phpt
array(3) {
[0]=>
array(2) {
["id"]=>
string(1) "1"
["val"]=>
string(1) "A"
}
[1]=>
array(2) {
["id"]=>
string(1) "2"
["val"]=>
string(1) "B"
}
[2]=>
array(2) {
["id"]=>
string(1) "3"
["val"]=>
string(1) "C"
}
}
================================================================================
001+ # original source file: ext/pdo/tests/pdo_001.phpt
================================================================================
================================================================================
/root/src/php-5.2.3/ext/pdo/tests/pdo_002.phpt
================================================================================
# original source file: ext/pdo/tests/pdo_002.phpt
array(3) {
[0]=>
array(2) {
[0]=>
string(1) "1"
[1]=>
string(1) "A"
}
[1]=>
array(2) {
[0]=>
string(1) "2"
[1]=>
string(1) "B"
}
[2]=>
array(2) {
[0]=>
string(1) "3"
[1]=>
string(1) "C"
}
}
================================================================================
001+ # original source file: ext/pdo/tests/pdo_002.phpt
================================================================================
================================================================================
/root/src/php-5.2.3/ext/pdo/tests/pdo_003.phpt
================================================================================
# original source file: ext/pdo/tests/pdo_003.phpt
array(3) {
[0]=>
array(4) {
["id"]=>
string(1) "1"
[0]=>
string(1) "1"
["val"]=>
string(1) "A"
[1]=>
string(1) "A"
}
[1]=>
array(4) {
["id"]=>
string(1) "2"
[0]=>
string(1) "2"
["val"]=>
string(1) "B"
[1]=>
string(1) "B"
}
[2]=>
array(4) {
["id"]=>
string(1) "3"
[0]=>
string(1) "3"
["val"]=>
string(1) "C"
[1]=>
string(1) "C"
}
}
================================================================================
001+ # original source file: ext/pdo/tests/pdo_003.phpt
================================================================================
================================================================================
/root/src/php-5.2.3/ext/pdo/tests/pdo_004.phpt
================================================================================
# original source file: ext/pdo/tests/pdo_004.phpt
array(3) {
[0]=>
object(stdClass)#3 (2) {
["id"]=>
string(1) "1"
["val"]=>
string(1) "A"
}
[1]=>
object(stdClass)#4 (2) {
["id"]=>
string(1) "2"
["val"]=>
string(1) "B"
}
[2]=>
object(stdClass)#5 (2) {
["id"]=>
string(1) "3"
["val"]=>
string(1) "C"
}
}
================================================================================
001+ # original source file: ext/pdo/tests/pdo_004.phpt
================================================================================
================================================================================
/root/src/php-5.2.3/ext/pdo/tests/pdo_005.phpt
================================================================================
# original source file: ext/pdo/tests/pdo_005.phpt
array(3) {
[0]=>
object(stdClass)#3 (3) {
["id"]=>
string(1) "1"
["val"]=>
string(1) "A"
["val2"]=>
string(2) "AA"
}
[1]=>
object(stdClass)#4 (3) {
["id"]=>
string(1) "2"
["val"]=>
string(1) "B"
["val2"]=>
string(2) "BB"
}
[2]=>
object(stdClass)#5 (3) {
["id"]=>
string(1) "3"
["val"]=>
string(1) "C"
["val2"]=>
string(2) "CC"
}
}
array(3) {
[0]=>
object(TestBase)#5 (3) {
["id"]=>
string(1) "1"
["val:protected"]=>
string(1) "A"
["val2:private"]=>
string(2) "AA"
}
[1]=>
object(TestBase)#4 (3) {
["id"]=>
string(1) "2"
["val:protected"]=>
string(1) "B"
["val2:private"]=>
string(2) "BB"
}
[2]=>
object(TestBase)#3 (3) {
["id"]=>
string(1) "3"
["val:protected"]=>
string(1) "C"
["val2:private"]=>
string(2) "CC"
}
}
TestDerived::__construct(0,1)
TestDerived::__construct(1,2)
TestDerived::__construct(2,3)
array(3) {
[0]=>
object(TestDerived)#3 (5) {
["row:protected"]=>
int(0)
["id"]=>
string(1) "1"
["val:protected"]=>
string(1) "A"
["val2:private"]=>
NULL
["val2"]=>
string(2) "AA"
}
[1]=>
object(TestDerived)#4 (5) {
["row:protected"]=>
int(1)
["id"]=>
string(1) "2"
["val:protected"]=>
string(1) "B"
["val2:private"]=>
NULL
["val2"]=>
string(2) "BB"
}
[2]=>
object(TestDerived)#5 (5) {
["row:protected"]=>
int(2)
["id"]=>
string(1) "3"
["val:protected"]=>
string(1) "C"
["val2:private"]=>
NULL
["val2"]=>
string(2) "CC"
}
}
================================================================================
001+ # original source file: ext/pdo/tests/pdo_005.phpt
================================================================================
================================================================================
/root/src/php-5.2.3/ext/pdo/tests/pdo_006.phpt
================================================================================
# original source file: ext/pdo/tests/pdo_006.phpt
array(2) {
["A"]=>
array(2) {
[0]=>
array(1) {
[0]=>
string(1) "1"
}
[1]=>
array(1) {
[0]=>
string(1) "2"
}
}
["C"]=>
array(1) {
[0]=>
array(1) {
[0]=>
string(1) "3"
}
}
}
array(2) {
["A"]=>
array(2) {
[0]=>
array(1) {
["id"]=>
string(1) "1"
}
[1]=>
array(1) {
["id"]=>
string(1) "2"
}
}
["C"]=>
array(1) {
[0]=>
array(1) {
["id"]=>
string(1) "3"
}
}
}
================================================================================
001+ # original source file: ext/pdo/tests/pdo_006.phpt
================================================================================
================================================================================
/root/src/php-5.2.3/ext/pdo/tests/pdo_007.phpt
================================================================================
# original source file: ext/pdo/tests/pdo_007.phpt
array(3) {
["A"]=>
array(1) {
[0]=>
string(1) "A"
}
["B"]=>
array(1) {
[0]=>
string(1) "A"
}
["C"]=>
array(1) {
[0]=>
string(1) "C"
}
}
array(3) {
["A"]=>
array(1) {
["val"]=>
string(1) "A"
}
["B"]=>
array(1) {
["val"]=>
string(1) "A"
}
["C"]=>
array(1) {
["val"]=>
string(1) "C"
}
}
================================================================================
001+ # original source file: ext/pdo/tests/pdo_007.phpt
================================================================================
================================================================================
/root/src/php-5.2.3/ext/pdo/tests/pdo_008.phpt
================================================================================
# original source file: ext/pdo/tests/pdo_008.phpt
array(2) {
["A"]=>
array(1) {
[0]=>
string(1) "B"
}
["C"]=>
array(1) {
[0]=>
string(1) "C"
}
}
================================================================================
001+ # original source file: ext/pdo/tests/pdo_008.phpt
================================================================================
================================================================================
/root/src/php-5.2.3/ext/pdo/tests/pdo_009.phpt
================================================================================
# original source file: ext/pdo/tests/pdo_009.phpt
array(4) {
[0]=>
array(3) {
[0]=>
string(8) "stdClass"
[1]=>
string(1) "1"
[2]=>
string(1) "A"
}
[1]=>
array(3) {
[0]=>
string(5) "Test1"
[1]=>
string(1) "2"
[2]=>
string(1) "B"
}
[2]=>
array(3) {
[0]=>
string(5) "Test2"
[1]=>
string(1) "3"
[2]=>
string(1) "C"
}
[3]=>
array(3) {
[0]=>
NULL
[1]=>
string(1) "4"
[2]=>
string(1) "D"
}
}
Test1::__construct()
Test2::__construct()
Test3::__construct()
array(4) {
[0]=>
object(stdClass)#3 (2) {
["id"]=>
string(1) "1"
["val"]=>
string(1) "A"
}
[1]=>
object(Test1)#4 (2) {
["id"]=>
string(1) "2"
["val"]=>
string(1) "B"
}
[2]=>
object(Test2)#5 (2) {
["id"]=>
string(1) "3"
["val"]=>
string(1) "C"
}
[3]=>
object(Test3)#6 (2) {
["id"]=>
string(1) "4"
["val"]=>
string(1) "D"
}
}
================================================================================
001+ # original source file: ext/pdo/tests/pdo_009.phpt
================================================================================
================================================================================
/root/src/php-5.2.3/ext/pdo/tests/pdo_010.phpt
================================================================================
# original source file: ext/pdo/tests/pdo_010.phpt
Test1::__construct()
Test2::__construct()
Test3::__construct()
array(2) {
["Group1"]=>
array(2) {
[0]=>
object(stdClass)#3 (2) {
["id"]=>
string(1) "1"
["val"]=>
string(1) "A"
}
[1]=>
object(Test1)#4 (2) {
["id"]=>
string(1) "2"
["val"]=>
string(1) "B"
}
}
["Group2"]=>
array(2) {
[0]=>
object(Test2)#5 (2) {
["id"]=>
string(1) "3"
["val"]=>
string(1) "C"
}
[1]=>
object(Test3)#6 (2) {
["id"]=>
string(1) "4"
["val"]=>
string(1) "D"
}
}
}
Test1::__construct()
Test2::__construct()
Test3::__construct()
array(2) {
["Group1"]=>
object(Test1)#5 (2) {
["id"]=>
string(1) "2"
["val"]=>
string(1) "B"
}
["Group2"]=>
object(Test3)#4 (2) {
["id"]=>
string(1) "4"
["val"]=>
string(1) "D"
}
}
================================================================================
001+ # original source file: ext/pdo/tests/pdo_010.phpt
================================================================================
================================================================================
/root/src/php-5.2.3/ext/pdo/tests/pdo_011.phpt
================================================================================
# original source file: ext/pdo/tests/pdo_011.phpt
DerivedStatement::__construct(Overloaded)
Test1::__construct(0,0)
test(1,N/A)
test(2,N/A)
test(3,N/A)
test(4,N/A)
array(2) {
["Group1"]=>
array(2) {
[0]=>
array(1) {
[1]=>
string(3) "N/A"
}
[1]=>
array(1) {
[2]=>
string(3) "N/A"
}
}
["Group2"]=>
array(2) {
[0]=>
array(1) {
[3]=>
string(3) "N/A"
}
[1]=>
array(1) {
[4]=>
string(3) "N/A"
}
}
}
test(1,A)
test(2,B)
test(3,C)
test(4,D)
array(4) {
[0]=>
array(1) {
[1]=>
string(1) "A"
}
[1]=>
array(1) {
[2]=>
string(1) "B"
}
[2]=>
array(1) {
[3]=>
string(1) "C"
}
[3]=>
array(1) {
[4]=>
string(1) "D"
}
}
Test1::factory(1,A)
Test1::__construct(1,A)
Test1::factory(2,B)
Test1::__construct(2,B)
Test1::factory(3,C)
Test1::__construct(3,C)
Test1::factory(4,D)
Test1::__construct(4,D)
array(4) {
[0]=>
object(Test1)#6 (2) {
["id"]=>
string(1) "1"
["val"]=>
string(1) "A"
}
[1]=>
object(Test1)#7 (2) {
["id"]=>
string(1) "2"
["val"]=>
string(1) "B"
}
[2]=>
object(Test1)#8 (2) {
["id"]=>
string(1) "3"
["val"]=>
string(1) "C"
}
[3]=>
object(Test1)#9 (2) {
["id"]=>
string(1) "4"
["val"]=>
string(1) "D"
}
}
Test1::factory(1,A)
Test1::__construct(1,A)
Test1::factory(2,B)
Test1::__construct(2,B)
Test1::factory(3,C)
Test1::__construct(3,C)
Test1::factory(4,D)
Test1::__construct(4,D)
array(4) {
[0]=>
object(Test1)#9 (2) {
["id"]=>
string(1) "1"
["val"]=>
string(1) "A"
}
[1]=>
object(Test1)#8 (2) {
["id"]=>
string(1) "2"
["val"]=>
string(1) "B"
}
[2]=>
object(Test1)#7 (2) {
["id"]=>
string(1) "3"
["val"]=>
string(1) "C"
}
[3]=>
object(Test1)#6 (2) {
["id"]=>
string(1) "4"
["val"]=>
string(1) "D"
}
}
string(16) "DerivedStatement"
DerivedStatement::reTrieve(1,A)
DerivedStatement::reTrieve(2,B)
DerivedStatement::reTrieve(3,C)
DerivedStatement::reTrieve(4,D)
array(4) {
[0]=>
array(1) {
[1]=>
string(1) "A"
}
[1]=>
array(1) {
[2]=>
string(1) "B"
}
[2]=>
array(1) {
[3]=>
string(1) "C"
}
[3]=>
array(1) {
[4]=>
string(1) "D"
}
}
DerivedStatement::reTrieve(1,A)
DerivedStatement::reTrieve(2,B)
DerivedStatement::reTrieve(3,C)
DerivedStatement::reTrieve(4,D)
array(4) {
[0]=>
array(1) {
[1]=>
string(1) "A"
}
[1]=>
array(1) {
[2]=>
string(1) "B"
}
[2]=>
array(1) {
[3]=>
string(1) "C"
}
[3]=>
array(1) {
[4]=>
string(1) "D"
}
}
DerivedStatement::reTrieve(1,A)
DerivedStatement::reTrieve(2,B)
DerivedStatement::reTrieve(3,C)
DerivedStatement::reTrieve(4,D)
array(4) {
[0]=>
array(1) {
[1]=>
string(1) "A"
}
[1]=>
array(1) {
[2]=>
string(1) "B"
}
[2]=>
array(1) {
[3]=>
string(1) "C"
}
[3]=>
array(1) {
[4]=>
string(1) "D"
}
}
================================================================================
001+ # original source file: ext/pdo/tests/pdo_011.phpt
================================================================================
================================================================================
/root/src/php-5.2.3/ext/pdo/tests/pdo_012.phpt
================================================================================
# original source file: ext/pdo/tests/pdo_012.phpt
array(2) {
[0]=>
array(2) {
[0]=>
string(1) "A"
[1]=>
string(6) "Group1"
}
[1]=>
array(2) {
[0]=>
string(1) "B"
[1]=>
string(6) "Group2"
}
}
Test::__construct(N/A)
Test::__construct(N/A)
array(2) {
[0]=>
object(Test)#3 (2) {
["val"]=>
string(1) "A"
["grp"]=>
string(6) "Group1"
}
[1]=>
object(Test)#4 (2) {
["val"]=>
string(1) "B"
["grp"]=>
string(6) "Group2"
}
}
Test::__construct(Changed)
Test::__construct(Changed)
array(2) {
[0]=>
object(Test)#4 (2) {
["val"]=>
string(1) "A"
["grp"]=>
string(6) "Group1"
}
[1]=>
object(Test)#3 (2) {
["val"]=>
string(1) "B"
["grp"]=>
string(6) "Group2"
}
}
================================================================================
001+ # original source file: ext/pdo/tests/pdo_012.phpt
================================================================================
================================================================================
/root/src/php-5.2.3/ext/pdo/tests/pdo_013.phpt
================================================================================
# original source file: ext/pdo/tests/pdo_013.phpt
array(2) {
[0]=>
string(1) "A"
[1]=>
string(6) "Group1"
}
array(2) {
[0]=>
string(1) "B"
[1]=>
string(6) "Group2"
}
Test::__construct(N/A)
object(Test)#3 (2) {
["val"]=>
string(1) "A"
["grp"]=>
string(6) "Group1"
}
Test::__construct(N/A)
object(Test)#2 (2) {
["val"]=>
string(1) "B"
["grp"]=>
string(6) "Group2"
}
Test::__construct(WOW)
object(Test)#3 (2) {
["val"]=>
string(1) "A"
["grp"]=>
string(6) "Group1"
}
Test::__construct(WOW)
object(Test)#2 (2) {
["val"]=>
string(1) "B"
["grp"]=>
string(6) "Group2"
}
================================================================================
001+ # original source file: ext/pdo/tests/pdo_013.phpt
================================================================================
================================================================================
/root/src/php-5.2.3/ext/pdo/tests/pdo_014.phpt
================================================================================
# original source file: ext/pdo/tests/pdo_014.phpt
Test::__construct(WOW)
object(Test)#4 (2) {
["val"]=>
string(1) "A"
["grp"]=>
string(6) "Group1"
}
Test::__construct(WOW)
object(Test)#6 (2) {
["val"]=>
string(1) "B"
["grp"]=>
string(6) "Group2"
}
NULL
bool(false)
PDOStatementAggregate::__construct
PDOStatementAggregate::getIterator
array(2) {
[0]=>
string(1) "A"
[1]=>
string(6) "Group1"
}
array(2) {
[0]=>
string(1) "B"
[1]=>
string(6) "Group2"
}
================================================================================
001+ # original source file: ext/pdo/tests/pdo_014.phpt
================================================================================
================================================================================
/root/src/php-5.2.3/ext/pdo/tests/pdo_015.phpt
================================================================================
# original source file: ext/pdo/tests/pdo_015.phpt
array(2) {
[0]=>
string(1) "1"
[1]=>
string(1) "2"
}
array(2) {
[0]=>
string(2) "A2"
[1]=>
string(2) "B2"
}
array(2) {
[1]=>
array(1) {
[0]=>
string(1) "A"
}
[2]=>
array(1) {
[0]=>
string(1) "A"
}
}
array(2) {
[1]=>
string(1) "A"
[2]=>
string(1) "A"
}
array(2) {
[1]=>
string(1) "1"
[2]=>
string(1) "2"
}
array(2) {
[1]=>
string(1) "A"
[2]=>
string(1) "A"
}
array(2) {
[1]=>
string(2) "A2"
[2]=>
string(2) "B2"
}
array(1) {
["A"]=>
array(2) {
[0]=>
string(2) "A2"
[1]=>
string(2) "B2"
}
}
================================================================================
001+ # original source file: ext/pdo/tests/pdo_015.phpt
================================================================================
================================================================================
/root/src/php-5.2.3/ext/pdo/tests/pdo_016.phpt
================================================================================
# original source file: ext/pdo/tests/pdo_016.phpt
string(1) "3"
array(3) {
[0]=>
string(7) "String0"
[1]=>
string(7) "String1"
[2]=>
string(7) "String2"
}
===WHILE===
array(1) {
[0]=>
string(7) "String0"
}
array(1) {
[1]=>
string(7) "String1"
}
array(1) {
[2]=>
string(7) "String2"
}
===ALONE===
array(1) {
[0]=>
string(7) "String0"
}
bool(true)
bool(true)
bool(true)
bool(true)
array(1) {
[0]=>
string(7) "String0"
}
array(1) {
[1]=>
string(7) "String1"
}
bool(true)
bool(true)
bool(true)
bool(true)
array(1) {
[1]=>
string(7) "String1"
}
array(1) {
[2]=>
string(7) "String2"
}
bool(true)
bool(true)
bool(true)
bool(true)
array(1) {
[2]=>
string(7) "String2"
}
===REBIND/SAME===
array(1) {
[0]=>
string(7) "String0"
}
bool(true)
bool(true)
string(7) "String0"
bool(true)
bool(true)
string(1) "0"
array(1) {
[1]=>
string(7) "String1"
}
bool(true)
bool(true)
string(7) "String1"
bool(true)
bool(true)
string(1) "1"
array(1) {
[2]=>
string(7) "String2"
}
bool(true)
bool(true)
string(7) "String2"
bool(true)
bool(true)
string(1) "2"
===REBIND/CONFLICT===
string(7) "String0"
string(7) "String1"
string(7) "String2"
================================================================================
001+ # original source file: ext/pdo/tests/pdo_016.phpt
================================================================================
================================================================================
/root/src/php-5.2.3/ext/pdo/tests/pdo_016a.phpt
================================================================================
# original source file: ext/pdo/tests/pdo_016a.phpt
string(1) "3"
array(3) {
[0]=>
string(7) "String0"
[1]=>
string(7) "String1"
[2]=>
string(7) "String2"
}
===WHILE===
array(1) {
[0]=>
string(7) "String0"
}
array(1) {
[1]=>
string(7) "String1"
}
array(1) {
[2]=>
string(7) "String2"
}
===ALONE===
array(1) {
[0]=>
string(7) "String0"
}
bool(true)
bool(true)
bool(true)
bool(true)
array(1) {
[0]=>
string(7) "String0"
}
array(1) {
[1]=>
string(7) "String1"
}
bool(true)
bool(true)
bool(true)
bool(true)
array(1) {
[1]=>
string(7) "String1"
}
array(1) {
[2]=>
string(7) "String2"
}
bool(true)
bool(true)
bool(true)
bool(true)
array(1) {
[2]=>
string(7) "String2"
}
===REBIND/SAME===
array(1) {
[0]=>
string(7) "String0"
}
bool(true)
bool(true)
string(7) "String0"
bool(true)
bool(true)
string(1) "0"
array(1) {
[1]=>
string(7) "String1"
}
bool(true)
bool(true)
string(7) "String1"
bool(true)
bool(true)
string(1) "1"
array(1) {
[2]=>
string(7) "String2"
}
bool(true)
bool(true)
string(7) "String2"
bool(true)
bool(true)
string(1) "2"
===REBIND/CONFLICT===
string(7) "String0"
string(7) "String1"
string(7) "String2"
================================================================================
001+ # original source file: ext/pdo/tests/pdo_016a.phpt
================================================================================
================================================================================
/root/src/php-5.2.3/ext/pdo/tests/pdo_017.phpt
================================================================================
# original source file: ext/pdo/tests/pdo_017.phpt
Counted 3 rows after insert.
Counted 0 rows after delete.
Counted 3 rows after rollback.
Counted 0 rows after delete.
Counted 0 rows after commit.
================================================================================
001+ # original source file: ext/pdo/tests/pdo_017.phpt
================================================================================
================================================================================
/root/src/php-5.2.3/ext/pdo/tests/pdo_018.phpt
================================================================================
# original source file: ext/pdo/tests/pdo_018.phpt
string(1) "3"
array(3) {
[0]=>
string(8) "stdClass"
[1]=>
string(8) "TestBase"
[2]=>
string(11) "TestDerived"
}
===TYPES===
array(4) {
["stdClass"]=>
string(1) "0"
["TestBase"]=>
string(1) "1"
["TestDerived"]=>
string(1) "2"
["TestLeaf"]=>
NULL
}
===INSERT===
TestBase::serialize() =
'a:3:{s:7:"BasePub";s:6:"Public";s:7:"BasePro";s:9:"Protected";s:7:"BasePri";s:7:"Private";}'
TestDerived::serialize()
TestBase::serialize() =
'a:4:{s:7:"BasePub";s:13:"DerivedPublic";s:7:"BasePro";s:16:"DerivdeProtected";s:10:"DerivedPub";s:6:"Public";s:10:"DerivedPro";s:9:"Protected";}'
TestDerived::serialize()
TestBase::serialize() =
'a:4:{s:7:"BasePub";s:13:"DerivedPublic";s:7:"BasePro";s:16:"DerivdeProtected";s:10:"DerivedPub";s:6:"Public";s:10:"DerivedPro";s:9:"Protected";}'
===DATA===
array(4) {
[0]=>
string(0) ""
[1]=>
string(91)
"a:3:{s:7:"BasePub";s:6:"Public";s:7:"BasePro";s:9:"Protected";s:7:"BasePri";s:7:"Private";}"
[2]=>
string(144)
"a:4:{s:7:"BasePub";s:13:"DerivedPublic";s:7:"BasePro";s:16:"DerivdeProtected";s:10:"DerivedPub";s:6:"Public";s:10:"DerivedPro";s:9:"Protected";}"
[3]=>
string(144)
"a:4:{s:7:"BasePub";s:13:"DerivedPublic";s:7:"BasePro";s:16:"DerivdeProtected";s:10:"DerivedPub";s:6:"Public";s:10:"DerivedPro";s:9:"Protected";}"
}
===FAILURE===
Exception:SQLSTATE[HY000]: General error: cannot unserialize class
===COUNT===
string(1) "3"
===DATABASE===
array(3) {
[0]=>
array(2) {
["name"]=>
string(8) "TestBase"
["val"]=>
string(91)
"a:3:{s:7:"BasePub";s:6:"Public";s:7:"BasePro";s:9:"Protected";s:7:"BasePri";s:7:"Private";}"
}
[1]=>
array(2) {
["name"]=>
string(11) "TestDerived"
["val"]=>
string(144)
"a:4:{s:7:"BasePub";s:13:"DerivedPublic";s:7:"BasePro";s:16:"DerivdeProtected";s:10:"DerivedPub";s:6:"Public";s:10:"DerivedPro";s:9:"Protected";}"
}
[2]=>
array(2) {
["name"]=>
NULL
["val"]=>
string(144)
"a:4:{s:7:"BasePub";s:13:"DerivedPublic";s:7:"BasePro";s:16:"DerivdeProtected";s:10:"DerivedPub";s:6:"Public";s:10:"DerivedPro";s:9:"Protected";}"
}
}
===FETCHCLASS===
TestBase::unserialize(a:3:{s:7:"BasePub";s:6:"Public";s:7:"BasePro";s:9:"Protected";s:7:"BasePri";s:7:"Private";})
TestDerived::unserialize()
TestBase::unserialize(a:4:{s:7:"BasePub";s:13:"DerivedPublic";s:7:"BasePro";s:16:"DerivdeProtected";s:10:"DerivedPub";s:6:"Public";s:10:"DerivedPro";s:9:"Protected";})
TestDerived::unserialize()
TestBase::unserialize(a:4:{s:7:"BasePub";s:13:"DerivedPublic";s:7:"BasePro";s:16:"DerivdeProtected";s:10:"DerivedPub";s:6:"Public";s:10:"DerivedPro";s:9:"Protected";})
array(3) {
[0]=>
object(TestBase)#8 (3) {
["BasePub"]=>
string(7) "#Public"
["BasePro:protected"]=>
string(10) "#Protected"
["BasePri:private"]=>
string(8) "#Private"
}
[1]=>
object(TestDerived)#9 (6) {
["BasePub"]=>
string(14) "#DerivedPublic"
["BasePro:protected"]=>
string(17) "#DerivdeProtected"
["DerivedPub"]=>
string(7) "#Public"
["DerivedPro:protected"]=>
string(10) "#Protected"
["DerivedPri:private"]=>
string(7) "Private"
["BasePri:private"]=>
string(7) "Private"
}
[2]=>
object(TestLeaf)#10 (6) {
["BasePub"]=>
string(14) "#DerivedPublic"
["BasePro:protected"]=>
string(17) "#DerivdeProtected"
["DerivedPub"]=>
string(7) "#Public"
["DerivedPro:protected"]=>
string(10) "#Protected"
["DerivedPri:private"]=>
string(7) "Private"
["BasePri:private"]=>
string(7) "Private"
}
}
================================================================================
001+ # original source file: ext/pdo/tests/pdo_018.phpt
================================================================================
================================================================================
/root/src/php-5.2.3/ext/pdo/tests/pdo_019.phpt
================================================================================
# original source file: ext/pdo/tests/pdo_019.phpt
string(1) "4"
array(4) {
[0]=>
string(7) "String0"
[1]=>
string(7) "String1"
[2]=>
string(7) "String2"
[3]=>
string(7) "String3"
}
===WHILE===
array(1) {
[0]=>
string(7) "String0"
}
array(1) {
[1]=>
string(7) "String1"
}
array(1) {
[2]=>
string(7) "String2"
}
array(1) {
[3]=>
string(7) "String3"
}
================================================================================
001+ # original source file: ext/pdo/tests/pdo_019.phpt
================================================================================
================================================================================
/root/src/php-5.2.3/ext/pdo/tests/pdo_020.phpt
================================================================================
# original source file: ext/pdo/tests/pdo_020.phpt
Counted 2 columns after SELECT id, val FROM test.
Counted 3 columns after SELECT id, val, val2 FROM test.
Counted 1 columns after SELECT COUNT(*) FROM test.
================================================================================
001+ # original source file: ext/pdo/tests/pdo_020.phpt
================================================================================
================================================================================
/root/src/php-5.2.3/ext/pdo/tests/pdo_021.phpt
================================================================================
# original source file: ext/pdo/tests/pdo_021.phpt
There are 6 rows in the table.
There are 12 rows in the table.
================================================================================
001+ # original source file: ext/pdo/tests/pdo_021.phpt
================================================================================
================================================================================
/root/src/php-5.2.3/ext/pdo/tests/pdo_023.phpt
================================================================================
# original source file: ext/pdo/tests/pdo_023.phpt
int(1)
int(2)
object(PDODatabaseX)#1 (2) {
["test1"]=>
int(1)
["test2"]=>
int(22)
}
PDODatabaseX::query()
PDOStatementX::__construct()
PDOStatementX::__destruct()
PDODatabaseX::query()
PDOStatementX::__construct()
PDOStatementX::__destruct()
PDODatabaseX::query()
PDOStatementX::__construct()
PDOStatementX::__destruct()
PDODatabaseX::query()
PDOStatementX::__construct()
object(PDOStatementX)#2 (3) {
["test1"]=>
int(1)
["queryString"]=>
string(24) "SELECT val, id FROM test"
["test2"]=>
int(22)
}
array(2) {
["A"]=>
string(1) "0"
["B"]=>
string(1) "1"
}
PDOStatementX::__destruct()
PDODatabaseX::__destruct()
================================================================================
001+ # original source file: ext/pdo/tests/pdo_023.phpt
================================================================================
================================================================================
/root/src/php-5.2.3/ext/pdo/tests/pdo_024.phpt
================================================================================
# original source file: ext/pdo/tests/pdo_024.phpt
bind: success
bool(true)
NULL
================================================================================
001+ # original source file: ext/pdo/tests/pdo_024.phpt
================================================================================
================================================================================
/root/src/php-5.2.3/ext/pdo/tests/pdo_025.phpt
================================================================================
# original source file: ext/pdo/tests/pdo_025.phpt
object(Test)#2 (3) {
["id"]=>
string(2) "10"
["val"]=>
string(3) "Abc"
["val2"]=>
string(3) "zxy"
}
object(Test)#2 (3) {
["id"]=>
string(2) "20"
["val"]=>
string(3) "Def"
["val2"]=>
string(3) "wvu"
}
object(Test)#2 (3) {
["id"]=>
string(2) "30"
["val"]=>
string(3) "Ghi"
["val2"]=>
string(3) "tsr"
}
object(Test)#2 (3) {
["id"]=>
string(2) "40"
["val"]=>
string(3) "Jkl"
["val2"]=>
string(3) "qpo"
}
object(Test)#2 (3) {
["id"]=>
string(2) "50"
["val"]=>
string(3) "Mno"
["val2"]=>
string(3) "nml"
}
object(Test)#2 (3) {
["id"]=>
string(2) "60"
["val"]=>
string(3) "Pqr"
["val2"]=>
string(3) "kji"
}
===FAIL===
Fatal error: Cannot access protected property Fail::$id in
/root/src/php-5.2.3/ext/pdo_sqlite/tests/pdo_025.php on line 48
================================================================================
001+ # original source file: ext/pdo/tests/pdo_025.phpt
================================================================================
================================================================================
/root/src/php-5.2.3/ext/pdo/tests/pdo_026.phpt
================================================================================
# original source file: ext/pdo/tests/pdo_026.phpt
string(11) "PDODatabase"
string(12) "PDOStatement"
PDODatabase::query()
PDOStatementX::__construct()
string(13) "PDOStatementX"
string(11) "PDODatabase"
array(3) {
["id"]=>
string(2) "10"
["val"]=>
string(3) "Abc"
["val2"]=>
string(3) "zxy"
}
array(3) {
["id"]=>
string(2) "20"
["val"]=>
string(3) "Def"
["val2"]=>
string(3) "wvu"
}
array(3) {
["id"]=>
string(2) "30"
["val"]=>
string(3) "Ghi"
["val2"]=>
string(3) "tsr"
}
===DONE===
PDOStatementX::__destruct()
PDODatabase::__destruct()
================================================================================
001+ # original source file: ext/pdo/tests/pdo_026.phpt
================================================================================
================================================================================
/root/src/php-5.2.3/ext/pdo/tests/pdo_027.phpt
================================================================================
# original source file: ext/pdo/tests/pdo_027.phpt
lazy: 1test1
lazy: 2test2
End
================================================================================
001+ # original source file: ext/pdo/tests/pdo_027.phpt
================================================================================
================================================================================
/root/src/php-5.2.3/ext/pdo/tests/pdo_028.phpt
================================================================================
# original source file: ext/pdo/tests/pdo_028.phpt
array(1) {
[0]=>
array(4) {
["id"]=>
string(1) "1"
["val1"]=>
string(3) "one"
["val2"]=>
string(3) "two"
["val3"]=>
string(5) "three"
}
}
================================================================================
001+ # original source file: ext/pdo/tests/pdo_028.phpt
================================================================================
================================================================================
/root/src/php-5.2.3/ext/pdo/tests/pdo_029.phpt
================================================================================
# original source file: ext/pdo/tests/pdo_029.phpt
string(11) "PDODatabase"
string(12) "PDOStatement"
===QUERY===
PDODatabase::query()
PDOStatementX::__construct()
PDOStatementX::execute()
string(13) "PDOStatementX"
string(11) "PDODatabase"
===FOREACH===
array(3) {
["id"]=>
string(2) "10"
["val"]=>
string(3) "Abc"
["val2"]=>
string(3) "zxy"
}
array(3) {
["id"]=>
string(2) "20"
["val"]=>
string(3) "Def"
["val2"]=>
string(3) "wvu"
}
array(3) {
["id"]=>
string(2) "30"
["val"]=>
string(3) "Ghi"
["val2"]=>
string(3) "tsr"
}
===DONE===
PDOStatementX::__destruct()
PDODatabase::__destruct()
================================================================================
001+ # original source file: ext/pdo/tests/pdo_029.phpt
================================================================================
================================================================================
/root/src/php-5.2.3/ext/pdo/tests/pdo_030.phpt
================================================================================
# original source file: ext/pdo/tests/pdo_030.phpt
string(11) "PDODatabase"
string(12) "PDOStatement"
===QUERY===
array(1) {
[0]=>
string(12) "PDOStatement"
}
array(2) {
[0]=>
string(13) "PDOStatementX"
[1]=>
array(1) {
[0]=>
object(PDODatabase)#1 (0) {
}
}
}
PDODatabase::query()
PDOStatementX::__construct()
string(13) "PDOStatementX"
string(11) "PDODatabase"
===FOREACH===
array(3) {
["id"]=>
string(2) "10"
["val"]=>
string(3) "Abc"
["val2"]=>
string(3) "zxy"
}
array(3) {
["id"]=>
string(2) "20"
["val"]=>
string(3) "Def"
["val2"]=>
string(3) "wvu"
}
array(3) {
["id"]=>
string(2) "30"
["val"]=>
string(3) "Ghi"
["val2"]=>
string(3) "tsr"
}
===DONE===
PDOStatementX::__destruct()
PDODatabase::__destruct()
================================================================================
001+ # original source file: ext/pdo/tests/pdo_030.phpt
================================================================================
================================================================================
/root/src/php-5.2.3/ext/pdo/tests/pdo_031.phpt
================================================================================
# original source file: ext/pdo/tests/pdo_031.phpt
===QUERY===
|-Array [0]
| |-10 [id]
| |-Abc [val]
| \-zxy [val2]
|-Array [1]
| |-20 [id]
| |-Def [val]
| \-wvu [val2]
\-Array [2]
|-30 [id]
|-Ghi [val]
\-tsr [val2]
===DONE===
================================================================================
001+ # original source file: ext/pdo/tests/pdo_031.phpt
================================================================================
================================================================================
/root/src/php-5.2.3/ext/pdo/tests/pdo_032.phpt
================================================================================
# original source file: ext/pdo/tests/pdo_032.phpt
array(3) {
[0]=>
array(2) {
["id"]=>
string(1) "1"
["val"]=>
string(1) "A"
}
[1]=>
array(2) {
["id"]=>
string(1) "2"
["val"]=>
string(1) "B"
}
[2]=>
array(2) {
["id"]=>
string(1) "3"
["val"]=>
string(1) "C"
}
}
array(3) {
[0]=>
array(2) {
["ID"]=>
string(1) "1"
["VAL"]=>
string(1) "A"
}
[1]=>
array(2) {
["ID"]=>
string(1) "2"
["VAL"]=>
string(1) "B"
}
[2]=>
array(2) {
["ID"]=>
string(1) "3"
["VAL"]=>
string(1) "C"
}
}
================================================================================
001+ # original source file: ext/pdo/tests/pdo_032.phpt
================================================================================
================================================================================
/root/src/php-5.2.3/ext/pdo/tests/pdo_033.phpt
================================================================================
# original source file: ext/pdo/tests/pdo_033.phpt
Array
(
[0] => Array
(
[t] =>
!"#$%&'()*+,-./0123456789:;<=>?@ABCDEFGHIJKLMNOPQRSTUVWXYZ[\]^_`abcdefghijklmnopqrstuvwxyz{|}~
)
)
================================================================================
001+ # original source file: ext/pdo/tests/pdo_033.phpt
================================================================================
================================================================================
/root/src/php-5.2.3/ext/pdo/tests/pdo_034.phpt
================================================================================
# original source file: ext/pdo/tests/pdo_034.phpt
array(1) {
["test0"]=>
string(1) "0"
}
array(5) {
[0]=>
array(1) {
["test0"]=>
string(1) "0"
}
[1]=>
array(1) {
["test1"]=>
string(1) "1"
}
[2]=>
array(1) {
["test2"]=>
string(1) "2"
}
[3]=>
array(1) {
["test3"]=>
string(1) "3"
}
[4]=>
array(1) {
["test4"]=>
string(1) "4"
}
}
Warning: PDOStatement::fetch(): SQLSTATE[HY000]: General error: PDO::FETCH_KEY_PAIR fetch mode
requires the result set to contain extactly 2 columns. in
/root/src/php-5.2.3/ext/pdo_sqlite/tests/pdo_034.php on line 16
Warning: PDOStatement::fetch(): SQLSTATE[HY000]: General error: 1 no such table: classtypes in
/root/src/php-5.2.3/ext/pdo_sqlite/tests/pdo_034.php on line 16
bool(false)
================================================================================
001+ # original source file: ext/pdo/tests/pdo_034.phpt
================================================================================
================================================================================
/root/src/php-5.2.3/ext/pdo/tests/pecl_bug_5217.phpt
================================================================================
# original source file: ext/pdo/tests/pecl_bug_5217.phpt
Safely caught You cannot serialize or unserialize PDO instances
PHP Didn't crash!
================================================================================
001+ # original source file: ext/pdo/tests/pecl_bug_5217.phpt
================================================================================
================================================================================
/root/src/php-5.2.3/ext/pdo/tests/pecl_bug_5772.phpt
================================================================================
# original source file: ext/pdo/tests/pecl_bug_5772.phpt
string(1) "1"
================================================================================
001+ # original source file: ext/pdo/tests/pecl_bug_5772.phpt
================================================================================
================================================================================
/root/src/php-5.2.3/ext/pdo/tests/pecl_bug_5809.phpt
================================================================================
# original source file: ext/pdo/tests/pecl_bug_5809.phpt
array(1) {
[0]=>
int(1)
}
array(1) {
[0]=>
int(1)
}
================================================================================
001+ # original source file: ext/pdo/tests/pecl_bug_5809.phpt
================================================================================
================================================================================
/root/src/php-5.2.3/ext/pdo/tests/bug_34630.phpt
================================================================================
# original source file: ext/pdo/tests/bug_34630.phpt
array(1) {
[0]=>
array(2) {
["id"]=>
string(1) "1"
["val"]=>
string(17) "I am the LOB data"
}
}
================================================================================
001+ # original source file: ext/pdo/tests/bug_34630.phpt
================================================================================
================================================================================
/root/src/php-5.2.3/ext/pdo/tests/bug_34687.phpt
================================================================================
# original source file: ext/pdo/tests/bug_34687.phpt
bool(false)
OK: HY000
================================================================================
001+ # original source file: ext/pdo/tests/bug_34687.phpt
================================================================================
================================================================================
/root/src/php-5.2.3/ext/pdo/tests/bug_35671.phpt
================================================================================
# original source file: ext/pdo/tests/bug_35671.phpt
array(1) {
[0]=>
array(3) {
["field1"]=>
string(2) "15"
["field2"]=>
string(2) "20"
["field3"]=>
string(2) "25"
}
}
================================================================================
001+ # original source file: ext/pdo/tests/bug_35671.phpt
================================================================================
================================================================================
/root/src/php-5.2.3/ext/pdo/tests/bug_36428.phpt
================================================================================
# original source file: ext/pdo/tests/bug_36428.phpt
array(1) {
[0]=>
object(SimpleXMLElement)#3 (1) {
["a"]=>
string(3) "xyz"
}
}
===DONE===
================================================================================
001+ # original source file: ext/pdo/tests/bug_36428.phpt
================================================================================
================================================================================
/root/src/php-5.2.3/ext/pdo/tests/bug_36798.phpt
================================================================================
# original source file: ext/pdo/tests/bug_36798.phpt
array(1) {
[0]=>
string(1) "Ã"
}
================================================================================
001+ # original source file: ext/pdo/tests/bug_36798.phpt
================================================================================
================================================================================
/root/src/php-5.2.3/ext/pdo/tests/bug_38253.phpt
================================================================================
# original source file: ext/pdo/tests/bug_38253.phpt
Warning: PDOStatement::fetchAll(): SQLSTATE[HY000]: General error: No fetch class specified in
/root/src/php-5.2.3/ext/sqlite/tests/pdo/bug_38253.php on line 14
Warning: PDOStatement::fetchAll(): SQLSTATE[HY000]: General error in
/root/src/php-5.2.3/ext/sqlite/tests/pdo/bug_38253.php on line 14
array(0) {
}
Warning: PDOStatement::fetchAll(): SQLSTATE[HY000]: General error: No fetch function specified in
/root/src/php-5.2.3/ext/sqlite/tests/pdo/bug_38253.php on line 24
Warning: PDOStatement::fetchAll(): SQLSTATE[HY000]: General error in
/root/src/php-5.2.3/ext/sqlite/tests/pdo/bug_38253.php on line 24
array(0) {
}
================================================================================
001+ # original source file: ext/pdo/tests/bug_38253.phpt
002+
================================================================================
================================================================================
/root/src/php-5.2.3/ext/pdo/tests/bug_39398.phpt
================================================================================
# original source file: ext/pdo/tests/bug_39398.phpt
array(1) {
[0]=>
array(1) {
["test"]=>
string(1) "1"
}
}
===DONE===
================================================================================
001+ # original source file: ext/pdo/tests/bug_39398.phpt
================================================================================
================================================================================
/root/src/php-5.2.3/ext/pdo/tests/bug_39656.phpt
================================================================================
# original source file: ext/pdo/tests/bug_39656.phpt
array(4) {
["id"]=>
string(1) "1"
[0]=>
string(1) "1"
["usr"]=>
string(4) "user"
[1]=>
string(4) "user"
}
bool(false)
Done
================================================================================
001+ # original source file: ext/pdo/tests/bug_39656.phpt
================================================================================
================================================================================
/root/src/php-5.2.3/ext/pdo/tests/bug_40285.phpt
================================================================================
# original source file: ext/pdo/tests/bug_40285.phpt
Done
================================================================================
001+ # original source file: ext/pdo/tests/bug_40285.phpt
================================================================================
================================================================================
/root/src/php-5.2.3/ext/pdo/tests/pdo_001.phpt
================================================================================
# original source file: ext/pdo/tests/pdo_001.phpt
array(3) {
[0]=>
array(2) {
["id"]=>
string(1) "1"
["val"]=>
string(1) "A"
}
[1]=>
array(2) {
["id"]=>
string(1) "2"
["val"]=>
string(1) "B"
}
[2]=>
array(2) {
["id"]=>
string(1) "3"
["val"]=>
string(1) "C"
}
}
================================================================================
001+ # original source file: ext/pdo/tests/pdo_001.phpt
================================================================================
================================================================================
/root/src/php-5.2.3/ext/pdo/tests/pdo_002.phpt
================================================================================
# original source file: ext/pdo/tests/pdo_002.phpt
array(3) {
[0]=>
array(2) {
[0]=>
string(1) "1"
[1]=>
string(1) "A"
}
[1]=>
array(2) {
[0]=>
string(1) "2"
[1]=>
string(1) "B"
}
[2]=>
array(2) {
[0]=>
string(1) "3"
[1]=>
string(1) "C"
}
}
================================================================================
001+ # original source file: ext/pdo/tests/pdo_002.phpt
================================================================================
================================================================================
/root/src/php-5.2.3/ext/pdo/tests/pdo_003.phpt
================================================================================
# original source file: ext/pdo/tests/pdo_003.phpt
array(3) {
[0]=>
array(4) {
["id"]=>
string(1) "1"
[0]=>
string(1) "1"
["val"]=>
string(1) "A"
[1]=>
string(1) "A"
}
[1]=>
array(4) {
["id"]=>
string(1) "2"
[0]=>
string(1) "2"
["val"]=>
string(1) "B"
[1]=>
string(1) "B"
}
[2]=>
array(4) {
["id"]=>
string(1) "3"
[0]=>
string(1) "3"
["val"]=>
string(1) "C"
[1]=>
string(1) "C"
}
}
================================================================================
001+ # original source file: ext/pdo/tests/pdo_003.phpt
================================================================================
================================================================================
/root/src/php-5.2.3/ext/pdo/tests/pdo_004.phpt
================================================================================
# original source file: ext/pdo/tests/pdo_004.phpt
array(3) {
[0]=>
object(stdClass)#3 (2) {
["id"]=>
string(1) "1"
["val"]=>
string(1) "A"
}
[1]=>
object(stdClass)#4 (2) {
["id"]=>
string(1) "2"
["val"]=>
string(1) "B"
}
[2]=>
object(stdClass)#5 (2) {
["id"]=>
string(1) "3"
["val"]=>
string(1) "C"
}
}
================================================================================
001+ # original source file: ext/pdo/tests/pdo_004.phpt
================================================================================
================================================================================
/root/src/php-5.2.3/ext/pdo/tests/pdo_005.phpt
================================================================================
# original source file: ext/pdo/tests/pdo_005.phpt
array(3) {
[0]=>
object(stdClass)#3 (3) {
["id"]=>
string(1) "1"
["val"]=>
string(1) "A"
["val2"]=>
string(2) "AA"
}
[1]=>
object(stdClass)#4 (3) {
["id"]=>
string(1) "2"
["val"]=>
string(1) "B"
["val2"]=>
string(2) "BB"
}
[2]=>
object(stdClass)#5 (3) {
["id"]=>
string(1) "3"
["val"]=>
string(1) "C"
["val2"]=>
string(2) "CC"
}
}
array(3) {
[0]=>
object(TestBase)#5 (3) {
["id"]=>
string(1) "1"
["val:protected"]=>
string(1) "A"
["val2:private"]=>
string(2) "AA"
}
[1]=>
object(TestBase)#4 (3) {
["id"]=>
string(1) "2"
["val:protected"]=>
string(1) "B"
["val2:private"]=>
string(2) "BB"
}
[2]=>
object(TestBase)#3 (3) {
["id"]=>
string(1) "3"
["val:protected"]=>
string(1) "C"
["val2:private"]=>
string(2) "CC"
}
}
TestDerived::__construct(0,1)
TestDerived::__construct(1,2)
TestDerived::__construct(2,3)
array(3) {
[0]=>
object(TestDerived)#3 (5) {
["row:protected"]=>
int(0)
["id"]=>
string(1) "1"
["val:protected"]=>
string(1) "A"
["val2:private"]=>
NULL
["val2"]=>
string(2) "AA"
}
[1]=>
object(TestDerived)#4 (5) {
["row:protected"]=>
int(1)
["id"]=>
string(1) "2"
["val:protected"]=>
string(1) "B"
["val2:private"]=>
NULL
["val2"]=>
string(2) "BB"
}
[2]=>
object(TestDerived)#5 (5) {
["row:protected"]=>
int(2)
["id"]=>
string(1) "3"
["val:protected"]=>
string(1) "C"
["val2:private"]=>
NULL
["val2"]=>
string(2) "CC"
}
}
================================================================================
001+ # original source file: ext/pdo/tests/pdo_005.phpt
================================================================================
================================================================================
/root/src/php-5.2.3/ext/pdo/tests/pdo_006.phpt
================================================================================
# original source file: ext/pdo/tests/pdo_006.phpt
array(2) {
["A"]=>
array(2) {
[0]=>
array(1) {
[0]=>
string(1) "1"
}
[1]=>
array(1) {
[0]=>
string(1) "2"
}
}
["C"]=>
array(1) {
[0]=>
array(1) {
[0]=>
string(1) "3"
}
}
}
array(2) {
["A"]=>
array(2) {
[0]=>
array(1) {
["id"]=>
string(1) "1"
}
[1]=>
array(1) {
["id"]=>
string(1) "2"
}
}
["C"]=>
array(1) {
[0]=>
array(1) {
["id"]=>
string(1) "3"
}
}
}
================================================================================
001+ # original source file: ext/pdo/tests/pdo_006.phpt
================================================================================
================================================================================
/root/src/php-5.2.3/ext/pdo/tests/pdo_007.phpt
================================================================================
# original source file: ext/pdo/tests/pdo_007.phpt
array(3) {
["A"]=>
array(1) {
[0]=>
string(1) "A"
}
["B"]=>
array(1) {
[0]=>
string(1) "A"
}
["C"]=>
array(1) {
[0]=>
string(1) "C"
}
}
array(3) {
["A"]=>
array(1) {
["val"]=>
string(1) "A"
}
["B"]=>
array(1) {
["val"]=>
string(1) "A"
}
["C"]=>
array(1) {
["val"]=>
string(1) "C"
}
}
================================================================================
001+ # original source file: ext/pdo/tests/pdo_007.phpt
================================================================================
================================================================================
/root/src/php-5.2.3/ext/pdo/tests/pdo_008.phpt
================================================================================
# original source file: ext/pdo/tests/pdo_008.phpt
array(2) {
["A"]=>
array(1) {
[0]=>
string(1) "B"
}
["C"]=>
array(1) {
[0]=>
string(1) "C"
}
}
================================================================================
001+ # original source file: ext/pdo/tests/pdo_008.phpt
================================================================================
================================================================================
/root/src/php-5.2.3/ext/pdo/tests/pdo_009.phpt
================================================================================
# original source file: ext/pdo/tests/pdo_009.phpt
array(4) {
[0]=>
array(3) {
[0]=>
string(8) "stdClass"
[1]=>
string(1) "1"
[2]=>
string(1) "A"
}
[1]=>
array(3) {
[0]=>
string(5) "Test1"
[1]=>
string(1) "2"
[2]=>
string(1) "B"
}
[2]=>
array(3) {
[0]=>
string(5) "Test2"
[1]=>
string(1) "3"
[2]=>
string(1) "C"
}
[3]=>
array(3) {
[0]=>
NULL
[1]=>
string(1) "4"
[2]=>
string(1) "D"
}
}
Test1::__construct()
Test2::__construct()
Test3::__construct()
array(4) {
[0]=>
object(stdClass)#3 (2) {
["id"]=>
string(1) "1"
["val"]=>
string(1) "A"
}
[1]=>
object(Test1)#4 (2) {
["id"]=>
string(1) "2"
["val"]=>
string(1) "B"
}
[2]=>
object(Test2)#5 (2) {
["id"]=>
string(1) "3"
["val"]=>
string(1) "C"
}
[3]=>
object(Test3)#6 (2) {
["id"]=>
string(1) "4"
["val"]=>
string(1) "D"
}
}
================================================================================
001+ # original source file: ext/pdo/tests/pdo_009.phpt
================================================================================
================================================================================
/root/src/php-5.2.3/ext/pdo/tests/pdo_010.phpt
================================================================================
# original source file: ext/pdo/tests/pdo_010.phpt
Test1::__construct()
Test2::__construct()
Test3::__construct()
array(2) {
["Group1"]=>
array(2) {
[0]=>
object(stdClass)#3 (2) {
["id"]=>
string(1) "1"
["val"]=>
string(1) "A"
}
[1]=>
object(Test1)#4 (2) {
["id"]=>
string(1) "2"
["val"]=>
string(1) "B"
}
}
["Group2"]=>
array(2) {
[0]=>
object(Test2)#5 (2) {
["id"]=>
string(1) "3"
["val"]=>
string(1) "C"
}
[1]=>
object(Test3)#6 (2) {
["id"]=>
string(1) "4"
["val"]=>
string(1) "D"
}
}
}
Test1::__construct()
Test2::__construct()
Test3::__construct()
array(2) {
["Group1"]=>
object(Test1)#5 (2) {
["id"]=>
string(1) "2"
["val"]=>
string(1) "B"
}
["Group2"]=>
object(Test3)#4 (2) {
["id"]=>
string(1) "4"
["val"]=>
string(1) "D"
}
}
================================================================================
001+ # original source file: ext/pdo/tests/pdo_010.phpt
================================================================================
================================================================================
/root/src/php-5.2.3/ext/pdo/tests/pdo_011.phpt
================================================================================
# original source file: ext/pdo/tests/pdo_011.phpt
DerivedStatement::__construct(Overloaded)
Test1::__construct(0,0)
test(1,N/A)
test(2,N/A)
test(3,N/A)
test(4,N/A)
array(2) {
["Group1"]=>
array(2) {
[0]=>
array(1) {
[1]=>
string(3) "N/A"
}
[1]=>
array(1) {
[2]=>
string(3) "N/A"
}
}
["Group2"]=>
array(2) {
[0]=>
array(1) {
[3]=>
string(3) "N/A"
}
[1]=>
array(1) {
[4]=>
string(3) "N/A"
}
}
}
test(1,A)
test(2,B)
test(3,C)
test(4,D)
array(4) {
[0]=>
array(1) {
[1]=>
string(1) "A"
}
[1]=>
array(1) {
[2]=>
string(1) "B"
}
[2]=>
array(1) {
[3]=>
string(1) "C"
}
[3]=>
array(1) {
[4]=>
string(1) "D"
}
}
Test1::factory(1,A)
Test1::__construct(1,A)
Test1::factory(2,B)
Test1::__construct(2,B)
Test1::factory(3,C)
Test1::__construct(3,C)
Test1::factory(4,D)
Test1::__construct(4,D)
array(4) {
[0]=>
object(Test1)#6 (2) {
["id"]=>
string(1) "1"
["val"]=>
string(1) "A"
}
[1]=>
object(Test1)#7 (2) {
["id"]=>
string(1) "2"
["val"]=>
string(1) "B"
}
[2]=>
object(Test1)#8 (2) {
["id"]=>
string(1) "3"
["val"]=>
string(1) "C"
}
[3]=>
object(Test1)#9 (2) {
["id"]=>
string(1) "4"
["val"]=>
string(1) "D"
}
}
Test1::factory(1,A)
Test1::__construct(1,A)
Test1::factory(2,B)
Test1::__construct(2,B)
Test1::factory(3,C)
Test1::__construct(3,C)
Test1::factory(4,D)
Test1::__construct(4,D)
array(4) {
[0]=>
object(Test1)#9 (2) {
["id"]=>
string(1) "1"
["val"]=>
string(1) "A"
}
[1]=>
object(Test1)#8 (2) {
["id"]=>
string(1) "2"
["val"]=>
string(1) "B"
}
[2]=>
object(Test1)#7 (2) {
["id"]=>
string(1) "3"
["val"]=>
string(1) "C"
}
[3]=>
object(Test1)#6 (2) {
["id"]=>
string(1) "4"
["val"]=>
string(1) "D"
}
}
string(16) "DerivedStatement"
DerivedStatement::reTrieve(1,A)
DerivedStatement::reTrieve(2,B)
DerivedStatement::reTrieve(3,C)
DerivedStatement::reTrieve(4,D)
array(4) {
[0]=>
array(1) {
[1]=>
string(1) "A"
}
[1]=>
array(1) {
[2]=>
string(1) "B"
}
[2]=>
array(1) {
[3]=>
string(1) "C"
}
[3]=>
array(1) {
[4]=>
string(1) "D"
}
}
DerivedStatement::reTrieve(1,A)
DerivedStatement::reTrieve(2,B)
DerivedStatement::reTrieve(3,C)
DerivedStatement::reTrieve(4,D)
array(4) {
[0]=>
array(1) {
[1]=>
string(1) "A"
}
[1]=>
array(1) {
[2]=>
string(1) "B"
}
[2]=>
array(1) {
[3]=>
string(1) "C"
}
[3]=>
array(1) {
[4]=>
string(1) "D"
}
}
DerivedStatement::reTrieve(1,A)
DerivedStatement::reTrieve(2,B)
DerivedStatement::reTrieve(3,C)
DerivedStatement::reTrieve(4,D)
array(4) {
[0]=>
array(1) {
[1]=>
string(1) "A"
}
[1]=>
array(1) {
[2]=>
string(1) "B"
}
[2]=>
array(1) {
[3]=>
string(1) "C"
}
[3]=>
array(1) {
[4]=>
string(1) "D"
}
}
================================================================================
001+ # original source file: ext/pdo/tests/pdo_011.phpt
================================================================================
================================================================================
/root/src/php-5.2.3/ext/pdo/tests/pdo_012.phpt
================================================================================
# original source file: ext/pdo/tests/pdo_012.phpt
array(2) {
[0]=>
array(2) {
[0]=>
string(1) "A"
[1]=>
string(6) "Group1"
}
[1]=>
array(2) {
[0]=>
string(1) "B"
[1]=>
string(6) "Group2"
}
}
Test::__construct(N/A)
Test::__construct(N/A)
array(2) {
[0]=>
object(Test)#3 (2) {
["val"]=>
string(1) "A"
["grp"]=>
string(6) "Group1"
}
[1]=>
object(Test)#4 (2) {
["val"]=>
string(1) "B"
["grp"]=>
string(6) "Group2"
}
}
Test::__construct(Changed)
Test::__construct(Changed)
array(2) {
[0]=>
object(Test)#4 (2) {
["val"]=>
string(1) "A"
["grp"]=>
string(6) "Group1"
}
[1]=>
object(Test)#3 (2) {
["val"]=>
string(1) "B"
["grp"]=>
string(6) "Group2"
}
}
================================================================================
001+ # original source file: ext/pdo/tests/pdo_012.phpt
================================================================================
================================================================================
/root/src/php-5.2.3/ext/pdo/tests/pdo_013.phpt
================================================================================
# original source file: ext/pdo/tests/pdo_013.phpt
array(2) {
[0]=>
string(1) "A"
[1]=>
string(6) "Group1"
}
array(2) {
[0]=>
string(1) "B"
[1]=>
string(6) "Group2"
}
Test::__construct(N/A)
object(Test)#3 (2) {
["val"]=>
string(1) "A"
["grp"]=>
string(6) "Group1"
}
Test::__construct(N/A)
object(Test)#2 (2) {
["val"]=>
string(1) "B"
["grp"]=>
string(6) "Group2"
}
Test::__construct(WOW)
object(Test)#3 (2) {
["val"]=>
string(1) "A"
["grp"]=>
string(6) "Group1"
}
Test::__construct(WOW)
object(Test)#2 (2) {
["val"]=>
string(1) "B"
["grp"]=>
string(6) "Group2"
}
================================================================================
001+ # original source file: ext/pdo/tests/pdo_013.phpt
================================================================================
================================================================================
/root/src/php-5.2.3/ext/pdo/tests/pdo_014.phpt
================================================================================
# original source file: ext/pdo/tests/pdo_014.phpt
Test::__construct(WOW)
object(Test)#4 (2) {
["val"]=>
string(1) "A"
["grp"]=>
string(6) "Group1"
}
Test::__construct(WOW)
object(Test)#6 (2) {
["val"]=>
string(1) "B"
["grp"]=>
string(6) "Group2"
}
NULL
bool(false)
PDOStatementAggregate::__construct
PDOStatementAggregate::getIterator
array(2) {
[0]=>
string(1) "A"
[1]=>
string(6) "Group1"
}
array(2) {
[0]=>
string(1) "B"
[1]=>
string(6) "Group2"
}
================================================================================
001+ # original source file: ext/pdo/tests/pdo_014.phpt
================================================================================
================================================================================
/root/src/php-5.2.3/ext/pdo/tests/pdo_015.phpt
================================================================================
# original source file: ext/pdo/tests/pdo_015.phpt
array(2) {
[0]=>
string(1) "1"
[1]=>
string(1) "2"
}
array(2) {
[0]=>
string(2) "A2"
[1]=>
string(2) "B2"
}
array(2) {
[1]=>
array(1) {
[0]=>
string(1) "A"
}
[2]=>
array(1) {
[0]=>
string(1) "A"
}
}
array(2) {
[1]=>
string(1) "A"
[2]=>
string(1) "A"
}
array(2) {
[1]=>
string(1) "1"
[2]=>
string(1) "2"
}
array(2) {
[1]=>
string(1) "A"
[2]=>
string(1) "A"
}
array(2) {
[1]=>
string(2) "A2"
[2]=>
string(2) "B2"
}
array(1) {
["A"]=>
array(2) {
[0]=>
string(2) "A2"
[1]=>
string(2) "B2"
}
}
================================================================================
001+ # original source file: ext/pdo/tests/pdo_015.phpt
================================================================================
================================================================================
/root/src/php-5.2.3/ext/pdo/tests/pdo_016.phpt
================================================================================
# original source file: ext/pdo/tests/pdo_016.phpt
string(1) "3"
array(3) {
[0]=>
string(7) "String0"
[1]=>
string(7) "String1"
[2]=>
string(7) "String2"
}
===WHILE===
array(1) {
[0]=>
string(7) "String0"
}
array(1) {
[1]=>
string(7) "String1"
}
array(1) {
[2]=>
string(7) "String2"
}
===ALONE===
array(1) {
[0]=>
string(7) "String0"
}
bool(true)
bool(true)
bool(true)
bool(true)
array(1) {
[0]=>
string(7) "String0"
}
array(1) {
[1]=>
string(7) "String1"
}
bool(true)
bool(true)
bool(true)
bool(true)
array(1) {
[1]=>
string(7) "String1"
}
array(1) {
[2]=>
string(7) "String2"
}
bool(true)
bool(true)
bool(true)
bool(true)
array(1) {
[2]=>
string(7) "String2"
}
===REBIND/SAME===
array(1) {
[0]=>
string(7) "String0"
}
bool(true)
bool(true)
string(7) "String0"
bool(true)
bool(true)
string(1) "0"
array(1) {
[1]=>
string(7) "String1"
}
bool(true)
bool(true)
string(7) "String1"
bool(true)
bool(true)
string(1) "1"
array(1) {
[2]=>
string(7) "String2"
}
bool(true)
bool(true)
string(7) "String2"
bool(true)
bool(true)
string(1) "2"
===REBIND/CONFLICT===
string(7) "String0"
string(7) "String1"
string(7) "String2"
================================================================================
001+ # original source file: ext/pdo/tests/pdo_016.phpt
================================================================================
================================================================================
/root/src/php-5.2.3/ext/pdo/tests/pdo_016a.phpt
================================================================================
# original source file: ext/pdo/tests/pdo_016a.phpt
string(1) "3"
array(3) {
[0]=>
string(7) "String0"
[1]=>
string(7) "String1"
[2]=>
string(7) "String2"
}
===WHILE===
array(1) {
[0]=>
string(7) "String0"
}
array(1) {
[1]=>
string(7) "String1"
}
array(1) {
[2]=>
string(7) "String2"
}
===ALONE===
array(1) {
[0]=>
string(7) "String0"
}
bool(true)
bool(true)
bool(true)
bool(true)
array(1) {
[0]=>
string(7) "String0"
}
array(1) {
[1]=>
string(7) "String1"
}
bool(true)
bool(true)
bool(true)
bool(true)
array(1) {
[1]=>
string(7) "String1"
}
array(1) {
[2]=>
string(7) "String2"
}
bool(true)
bool(true)
bool(true)
bool(true)
array(1) {
[2]=>
string(7) "String2"
}
===REBIND/SAME===
array(1) {
[0]=>
string(7) "String0"
}
bool(true)
bool(true)
string(7) "String0"
bool(true)
bool(true)
string(1) "0"
array(1) {
[1]=>
string(7) "String1"
}
bool(true)
bool(true)
string(7) "String1"
bool(true)
bool(true)
string(1) "1"
array(1) {
[2]=>
string(7) "String2"
}
bool(true)
bool(true)
string(7) "String2"
bool(true)
bool(true)
string(1) "2"
===REBIND/CONFLICT===
string(7) "String0"
string(7) "String1"
string(7) "String2"
================================================================================
001+ # original source file: ext/pdo/tests/pdo_016a.phpt
================================================================================
================================================================================
/root/src/php-5.2.3/ext/pdo/tests/pdo_017.phpt
================================================================================
# original source file: ext/pdo/tests/pdo_017.phpt
Counted 3 rows after insert.
Counted 0 rows after delete.
Counted 3 rows after rollback.
Counted 0 rows after delete.
Counted 0 rows after commit.
================================================================================
001+ # original source file: ext/pdo/tests/pdo_017.phpt
================================================================================
================================================================================
/root/src/php-5.2.3/ext/pdo/tests/pdo_018.phpt
================================================================================
# original source file: ext/pdo/tests/pdo_018.phpt
string(1) "3"
array(3) {
[0]=>
string(8) "stdClass"
[1]=>
string(8) "TestBase"
[2]=>
string(11) "TestDerived"
}
===TYPES===
array(4) {
["stdClass"]=>
string(1) "0"
["TestBase"]=>
string(1) "1"
["TestDerived"]=>
string(1) "2"
["TestLeaf"]=>
NULL
}
===INSERT===
TestBase::serialize() =
'a:3:{s:7:"BasePub";s:6:"Public";s:7:"BasePro";s:9:"Protected";s:7:"BasePri";s:7:"Private";}'
TestDerived::serialize()
TestBase::serialize() =
'a:4:{s:7:"BasePub";s:13:"DerivedPublic";s:7:"BasePro";s:16:"DerivdeProtected";s:10:"DerivedPub";s:6:"Public";s:10:"DerivedPro";s:9:"Protected";}'
TestDerived::serialize()
TestBase::serialize() =
'a:4:{s:7:"BasePub";s:13:"DerivedPublic";s:7:"BasePro";s:16:"DerivdeProtected";s:10:"DerivedPub";s:6:"Public";s:10:"DerivedPro";s:9:"Protected";}'
===DATA===
array(4) {
[0]=>
string(0) ""
[1]=>
string(91)
"a:3:{s:7:"BasePub";s:6:"Public";s:7:"BasePro";s:9:"Protected";s:7:"BasePri";s:7:"Private";}"
[2]=>
string(144)
"a:4:{s:7:"BasePub";s:13:"DerivedPublic";s:7:"BasePro";s:16:"DerivdeProtected";s:10:"DerivedPub";s:6:"Public";s:10:"DerivedPro";s:9:"Protected";}"
[3]=>
string(144)
"a:4:{s:7:"BasePub";s:13:"DerivedPublic";s:7:"BasePro";s:16:"DerivdeProtected";s:10:"DerivedPub";s:6:"Public";s:10:"DerivedPro";s:9:"Protected";}"
}
===FAILURE===
Exception:SQLSTATE[HY000]: General error: cannot unserialize class
===COUNT===
string(1) "3"
===DATABASE===
array(3) {
[0]=>
array(2) {
["name"]=>
string(8) "TestBase"
["val"]=>
string(91)
"a:3:{s:7:"BasePub";s:6:"Public";s:7:"BasePro";s:9:"Protected";s:7:"BasePri";s:7:"Private";}"
}
[1]=>
array(2) {
["name"]=>
string(11) "TestDerived"
["val"]=>
string(144)
"a:4:{s:7:"BasePub";s:13:"DerivedPublic";s:7:"BasePro";s:16:"DerivdeProtected";s:10:"DerivedPub";s:6:"Public";s:10:"DerivedPro";s:9:"Protected";}"
}
[2]=>
array(2) {
["name"]=>
NULL
["val"]=>
string(144)
"a:4:{s:7:"BasePub";s:13:"DerivedPublic";s:7:"BasePro";s:16:"DerivdeProtected";s:10:"DerivedPub";s:6:"Public";s:10:"DerivedPro";s:9:"Protected";}"
}
}
===FETCHCLASS===
TestBase::unserialize(a:3:{s:7:"BasePub";s:6:"Public";s:7:"BasePro";s:9:"Protected";s:7:"BasePri";s:7:"Private";})
TestDerived::unserialize()
TestBase::unserialize(a:4:{s:7:"BasePub";s:13:"DerivedPublic";s:7:"BasePro";s:16:"DerivdeProtected";s:10:"DerivedPub";s:6:"Public";s:10:"DerivedPro";s:9:"Protected";})
TestDerived::unserialize()
TestBase::unserialize(a:4:{s:7:"BasePub";s:13:"DerivedPublic";s:7:"BasePro";s:16:"DerivdeProtected";s:10:"DerivedPub";s:6:"Public";s:10:"DerivedPro";s:9:"Protected";})
array(3) {
[0]=>
object(TestBase)#8 (3) {
["BasePub"]=>
string(7) "#Public"
["BasePro:protected"]=>
string(10) "#Protected"
["BasePri:private"]=>
string(8) "#Private"
}
[1]=>
object(TestDerived)#9 (6) {
["BasePub"]=>
string(14) "#DerivedPublic"
["BasePro:protected"]=>
string(17) "#DerivdeProtected"
["DerivedPub"]=>
string(7) "#Public"
["DerivedPro:protected"]=>
string(10) "#Protected"
["DerivedPri:private"]=>
string(7) "Private"
["BasePri:private"]=>
string(7) "Private"
}
[2]=>
object(TestLeaf)#10 (6) {
["BasePub"]=>
string(14) "#DerivedPublic"
["BasePro:protected"]=>
string(17) "#DerivdeProtected"
["DerivedPub"]=>
string(7) "#Public"
["DerivedPro:protected"]=>
string(10) "#Protected"
["DerivedPri:private"]=>
string(7) "Private"
["BasePri:private"]=>
string(7) "Private"
}
}
================================================================================
001+ # original source file: ext/pdo/tests/pdo_018.phpt
================================================================================
================================================================================
/root/src/php-5.2.3/ext/pdo/tests/pdo_019.phpt
================================================================================
# original source file: ext/pdo/tests/pdo_019.phpt
string(1) "4"
array(4) {
[0]=>
string(7) "String0"
[1]=>
string(7) "String1"
[2]=>
string(7) "String2"
[3]=>
string(7) "String3"
}
===WHILE===
array(1) {
[0]=>
string(7) "String0"
}
array(1) {
[1]=>
string(7) "String1"
}
array(1) {
[2]=>
string(7) "String2"
}
array(1) {
[3]=>
string(7) "String3"
}
================================================================================
001+ # original source file: ext/pdo/tests/pdo_019.phpt
================================================================================
================================================================================
/root/src/php-5.2.3/ext/pdo/tests/pdo_020.phpt
================================================================================
# original source file: ext/pdo/tests/pdo_020.phpt
Counted 2 columns after SELECT id, val FROM test.
Counted 3 columns after SELECT id, val, val2 FROM test.
Counted 1 columns after SELECT COUNT(*) FROM test.
================================================================================
001+ # original source file: ext/pdo/tests/pdo_020.phpt
================================================================================
================================================================================
/root/src/php-5.2.3/ext/pdo/tests/pdo_021.phpt
================================================================================
# original source file: ext/pdo/tests/pdo_021.phpt
There are 6 rows in the table.
There are 12 rows in the table.
================================================================================
001+ # original source file: ext/pdo/tests/pdo_021.phpt
================================================================================
================================================================================
/root/src/php-5.2.3/ext/pdo/tests/pdo_023.phpt
================================================================================
# original source file: ext/pdo/tests/pdo_023.phpt
int(1)
int(2)
object(PDODatabaseX)#1 (2) {
["test1"]=>
int(1)
["test2"]=>
int(22)
}
PDODatabaseX::query()
PDOStatementX::__construct()
PDOStatementX::__destruct()
PDODatabaseX::query()
PDOStatementX::__construct()
PDOStatementX::__destruct()
PDODatabaseX::query()
PDOStatementX::__construct()
PDOStatementX::__destruct()
PDODatabaseX::query()
PDOStatementX::__construct()
object(PDOStatementX)#2 (3) {
["test1"]=>
int(1)
["queryString"]=>
string(24) "SELECT val, id FROM test"
["test2"]=>
int(22)
}
array(2) {
["A"]=>
string(1) "0"
["B"]=>
string(1) "1"
}
PDOStatementX::__destruct()
PDODatabaseX::__destruct()
================================================================================
001+ # original source file: ext/pdo/tests/pdo_023.phpt
================================================================================
================================================================================
/root/src/php-5.2.3/ext/pdo/tests/pdo_024.phpt
================================================================================
# original source file: ext/pdo/tests/pdo_024.phpt
bind: success
bool(true)
NULL
================================================================================
001+ # original source file: ext/pdo/tests/pdo_024.phpt
================================================================================
================================================================================
/root/src/php-5.2.3/ext/pdo/tests/pdo_025.phpt
================================================================================
# original source file: ext/pdo/tests/pdo_025.phpt
object(Test)#2 (3) {
["id"]=>
string(2) "10"
["val"]=>
string(3) "Abc"
["val2"]=>
string(3) "zxy"
}
object(Test)#2 (3) {
["id"]=>
string(2) "20"
["val"]=>
string(3) "Def"
["val2"]=>
string(3) "wvu"
}
object(Test)#2 (3) {
["id"]=>
string(2) "30"
["val"]=>
string(3) "Ghi"
["val2"]=>
string(3) "tsr"
}
object(Test)#2 (3) {
["id"]=>
string(2) "40"
["val"]=>
string(3) "Jkl"
["val2"]=>
string(3) "qpo"
}
object(Test)#2 (3) {
["id"]=>
string(2) "50"
["val"]=>
string(3) "Mno"
["val2"]=>
string(3) "nml"
}
object(Test)#2 (3) {
["id"]=>
string(2) "60"
["val"]=>
string(3) "Pqr"
["val2"]=>
string(3) "kji"
}
===FAIL===
Fatal error: Cannot access protected property Fail::$id in
/root/src/php-5.2.3/ext/sqlite/tests/pdo/pdo_025.php on line 48
================================================================================
001+ # original source file: ext/pdo/tests/pdo_025.phpt
================================================================================
================================================================================
/root/src/php-5.2.3/ext/pdo/tests/pdo_026.phpt
================================================================================
# original source file: ext/pdo/tests/pdo_026.phpt
string(11) "PDODatabase"
string(12) "PDOStatement"
PDODatabase::query()
PDOStatementX::__construct()
string(13) "PDOStatementX"
string(11) "PDODatabase"
array(3) {
["id"]=>
string(2) "10"
["val"]=>
string(3) "Abc"
["val2"]=>
string(3) "zxy"
}
array(3) {
["id"]=>
string(2) "20"
["val"]=>
string(3) "Def"
["val2"]=>
string(3) "wvu"
}
array(3) {
["id"]=>
string(2) "30"
["val"]=>
string(3) "Ghi"
["val2"]=>
string(3) "tsr"
}
===DONE===
PDOStatementX::__destruct()
PDODatabase::__destruct()
================================================================================
001+ # original source file: ext/pdo/tests/pdo_026.phpt
================================================================================
================================================================================
/root/src/php-5.2.3/ext/pdo/tests/pdo_027.phpt
================================================================================
# original source file: ext/pdo/tests/pdo_027.phpt
lazy: 1test1
lazy: 2test2
End
================================================================================
001+ # original source file: ext/pdo/tests/pdo_027.phpt
================================================================================
================================================================================
/root/src/php-5.2.3/ext/pdo/tests/pdo_028.phpt
================================================================================
# original source file: ext/pdo/tests/pdo_028.phpt
array(1) {
[0]=>
array(4) {
["id"]=>
string(1) "1"
["val1"]=>
string(3) "one"
["val2"]=>
string(3) "two"
["val3"]=>
string(5) "three"
}
}
================================================================================
001+ # original source file: ext/pdo/tests/pdo_028.phpt
================================================================================
================================================================================
/root/src/php-5.2.3/ext/pdo/tests/pdo_029.phpt
================================================================================
# original source file: ext/pdo/tests/pdo_029.phpt
string(11) "PDODatabase"
string(12) "PDOStatement"
===QUERY===
PDODatabase::query()
PDOStatementX::__construct()
PDOStatementX::execute()
string(13) "PDOStatementX"
string(11) "PDODatabase"
===FOREACH===
array(3) {
["id"]=>
string(2) "10"
["val"]=>
string(3) "Abc"
["val2"]=>
string(3) "zxy"
}
array(3) {
["id"]=>
string(2) "20"
["val"]=>
string(3) "Def"
["val2"]=>
string(3) "wvu"
}
array(3) {
["id"]=>
string(2) "30"
["val"]=>
string(3) "Ghi"
["val2"]=>
string(3) "tsr"
}
===DONE===
PDOStatementX::__destruct()
PDODatabase::__destruct()
================================================================================
001+ # original source file: ext/pdo/tests/pdo_029.phpt
================================================================================
================================================================================
/root/src/php-5.2.3/ext/pdo/tests/pdo_030.phpt
================================================================================
# original source file: ext/pdo/tests/pdo_030.phpt
string(11) "PDODatabase"
string(12) "PDOStatement"
===QUERY===
array(1) {
[0]=>
string(12) "PDOStatement"
}
array(2) {
[0]=>
string(13) "PDOStatementX"
[1]=>
array(1) {
[0]=>
object(PDODatabase)#1 (0) {
}
}
}
PDODatabase::query()
PDOStatementX::__construct()
string(13) "PDOStatementX"
string(11) "PDODatabase"
===FOREACH===
array(3) {
["id"]=>
string(2) "10"
["val"]=>
string(3) "Abc"
["val2"]=>
string(3) "zxy"
}
array(3) {
["id"]=>
string(2) "20"
["val"]=>
string(3) "Def"
["val2"]=>
string(3) "wvu"
}
array(3) {
["id"]=>
string(2) "30"
["val"]=>
string(3) "Ghi"
["val2"]=>
string(3) "tsr"
}
===DONE===
PDOStatementX::__destruct()
PDODatabase::__destruct()
================================================================================
001+ # original source file: ext/pdo/tests/pdo_030.phpt
================================================================================
================================================================================
/root/src/php-5.2.3/ext/pdo/tests/pdo_031.phpt
================================================================================
# original source file: ext/pdo/tests/pdo_031.phpt
===QUERY===
|-Array [0]
| |-10 [id]
| |-Abc [val]
| \-zxy [val2]
|-Array [1]
| |-20 [id]
| |-Def [val]
| \-wvu [val2]
\-Array [2]
|-30 [id]
|-Ghi [val]
\-tsr [val2]
===DONE===
================================================================================
001+ # original source file: ext/pdo/tests/pdo_031.phpt
================================================================================
================================================================================
/root/src/php-5.2.3/ext/pdo/tests/pdo_032.phpt
================================================================================
# original source file: ext/pdo/tests/pdo_032.phpt
array(3) {
[0]=>
array(2) {
["id"]=>
string(1) "1"
["val"]=>
string(1) "A"
}
[1]=>
array(2) {
["id"]=>
string(1) "2"
["val"]=>
string(1) "B"
}
[2]=>
array(2) {
["id"]=>
string(1) "3"
["val"]=>
string(1) "C"
}
}
array(3) {
[0]=>
array(2) {
["ID"]=>
string(1) "1"
["VAL"]=>
string(1) "A"
}
[1]=>
array(2) {
["ID"]=>
string(1) "2"
["VAL"]=>
string(1) "B"
}
[2]=>
array(2) {
["ID"]=>
string(1) "3"
["VAL"]=>
string(1) "C"
}
}
================================================================================
001+ # original source file: ext/pdo/tests/pdo_032.phpt
================================================================================
================================================================================
/root/src/php-5.2.3/ext/pdo/tests/pdo_033.phpt
================================================================================
# original source file: ext/pdo/tests/pdo_033.phpt
Array
(
[0] => Array
(
[t] =>
!"#$%&'()*+,-./0123456789:;<=>?@ABCDEFGHIJKLMNOPQRSTUVWXYZ[\]^_`abcdefghijklmnopqrstuvwxyz{|}~
)
)
================================================================================
001+ # original source file: ext/pdo/tests/pdo_033.phpt
================================================================================
================================================================================
/root/src/php-5.2.3/ext/pdo/tests/pdo_034.phpt
================================================================================
# original source file: ext/pdo/tests/pdo_034.phpt
array(1) {
["test0"]=>
string(1) "0"
}
array(5) {
[0]=>
array(1) {
["test0"]=>
string(1) "0"
}
[1]=>
array(1) {
["test1"]=>
string(1) "1"
}
[2]=>
array(1) {
["test2"]=>
string(1) "2"
}
[3]=>
array(1) {
["test3"]=>
string(1) "3"
}
[4]=>
array(1) {
["test4"]=>
string(1) "4"
}
}
Warning: PDOStatement::fetch(): SQLSTATE[HY000]: General error: PDO::FETCH_KEY_PAIR fetch mode
requires the result set to contain extactly 2 columns. in
/root/src/php-5.2.3/ext/sqlite/tests/pdo/pdo_034.php on line 16
Warning: PDOStatement::fetch(): SQLSTATE[HY000]: General error in
/root/src/php-5.2.3/ext/sqlite/tests/pdo/pdo_034.php on line 16
bool(false)
================================================================================
001+ # original source file: ext/pdo/tests/pdo_034.phpt
================================================================================
================================================================================
/root/src/php-5.2.3/ext/pdo/tests/pecl_bug_5217.phpt
================================================================================
# original source file: ext/pdo/tests/pecl_bug_5217.phpt
Safely caught You cannot serialize or unserialize PDO instances
PHP Didn't crash!
================================================================================
001+ # original source file: ext/pdo/tests/pecl_bug_5217.phpt
================================================================================
================================================================================
/root/src/php-5.2.3/ext/pdo/tests/pecl_bug_5772.phpt
================================================================================
# original source file: ext/pdo/tests/pecl_bug_5772.phpt
string(1) "1"
================================================================================
001+ # original source file: ext/pdo/tests/pecl_bug_5772.phpt
================================================================================
================================================================================
/root/src/php-5.2.3/ext/pdo/tests/pecl_bug_5809.phpt
================================================================================
# original source file: ext/pdo/tests/pecl_bug_5809.phpt
array(1) {
[0]=>
int(1)
}
array(1) {
[0]=>
int(1)
}
================================================================================
001+ # original source file: ext/pdo/tests/pecl_bug_5809.phpt
================================================================================
================================================================================
/root/src/php-5.2.3/ext/standard/tests/strings/strripos_offset.phpt
================================================================================
bool(false)
int(2)
bool(false)
bool(false)
Warning: strripos() expects parameter 1 to be string, array given in
/root/src/php-5.2.3/ext/standard/tests/strings/strripos_offset.php on line 7
bool(false)
Notice: strripos(): Offset is greater than the length of haystack string in
/root/src/php-5.2.3/ext/standard/tests/strings/strripos_offset.php on line 8
bool(false)
Notice: strripos(): Offset is greater than the length of haystack string in
/root/src/php-5.2.3/ext/standard/tests/strings/strripos_offset.php on line 9
bool(false)
bool(false)
bool(false)
Done
================================================================================
001- Notice: strripos(): Offset is greater than the length of haystack string in %s on line %d
002+ int(2)
003+ bool(false)
004+ bool(false)
004- Notice: strripos(): Offset is greater than the length of haystack string in %s on line %d
006+ Warning: strripos() expects parameter 1 to be string, array given in
/root/src/php-5.2.3/ext/standard/tests/strings/strripos_offset.php on line 7
012-
013- Warning: strripos() expects parameter 1 to be string, array given in %s on line %d
014+ bool(false)
015-
016+ Done
016- Notice: strripos(): Offset is greater than the length of haystack string in %s on line %d
017- bool(false)
018-
019- Notice: strripos(): Offset is greater than the length of haystack string in %s on line %d
020- bool(false)
021-
022- Notice: strripos(): Offset is greater than the length of haystack string in %s on line %d
023- bool(false)
024-
025- Notice: strripos(): Offset is greater than the length of haystack string in %s on line %d
026- bool(false)
027- Done
================================================================================
================================================================================
BUILD ENVIRONMENT
================================================================================
OS:
Linux - Linux gifo1 2.6.15-1.2054_FC5smp #1 SMP Tue Mar 14 16:05:46 EST 2006 i686
Autoconf:
autoconf (GNU Autoconf) 2.59
Written by David J. MacKenzie and Akim Demaille.
Copyright (C) 2003 Free Software Foundation, Inc.
This is free software; see the source for copying conditions. There is NO
warranty; not even for MERCHANTABILITY or FITNESS FOR A PARTICULAR PURPOSE.
Bundled Libtool:
ltmain.sh (GNU libtool) 1.5.20 (1.1220.2.287 2005/08/31 18:54:15)
Copyright (C) 2005 Free Software Foundation, Inc.
This is free software; see the source for copying conditions. There is NO
warranty; not even for MERCHANTABILITY or FITNESS FOR A PARTICULAR PURPOSE.
System Libtool:
ltmain.sh (GNU libtool) 1.5.22 (1.1220.2.365 2005/12/18 22:14:06)
Copyright (C) 2005 Free Software Foundation, Inc.
This is free software; see the source for copying conditions. There is NO
warranty; not even for MERCHANTABILITY or FITNESS FOR A PARTICULAR PURPOSE.
Compiler:
Utilisation des specs internes.
Target: i386-redhat-linux
Configuré avec: ../configure --prefix=/usr --mandir=/usr/share/man --infodir=/usr/share/info
--enable-shared --enable-threads=posix --enable-checking=release --with-system-zlib
--enable-__cxa_atexit --disable-libunwind-exceptions --enable-libgcj-multifile
--enable-languages=c,c++,objc,obj-c++,java,fortran,ada --enable-java-awt=gtk --disable-dssi
--with-java-home=/usr/lib/jvm/java-1.4.2-gcj-1.4.2.0/jre --with-cpu=generic --host=i386-redhat-linux
Modèle de thread: posix
version gcc 4.1.1 20060525 (Red Hat 4.1.1-1)
Bison:
bison (GNU Bison) 2.1
Ãcrit par Robert Corbett et Richard Stallman.
Copyright © 2005 Free Software Foundation, Inc.
Ce logiciel est libre; voir les sources pour les conditions de
reproduction. AUCUNE garantie n'est donnée; tant pour des raisons
COMMERCIALES que pour RÃPONDRE Ã UN BESOIN PARTICULIER.
Libraries:
linux-gate.so.1 => (0x0065b000)
libcrypt.so.1 => /lib/libcrypt.so.1 (0x00678000)
libpq.so.4 => /usr/lib/libpq.so.4 (0x0028d000)
librt.so.1 => /lib/librt.so.1 (0x00851000)
libpng12.so.0 => /usr/lib/libpng12.so.0 (0x004fc000)
libz.so.1 => /usr/lib/libz.so.1 (0x0012e000)
libresolv.so.2 => /lib/libresolv.so.2 (0x00d79000)
libm.so.6 => /lib/libm.so.6 (0x00141000)
libdl.so.2 => /lib/libdl.so.2 (0x00265000)
libnsl.so.1 => /lib/libnsl.so.1 (0x00661000)
libxml2.so.2 => /usr/lib/libxml2.so.2 (0x058d2000)
libc.so.6 => /lib/libc.so.6 (0x002ae000)
libssl.so.6 => /lib/libssl.so.6 (0x0588b000)
libcrypto.so.6 => /lib/libcrypto.so.6 (0x05310000)
libkrb5.so.3 => /usr/lib/libkrb5.so.3 (0x05814000)
libpthread.so.0 => /lib/libpthread.so.0 (0x003ec000)
/lib/ld-linux.so.2 (0x00113000)
libgssapi_krb5.so.2 => /usr/lib/libgssapi_krb5.so.2 (0x05447000)
libcom_err.so.2 => /lib/libcom_err.so.2 (0x00d8e000)
libk5crypto.so.3 => /usr/lib/libk5crypto.so.3 (0x00d93000)
libkrb5support.so.0 => /usr/lib/libkrb5support.so.0 (0x00dba000)
User's E-mail:
================================================================================
PHPINFO
================================================================================
phpinfo()
PHP Version => 5.2.3
System => Linux gifo1 2.6.15-1.2054_FC5smp #1 SMP Tue Mar 14 16:05:46 EST 2006 i686
Build Date => Jul 16 2007 21:25:01
Configure Command => './configure' '--prefix=/usr/local/apache/php'
'--with-gd' '--with-pgsql' '--with-apxs2=/usr/local/apache/bin/apxs'
'--with-json' '--with-pdo'
Server API => Command Line Interface
Virtual Directory Support => disabled
Configuration File (php.ini) Path => /usr/local/apache/php/lib
Loaded Configuration File => /usr/local/apache/php/php.ini
PHP API => 20041225
PHP Extension => 20060613
Zend Extension => 220060519
Debug Build => no
Thread Safety => disabled
Zend Memory Manager => enabled
IPv6 Support => enabled
Registered PHP Streams => php, file, data, http, ftp
Registered Stream Socket Transports => tcp, udp, unix, udg
Registered Stream Filters => string.rot13, string.toupper, string.tolower, string.strip_tags,
convert.*, consumed, convert.iconv.*
This program makes use of the Zend Scripting Language Engine:
Zend Engine v2.2.0, Copyright (c) 1998-2007 Zend Technologies
with NuSphere PhpExpress v1.4.1, Copyright (c) 2002-2007 NuSphere Corp., by Dmitri Dmitrienko
_______________________________________________________________________
Configuration
PHP Core
Directive => Local Value => Master Value
allow_call_time_pass_reference => Off => Off
allow_url_fopen => On => On
allow_url_include => Off => Off
always_populate_raw_post_data => Off => Off
arg_separator.input => & => &
arg_separator.output => & => &
asp_tags => Off => Off
auto_append_file => no value => no value
auto_globals_jit => On => On
auto_prepend_file => no value => no value
browscap => no value => no value
default_charset => no value => no value
default_mimetype => text/html => text/html
define_syslog_variables => Off => Off
disable_classes => no value => no value
disable_functions => no value => no value
display_errors => On => On
display_startup_errors => Off => Off
doc_root => no value => no value
docref_ext => no value => no value
docref_root => no value => no value
enable_dl => On => On
error_append_string => no value => no value
error_log => no value => no value
error_prepend_string => no value => no value
error_reporting => 6143 => 6143
expose_php => On => On
extension_dir => /usr/lib/php/modules => /usr/lib/php/modules
file_uploads => On => On
highlight.bg => <font style="color: #FFFFFF">#FFFFFF</font> => <font
style="color: #FFFFFF">#FFFFFF</font>
highlight.comment => <font style="color: #FF8000">#FF8000</font> =>
<font style="color: #FF8000">#FF8000</font>
highlight.default => <font style="color: #0000BB">#0000BB</font> =>
<font style="color: #0000BB">#0000BB</font>
highlight.html => <font style="color: #000000">#000000</font> =>
<font style="color: #000000">#000000</font>
highlight.keyword => <font style="color: #007700">#007700</font> =>
<font style="color: #007700">#007700</font>
highlight.string => <font style="color: #DD0000">#DD0000</font> =>
<font style="color: #DD0000">#DD0000</font>
html_errors => Off => Off
ignore_repeated_errors => Off => Off
ignore_repeated_source => Off => Off
ignore_user_abort => Off => Off
implicit_flush => On => On
include_path => .:/php/includes:/u/genetics/include => .:/php/includes:/u/genetics/include
log_errors => On => On
log_errors_max_len => 1024 => 1024
magic_quotes_gpc => Off => Off
magic_quotes_runtime => Off => Off
magic_quotes_sybase => Off => Off
mail.force_extra_parameters => no value => no value
max_execution_time => 0 => 0
max_input_nesting_level => 64 => 64
max_input_time => -1 => -1
memory_limit => 8M => 8M
open_basedir => no value => no value
output_buffering => 0 => 0
output_handler => no value => no value
post_max_size => 8M => 8M
precision => 14 => 14
realpath_cache_size => 16K => 16K
realpath_cache_ttl => 120 => 120
register_argc_argv => On => On
register_globals => Off => Off
register_long_arrays => Off => Off
report_memleaks => On => On
report_zend_debug => Off => Off
safe_mode => Off => Off
safe_mode_exec_dir => no value => no value
safe_mode_gid => Off => Off
safe_mode_include_dir => no value => no value
sendmail_from => no value => no value
sendmail_path => /usr/sbin/sendmail -t -i => /usr/sbin/sendmail -t -i
serialize_precision => 100 => 100
short_open_tag => On => On
SMTP => localhost => localhost
smtp_port => 25 => 25
sql.safe_mode => Off => Off
track_errors => Off => Off
unserialize_callback_func => no value => no value
upload_max_filesize => 2M => 2M
upload_tmp_dir => no value => no value
user_dir => no value => no value
variables_order => EGPCS => EGPCS
xmlrpc_error_number => 0 => 0
xmlrpc_errors => Off => Off
y2k_compliance => On => On
zend.ze1_compatibility_mode => Off => Off
ctype
ctype functions => enabled
date
date/time support => enabled
"Olson" Timezone Database Version => 2007.5
Timezone Database => internal
Default timezone => Europe/Berlin
Directive => Local Value => Master Value
date.default_latitude => 31.7667 => 31.7667
date.default_longitude => 35.2333 => 35.2333
date.sunrise_zenith => 90.583333 => 90.583333
date.sunset_zenith => 90.583333 => 90.583333
date.timezone => no value => no value
dom
DOM/XML => enabled
DOM/XML API Version => 20031129
libxml Version => 2.6.23
HTML Support => enabled
XPath Support => enabled
XPointer Support => enabled
Schema Support => enabled
RelaxNG Support => enabled
filter
Input Validation and Filtering => enabled
Revision => $Revision: 1.52.2.39 $
Directive => Local Value => Master Value
filter.default => unsafe_raw => unsafe_raw
filter.default_flags => no value => no value
gd
GD Support => enabled
GD Version => bundled (2.0.34 compatible)
GIF Read Support => enabled
GIF Create Support => enabled
PNG Support => enabled
WBMP Support => enabled
XBM Support => enabled
hash
hash support => enabled
Hashing Engines => md2 md4 md5 sha1 sha256 sha384 sha512 ripemd128 ripemd160 ripemd256 ripemd320
whirlpool tiger128,3 tiger160,3 tiger192,3 tiger128,4 tiger160,4 tiger192,4 snefru gost adler32
crc32 crc32b haval128,3 haval160,3 haval192,3 haval224,3 haval256,3 haval128,4 haval160,4 haval192,4
haval224,4 haval256,4 haval128,5 haval160,5 haval192,5 haval224,5 haval256,5
iconv
iconv support => enabled
iconv implementation => glibc
iconv library version => 2.4
Directive => Local Value => Master Value
iconv.input_encoding => ISO-8859-1 => ISO-8859-1
iconv.internal_encoding => ISO-8859-1 => ISO-8859-1
iconv.output_encoding => ISO-8859-1 => ISO-8859-1
json
json support => enabled
json version => 1.2.1
libxml
libXML support => active
libXML Version => 2.6.23
libXML streams => enabled
NuSphere PhpExpress
PhpExpress support => enabled
Version => 1.4.1
Directive => Local Value => Master Value
phpexpress.cache => On => On
pcre
PCRE (Perl Compatible Regular Expressions) Support => enabled
PCRE Library Version => 7.0 18-Dec-2006
PDO
PDO support => enabled
PDO drivers => sqlite2, sqlite
pdo_sqlite
PDO Driver for SQLite 3.x => enabled
PECL Module version => (bundled) 1.0.1 $Id: pdo_sqlite.c,v 1.10.2.6.2.2 2007/03/23 14:30:00 wez
Exp $
SQLite Library => 3.3.17
pgsql
PostgreSQL Support => enabled
PostgreSQL(libpq) Version => 8.1.9
Multibyte character support => enabled
SSL support => enabled
Active Persistent Links => 0
Active Links => 0
Directive => Local Value => Master Value
pgsql.allow_persistent => On => On
pgsql.auto_reset_persistent => Off => Off
pgsql.ignore_notice => Off => Off
pgsql.log_notice => Off => Off
pgsql.max_links => Unlimited => Unlimited
pgsql.max_persistent => Unlimited => Unlimited
posix
Revision => $Revision: 1.70.2.3.2.15 $
Reflection
Reflection => enabled
Version => $Id: php_reflection.c,v 1.164.2.33.2.39 2007/05/29 08:44:05 helly Exp $
session
Session Support => enabled
Registered save handlers => files user sqlite
Registered serializer handlers => php php_binary
Directive => Local Value => Master Value
session.auto_start => Off => Off
session.bug_compat_42 => Off => Off
session.bug_compat_warn => On => On
session.cache_expire => 180 => 180
session.cache_limiter => nocache => nocache
session.cookie_domain => no value => no value
session.cookie_httponly => Off => Off
session.cookie_lifetime => 0 => 0
session.cookie_path => / => /
session.cookie_secure => Off => Off
session.entropy_file => no value => no value
session.entropy_length => 0 => 0
session.gc_divisor => 1000 => 1000
session.gc_maxlifetime => 1440 => 1440
session.gc_probability => 1 => 1
session.hash_bits_per_character => 5 => 5
session.hash_function => 0 => 0
session.name => PHPSESSID => PHPSESSID
session.referer_check => no value => no value
session.save_handler => files => files
session.save_path => /var/lib/php/session => /var/lib/php/session
session.serialize_handler => php => php
session.use_cookies => On => On
session.use_only_cookies => Off => Off
session.use_trans_sid => 0 => 0
SimpleXML
Simplexml support => enabled
Revision => $Revision: 1.151.2.22.2.26 $
Schema support => enabled
SPL
SPL support => enabled
Interfaces => Countable, OuterIterator, RecursiveIterator, SeekableIterator, SplObserver,
SplSubject
Classes => AppendIterator, ArrayIterator, ArrayObject, BadFunctionCallException,
BadMethodCallException, CachingIterator, DirectoryIterator, DomainException, EmptyIterator,
FilterIterator, InfiniteIterator, InvalidArgumentException, IteratorIterator, LengthException,
LimitIterator, LogicException, NoRewindIterator, OutOfBoundsException, OutOfRangeException,
OverflowException, ParentIterator, RangeException, RecursiveArrayIterator, RecursiveCachingIterator,
RecursiveDirectoryIterator, RecursiveFilterIterator, RecursiveIteratorIterator,
RecursiveRegexIterator, RegexIterator, RuntimeException, SimpleXMLIterator, SplFileInfo,
SplFileObject, SplObjectStorage, SplTempFileObject, UnderflowException, UnexpectedValueException
SQLite
SQLite support => enabled
PECL Module version => 2.0-dev $Id: sqlite.c,v 1.166.2.13.2.9 2007/05/19 17:58:22 iliaa Exp $
SQLite Library => 2.8.17
SQLite Encoding => iso8859
Directive => Local Value => Master Value
sqlite.assoc_case => 0 => 0
standard
Regex Library => Bundled library enabled
Dynamic Library Support => enabled
Path to sendmail => /usr/sbin/sendmail -t -i
Directive => Local Value => Master Value
assert.active => 1 => 1
assert.bail => 0 => 0
assert.callback => no value => no value
assert.quiet_eval => 0 => 0
assert.warning => 1 => 1
auto_detect_line_endings => 0 => 0
default_socket_timeout => 60 => 60
safe_mode_allowed_env_vars => PHP_ => PHP_
safe_mode_protected_env_vars => LD_LIBRARY_PATH => LD_LIBRARY_PATH
url_rewriter.tags => a=href,area=href,frame=src,input=src,form=fakeentry =>
a=href,area=href,frame=src,input=src,form=fakeentry
user_agent => no value => no value
tokenizer
Tokenizer Support => enabled
xml
XML Support => active
XML Namespace Support => active
libxml2 Version => 2.6.23
xmlreader
XMLReader => enabled
xmlwriter
XMLWriter => enabled
Additional Modules
Module Name
Environment
Variable => Value
HOSTNAME => gifo1
TEST_PHP_SRCDIR => /root/src/php-5.2.3
SHELL => /bin/sh
TERM => xterm
MAKEFLAGS =>
HISTSIZE => 1000
SSH_CLIENT => deleted
SSH_TTY => deleted
USER => root
LS_COLORS =>
no=00:fi=00:di=00;34:ln=00;36:pi=40;33:so=00;35:bd=40;33;01:cd=40;33;01:or=01;05;37;41:mi=01;05;37;41:ex=00;32:*.cmd=00;32:*.exe=00;32:*.com=00;32:*.btm=00;32:*.bat=00;32:*.sh=00;32:*.csh=00;32:*.tar=00;31:*.tgz=00;31:*.arj=00;31:*.taz=00;31:*.lzh=00;31:*.zip=00;31:*.z=00;31:*.Z=00;31:*.gz=00;31:*.bz2=00;31:*.bz=00;31:*.tz=00;31:*.rpm=00;31:*.cpio=00;31:*.jpg=00;35:*.gif=00;35:*.bmp=00;35:*.xbm=00;35:*.xpm=00;35:*.png=00;35:*.tif=00;35:
SSH_AUTH_SOCK => deleted
KDEDIR => /usr
MAKELEVEL => 1
MFLAGS =>
PATH =>
/usr/kerberos/sbin:/usr/kerberos/bin:/usr/local/sbin:/usr/local/bin:/sbin:/bin:/usr/sbin:/usr/bin:/root/bin
MAIL => /var/spool/mail/root
_ => /root/src/php-5.2.3/sapi/cli/php
PWD => /root/src/php-5.2.3
INPUTRC => /etc/inputrc
LANG => fr_FR.UTF-8
TEST_PHP_EXECUTABLE => /root/src/php-5.2.3/sapi/cli/php
SSH_ASKPASS => /usr/libexec/openssh/gnome-ssh-askpass
HOME => /root
SHLVL => 3
LOGNAME => root
CVS_RSH => ssh
SSH_CONNECTION => deleted
LESSOPEN => |/usr/bin/lesspipe.sh %s
CC => gcc
G_BROKEN_FILENAMES => 1
PHP Variables
Variable => Value
_SERVER["HOSTNAME"] => gifo1
_SERVER["TEST_PHP_SRCDIR"] => /root/src/php-5.2.3
_SERVER["SHELL"] => /bin/sh
_SERVER["TERM"] => xterm
_SERVER["MAKEFLAGS"] =>
_SERVER["HISTSIZE"] => 1000
_SERVER["SSH_CLIENT"] => deleted
_SERVER["SSH_TTY"] => deleted
_SERVER["USER"] => root
_SERVER["LS_COLORS"] =>
no=00:fi=00:di=00;34:ln=00;36:pi=40;33:so=00;35:bd=40;33;01:cd=40;33;01:or=01;05;37;41:mi=01;05;37;41:ex=00;32:*.cmd=00;32:*.exe=00;32:*.com=00;32:*.btm=00;32:*.bat=00;32:*.sh=00;32:*.csh=00;32:*.tar=00;31:*.tgz=00;31:*.arj=00;31:*.taz=00;31:*.lzh=00;31:*.zip=00;31:*.z=00;31:*.Z=00;31:*.gz=00;31:*.bz2=00;31:*.bz=00;31:*.tz=00;31:*.rpm=00;31:*.cpio=00;31:*.jpg=00;35:*.gif=00;35:*.bmp=00;35:*.xbm=00;35:*.xpm=00;35:*.png=00;35:*.tif=00;35:
_SERVER["SSH_AUTH_SOCK"] => deleted
_SERVER["KDEDIR"] => /usr
_SERVER["MAKELEVEL"] => 1
_SERVER["MFLAGS"] =>
_SERVER["PATH"] =>
/usr/kerberos/sbin:/usr/kerberos/bin:/usr/local/sbin:/usr/local/bin:/sbin:/bin:/usr/sbin:/usr/bin:/root/bin
_SERVER["MAIL"] => /var/spool/mail/root
_SERVER["_"] => /root/src/php-5.2.3/sapi/cli/php
_SERVER["PWD"] => /root/src/php-5.2.3
_SERVER["INPUTRC"] => /etc/inputrc
_SERVER["LANG"] => fr_FR.UTF-8
_SERVER["TEST_PHP_EXECUTABLE"] => /root/src/php-5.2.3/sapi/cli/php
_SERVER["SSH_ASKPASS"] => /usr/libexec/openssh/gnome-ssh-askpass
_SERVER["HOME"] => /root
_SERVER["SHLVL"] => 3
_SERVER["LOGNAME"] => root
_SERVER["CVS_RSH"] => ssh
_SERVER["SSH_CONNECTION"] => deleted
_SERVER["LESSOPEN"] => |/usr/bin/lesspipe.sh %s
_SERVER["CC"] => gcc
_SERVER["G_BROKEN_FILENAMES"] => 1
_SERVER["PHP_SELF"] =>
_SERVER["SCRIPT_NAME"] =>
_SERVER["SCRIPT_FILENAME"] =>
_SERVER["PATH_TRANSLATED"] =>
_SERVER["DOCUMENT_ROOT"] =>
_SERVER["REQUEST_TIME"] => 1184614020
_SERVER["argv"] => Array
(
)
_SERVER["argc"] => 0
_ENV["HOSTNAME"] => gifo1
_ENV["TEST_PHP_SRCDIR"] => /root/src/php-5.2.3
_ENV["SHELL"] => /bin/sh
_ENV["TERM"] => xterm
_ENV["MAKEFLAGS"] =>
_ENV["HISTSIZE"] => 1000
_ENV["SSH_CLIENT"] => deleted
_ENV["SSH_TTY"] => deleted
_ENV["USER"] => root
_ENV["LS_COLORS"] =>
no=00:fi=00:di=00;34:ln=00;36:pi=40;33:so=00;35:bd=40;33;01:cd=40;33;01:or=01;05;37;41:mi=01;05;37;41:ex=00;32:*.cmd=00;32:*.exe=00;32:*.com=00;32:*.btm=00;32:*.bat=00;32:*.sh=00;32:*.csh=00;32:*.tar=00;31:*.tgz=00;31:*.arj=00;31:*.taz=00;31:*.lzh=00;31:*.zip=00;31:*.z=00;31:*.Z=00;31:*.gz=00;31:*.bz2=00;31:*.bz=00;31:*.tz=00;31:*.rpm=00;31:*.cpio=00;31:*.jpg=00;35:*.gif=00;35:*.bmp=00;35:*.xbm=00;35:*.xpm=00;35:*.png=00;35:*.tif=00;35:
_ENV["SSH_AUTH_SOCK"] => deleted
_ENV["KDEDIR"] => /usr
_ENV["MAKELEVEL"] => 1
_ENV["MFLAGS"] =>
_ENV["PATH"] =>
/usr/kerberos/sbin:/usr/kerberos/bin:/usr/local/sbin:/usr/local/bin:/sbin:/bin:/usr/sbin:/usr/bin:/root/bin
_ENV["MAIL"] => /var/spool/mail/root
_ENV["_"] => /root/src/php-5.2.3/sapi/cli/php
_ENV["PWD"] => /root/src/php-5.2.3
_ENV["INPUTRC"] => /etc/inputrc
_ENV["LANG"] => fr_FR.UTF-8
_ENV["TEST_PHP_EXECUTABLE"] => /root/src/php-5.2.3/sapi/cli/php
_ENV["SSH_ASKPASS"] => /usr/libexec/openssh/gnome-ssh-askpass
_ENV["HOME"] => /root
_ENV["SHLVL"] => 3
_ENV["LOGNAME"] => root
_ENV["CVS_RSH"] => ssh
_ENV["SSH_CONNECTION"] => deleted
_ENV["LESSOPEN"] => |/usr/bin/lesspipe.sh %s
_ENV["CC"] => gcc
_ENV["G_BROKEN_FILENAMES"] => 1
PHP License
This program is free software; you can redistribute it and/or modify
it under the terms of the PHP License as published by the PHP Group
and included in the distribution in the file: LICENSE
This program is distributed in the hope that it will be useful,
but WITHOUT ANY WARRANTY; without even the implied warranty of
MERCHANTABILITY or FITNESS FOR A PARTICULAR PURPOSE.
If you did not receive a copy of the PHP license, or have any
questions about PHP licensing, please contact license@php.net.