Test results for 4.4.7 [failed]

From: Date: Wed, 25 Jul 2007 14:15:16 +0000
Subject: Test results for 4.4.7 [failed]
Groups: php.qa 
Request: Send a blank email to php-qa+get-41744@lists.php.net to get a copy of this message
===================================================================== FAILED TEST SUMMARY --------------------------------------------------------------------- Error message handling (with ZendOptimizer) [tests/run-test/test008.phpt] Bug #35239 (Objects can lose references) [tests/lang/bug35239.phpt] Bug #16069 [ext/iconv/tests/bug16069.phpt] bug #31454 (session_set_save_handler crashes PHP when supplied non-existent object ref) [ext/session/tests/bug31454.phpt] Bug #28325 (Problem in serialisation of circular references) [ext/standard/tests/serialize/bug28325.phpt] xslt_set_object function [ext/xslt/tests/xslt_set_object.phpt] ===================================================================== ===================================================================== TEST RESULT SUMMARY --------------------------------------------------------------------- Exts skipped : 64 Exts tested : 22 --------------------------------------------------------------------- Number of tests : 635 Tests skipped : 159 (25.0%) Tests warned : 0 (0.0%) Tests failed : 6 (0.9%) Tests passed : 470 (74.0%) --------------------------------------------------------------------- Time taken : 104 seconds ===================================================================== ================================================================================ /src/php-4.4.7/tests/run-test/test008.phpt ================================================================================ ---- EXPECTED OUTPUT %s: %sivision by zero in %s on line %d string(1) "1" string(4) "2047" string(1) "0" string(1) "1" string(1) "0" string(%d) "%sivision by zer%s" string(%d) "%sivision by zer%s" ---- ACTUAL OUTPUT string(1) "1" string(4) "2047" string(1) "0" string(1) "1" string(1) "0" NULL string(16) "Division by zero" ---- FAILED ================================================================================ 001- %s: %sivision by zero in %s on line %d 001+ string(1) "1" 002- string(1) "1" 002+ string(4) "2047" 003- string(4) "2047" 003+ string(1) "0" 004- string(1) "0" 004+ string(1) "1" 005- string(1) "1" 005+ string(1) "0" 006- string(1) "0" 006+ NULL 007- string(%d) "%sivision by zer%s" 007+ string(16) "Division by zero" 008- string(%d) "%sivision by zer%s" ================================================================================ ================================================================================ /src/php-4.4.7/tests/lang/bug35239.phpt ================================================================================ ---- EXPECTED OUTPUT object(stdClass)(1) { ["x0"]=> &object(stdClass)(3) { ["y0"]=> string(1) "b" ["y1"]=> &object(stdClass)(3) { ["y0"]=> string(1) "b" ["y1"]=> *RECURSION* ["y2"]=> *RECURSION* } ["y2"]=> &object(stdClass)(3) { ["y0"]=> string(1) "b" ["y1"]=> *RECURSION* ["y2"]=> *RECURSION* } } } string(2) "ok" ---- ACTUAL OUTPUT object(stdClass)(1) { ["x0"]=> &object(stdClass)(3) { ["y0"]=> string(1) "b" ["y1"]=> &object(stdClass)(3) { ["y0"]=> string(1) "b" ["y1"]=> *RECURSION* ["y2"]=> *RECURSION* } ["y2"]=> &object(stdClass)(3) { ["y0"]=> string(1) "b" ["y1"]=> *RECURSION* ["y2"]=> *RECURSION* } } } NULL ---- FAILED ================================================================================ 026- string(2) "ok" 026+ NULL ================================================================================ ================================================================================ /src/php-4.4.7/ext/iconv/tests/bug16069.phpt ================================================================================ ---- EXPECTED OUTPUT ¥ß¥ê¥Ð¡¼¥ë¥ß¥ê¥Ð¡¼¥ë¥ß¥ê¥Ð¡¼¥ë¥ß¥ê¥Ð¡¼¥ë¥ß¥ê¥Ð¡¼¥ë¥ß¥ê¥Ð¡¼¥ë¥ß¥ê¥Ð¡¼¥ë¥ß¥ê¥Ð¡¼¥ë¥ß¥ê¥Ð¡¼¥ë¥ß¥ê¥Ð¡¼¥ë¥ß¥ê¥Ð¡¼¥ë¥ß¥ê¥Ð¡¼¥ë¥ß¥ê¥Ð¡¼¥ë¥ß¥ê¥Ð¡¼¥ë¥ß¥ê¥Ð¡¼¥ë¥ß¥ê¥Ð¡¼¥ë¥ß¥ê¥Ð¡¼¥ë¥ß¥ê¥Ð¡¼¥ë¥ß¥ê¥Ð¡¼¥ë¥ß¥ê¥Ð¡¼¥ë¥ß¥ê¥Ð¡¼¥ë¥ß¥ê¥Ð¡¼¥ë¥ß¥ê¥Ð¡¼¥ë¥ß¥ê¥Ð¡¼¥ë¥ß¥ê¥Ð¡¼¥ë¥ß¥ê¥Ð¡¼¥ë¥ß¥ê¥Ð¡¼¥ë¥ß¥ê¥Ð¡¼¥ë¥ß¥ê¥Ð¡¼¥ë¥ß¥ê¥Ð¡¼¥ë¥ß¥ê¥Ð¡¼¥ë¥ß¥ê¥Ð¡¼¥ë¥ß¥ê¥Ð¡¼¥ë¥ß¥ê¥Ð¡¼¥ë¥ß¥ê¥Ð¡¼¥ë¥ß¥ê¥Ð¡¼¥ë¥ß¥ê¥Ð¡¼¥ë¥ß¥ê¥Ð¡¼¥ë¥ß¥ê¥Ð¡¼¥ë¥ß¥ê¥Ð¡¼¥ë(¡ë§¥¡ë) ---- ACTUAL OUTPUT ¥ß¥ê¥Ð¡¼¥ë¥ß¥ê¥Ð¡¼¥ë¥ß¥ê¥Ð¡¼¥ë¥ß¥ê¥Ð¡¼¥ë¥ß¥ê¥Ð¡¼¥ë¥ß¥ê¥Ð¡¼¥ë¥ß¥ê¥Ð¡¼¥ë¥ß¥ê¥Ð¡¼¥ë¥ß¥ê¥Ð¡¼¥ë¥ß¥ê¥Ð¡¼¥ë¥ß¥ê¥Ð¡¼¥ë¥ß¥ß¥ê¥Ð¡¼¥ë¥ß¥ê¥Ð¡¼¥ë¥ß¥ê¥Ð¡¼¥ë¥ß¥ê¥Ð¡¼¥ë¥ß¥ê¥Ð¡¼¥ë¥ß¥ê¥Ð¡¼¥ë¥ß¥ê¥Ð¡¼¥ë¥ß¥ê¥Ð¡¼¥ë¥ß¥ê¥Ð¡¼¥ë¥ß¥ê¥Ð¡¼¥ë¥ß¥ê¥Ð¡¼¥ë¥ß¥ê¥Ð¡¼¥ë¥ß¥ê¥Ð¡¼¥ë¥ß¥ê¥Ð¡¼¥ë¥ß¥ê¥Ð¡¼¥ë¥ß¥ê¥Ð¡¼¥ë¥ß¥ê¥Ð¡¼¥ë¥ß¥ê¥Ð¡¼¥ë¥ß¥ê¥Ð¡¼¥ë¥ß¥ê¥Ð¡¼¥ë¥ß¥ê¥Ð¡¼¥ë¥ß¥ê¥Ð¡¼¥ë¥ß¥ê¥Ð¡¼¥ë¥ß¥ê¥Ð¡¼¥ë¥ß¥ê¥Ð¡¼¥ë¥ß¥ê¥Ð¡¼¥ë¥ß¥ê¥Ð¡¼¥ë¥ß¥ê¥Ð¡¼¥ë¥ß¥ê¥Ð¡¼¥ë(¡ë§¥¡ë) ---- FAILED ================================================================================ 001- ¥ß¥ê¥Ð¡¼¥ë¥ß¥ê¥Ð¡¼¥ë¥ß¥ê¥Ð¡¼¥ë¥ß¥ê¥Ð¡¼¥ë¥ß¥ê¥Ð¡¼¥ë¥ß¥ê¥Ð¡¼¥ë¥ß¥ê¥Ð¡¼¥ë¥ß¥ê¥Ð¡¼¥ë¥ß¥ê¥Ð¡¼¥ë¥ß¥ê¥Ð¡¼¥ë¥ß¥ê¥Ð¡¼¥ë¥ß¥ê¥Ð¡¼¥ë¥ß¥ê¥Ð¡¼¥ë¥ß¥ê¥Ð¡¼¥ë¥ß¥ê¥Ð¡¼¥ë¥ß¥ê¥Ð¡¼¥ë¥ß¥ê¥Ð¡¼¥ë¥ß¥ê¥Ð¡¼¥ë¥ß¥ê¥Ð¡¼¥ë¥ß¥ê¥Ð¡¼¥ë¥ß¥ê¥Ð¡¼¥ë¥ß¥ê¥Ð¡¼¥ë¥ß¥ê¥Ð¡¼¥ë¥ß¥ê¥Ð¡¼¥ë¥ß¥ê¥Ð¡¼¥ë¥ß¥ê¥Ð¡¼¥ë¥ß¥ê¥Ð¡¼¥ë¥ß¥ê¥Ð¡¼¥ë¥ß¥ê¥Ð¡¼¥ë¥ß¥ê¥Ð¡¼¥ë¥ß¥ê¥Ð¡¼¥ë¥ß¥ê¥Ð¡¼¥ë¥ß¥ê¥Ð¡¼¥ë¥ß¥ê¥Ð¡¼¥ë¥ß¥ê¥Ð¡¼¥ë¥ß¥ê¥Ð¡¼¥ë¥ß¥ê¥Ð¡¼¥ë¥ß¥ê¥Ð¡¼¥ë¥ß¥ê¥Ð¡¼¥ë¥ß¥ê¥Ð¡¼¥ë(¡ë§¥¡ë) 001+ ¥ß¥ê¥Ð¡¼¥ë¥ß¥ê¥Ð¡¼¥ë¥ß¥ê¥Ð¡¼¥ë¥ß¥ê¥Ð¡¼¥ë¥ß¥ê¥Ð¡¼¥ë¥ß¥ê¥Ð¡¼¥ë¥ß¥ê¥Ð¡¼¥ë¥ß¥ê¥Ð¡¼¥ë¥ß¥ê¥Ð¡¼¥ë¥ß¥ê¥Ð¡¼¥ë¥ß¥ê¥Ð¡¼¥ë¥ß¥ß¥ê¥Ð¡¼¥ë¥ß¥ê¥Ð¡¼¥ë¥ß¥ê¥Ð¡¼¥ë¥ß¥ê¥Ð¡¼¥ë¥ß¥ê¥Ð¡¼¥ë¥ß¥ê¥Ð¡¼¥ë¥ß¥ê¥Ð¡¼¥ë¥ß¥ê¥Ð¡¼¥ë¥ß¥ê¥Ð¡¼¥ë¥ß¥ê¥Ð¡¼¥ë¥ß¥ê¥Ð¡¼¥ë¥ß¥ê¥Ð¡¼¥ë¥ß¥ê¥Ð¡¼¥ë¥ß¥ê¥Ð¡¼¥ë¥ß¥ê¥Ð¡¼¥ë¥ß¥ê¥Ð¡¼¥ë¥ß¥ê¥Ð¡¼¥ë¥ß¥ê¥Ð¡¼¥ë¥ß¥ê¥Ð¡¼¥ë¥ß¥ê¥Ð¡¼¥ë¥ß¥ê¥Ð¡¼¥ë¥ß¥ê¥Ð¡¼¥ë¥ß¥ê¥Ð¡¼¥ë¥ß¥ê¥Ð¡¼¥ë¥ß¥ê¥Ð¡¼¥ë¥ß¥ê¥Ð¡¼¥ë¥ß¥ê¥Ð¡¼¥ë¥ß¥ê¥Ð¡¼¥ë¥ß¥ê¥Ð¡¼¥ë(¡ë§¥¡ë) ================================================================================ ================================================================================ /src/php-4.4.7/ext/session/tests/bug31454.phpt ================================================================================ ---- EXPECTED OUTPUT Warning: session_set_save_handler() [/phpmanual/function.session-set-save-handler.html]: Argument 1 is not a valid callback in %sbug31454.php on line %d Done ---- ACTUAL OUTPUT Notice: Undefined variable: arf in /src/php-4.4.7/ext/session/tests/bug31454.php on line 4 Warning: session_set_save_handler() [/phpmanual/function.session-set-save-handler.html]: Argument 1 is not a valid callback in /src/php-4.4.7/ext/session/tests/bug31454.php on line 9 Done ---- FAILED ================================================================================ 001- Warning: session_set_save_handler() [/phpmanual/function.session-set-save-handler.html]: Argument 1 is not a valid callback in %sbug31454.php on line %d 001+ Notice: Undefined variable: arf in /src/php-4.4.7/ext/session/tests/bug31454.php on line 4 002- Done 002+ 003+ Warning: session_set_save_handler() [/phpmanual/function.session-set-save-handler.html]: Argument 1 is not a valid callback in /src/php-4.4.7/ext/session/tests/bug31454.php on line 9 004+ Done ================================================================================ ================================================================================ /src/php-4.4.7/ext/standard/tests/serialize/bug28325.phpt ================================================================================ ---- EXPECTED OUTPUT object(a)(1) { ["b"]=> object(b)(1) { ["c"]=> object(c)(1) { ["d"]=> object(a)(1) { ["b"]=> object(b)(1) { ["c"]=> object(c)(1) { ["d"]=> NULL } } } } } } ---- ACTUAL OUTPUT object(a)(1) { ["b"]=> object(b)(1) { ["c"]=> object(c)(1) { ["d"]=> object(a)(1) { ["b"]=> object(b)(1) { ["c"]=> object(c)(1) { ["d"]=> *RECURSION* } } } } } } ---- FAILED ================================================================================ 013- NULL 013+ *RECURSION* ================================================================================ ================================================================================ /src/php-4.4.7/ext/xslt/tests/xslt_set_object.phpt ================================================================================ ---- EXPECTED OUTPUT OK OK ---- ACTUAL OUTPUT Warning: Sablotron error on line 1: XML parser error 3: no element found in /src/php-4.4.7/ext/xslt/tests/xslt_set_object.php on line 19 Warning: Sablotron error on line 1: XML parser error 3: no element found in /src/php-4.4.7/ext/xslt/tests/xslt_set_object.php on line 30 OK OK ---- FAILED ================================================================================ 001- OK 001+ Warning: Sablotron error on line 1: XML parser error 3: no element found in /src/php-4.4.7/ext/xslt/tests/xslt_set_object.php on line 19 002- OK 002+ 003+ Warning: Sablotron error on line 1: XML parser error 3: no element found in /src/php-4.4.7/ext/xslt/tests/xslt_set_object.php on line 30 004+ OK 005+ OK ================================================================================ ================================================================================ BUILD ENVIRONMENT ================================================================================ OS: Linux - Linux theseus 2.4.21-47.0.1.ELsmp #1 SMP Fri Oct 13 17:56:20 EDT 2006 i686 Automake: automake (GNU automake) 1.6.3 Written by Tom Tromey <tromey@redhat.com>. Copyright 2002 Free Software Foundation, Inc. This is free software; see the source for copying conditions. There is NO warranty; not even for MERCHANTABILITY or FITNESS FOR A PARTICULAR PURPOSE. Autoconf: autoconf (GNU Autoconf) 2.57 Written by David J. MacKenzie and Akim Demaille. Copyright 2002 Free Software Foundation, Inc. This is free software; see the source for copying conditions. There is NO warranty; not even for MERCHANTABILITY or FITNESS FOR A PARTICULAR PURPOSE. Libtool: ltmain.sh (GNU libtool) 1.4.3 (1.922.2.111 2002/10/23 02:54:36) Compiler: Reading specs from /usr/lib/gcc-lib/i386-redhat-linux/3.2.3/specs Configured with: ../configure --prefix=/usr --mandir=/usr/share/man --infodir=/usr/share/info --enable-shared --enable-threads=posix --disable-checking --with-system-zlib --enable-__cxa_atexit --host=i386-redhat-linux Thread model: posix gcc version 3.2.3 20030502 (Red Hat Linux 3.2.3-59) Bison: bison (GNU Bison) 1.875c Written by Robert Corbett and Richard Stallman. Copyright (C) 2003 Free Software Foundation, Inc. This is free software; see the source for copying conditions. There is NO warranty; not even for MERCHANTABILITY or FITNESS FOR A PARTICULAR PURPOSE. Libraries: libcrypt.so.1 => /lib/libcrypt.so.1 (0x00b0b000) libsablot.so.0 => /usr/local/lib/libsablot.so.0 (0x006d2000) libjs.so => /usr/local/lib/libjs.so (0x00111000) libexpat.so.0 => /usr/lib/libexpat.so.0 (0x004c1000) libldap.so.2 => /usr/lib/libldap.so.2 (0x002d5000) liblber.so.2 => /usr/lib/liblber.so.2 (0x00572000) libz.so.1 => /usr/lib/libz.so.1 (0x001bd000) libcrack.so.2 => /usr/lib/libcrack.so.2 (0x001cb000) libresolv.so.2 => /lib/libresolv.so.2 (0x007f9000) libm.so.6 => /lib/tls/libm.so.6 (0x005ff000) libdl.so.2 => /lib/libdl.so.2 (0x001d5000) libnsl.so.1 => /lib/libnsl.so.1 (0x001d8000) libssl.so.4 => /lib/libssl.so.4 (0x00e3a000) libcrypto.so.4 => /lib/libcrypto.so.4 (0x002ff000) libgssapi_krb5.so.2 => /usr/kerberos/lib/libgssapi_krb5.so.2 (0x001ed000) libkrb5.so.3 => /usr/kerberos/lib/libkrb5.so.3 (0x00200000) libcom_err.so.3 => /usr/kerberos/lib/libcom_err.so.3 (0x006a3000) libk5crypto.so.3 => /usr/kerberos/lib/libk5crypto.so.3 (0x0025e000) libxml2.so.2 => /usr/lib/libxml2.so.2 (0x0080b000) libpthread.so.0 => /lib/tls/libpthread.so.0 (0x005df000) libclntsh.so.9.0 => /home/oracle/OraHome1/lib/libclntsh.so.9.0 (0x00e6e000) libc.so.6 => /lib/tls/libc.so.6 (0x0090d000) libstdc++.so.5 => /usr/lib/libstdc++.so.5 (0x00d49000) libgcc_s.so.1 => /lib/libgcc_s.so.1 (0x0044b000) libsasl.so.7 => /usr/lib/libsasl.so.7 (0x00270000) /lib/ld-linux.so.2 => /lib/ld-linux.so.2 (0x00c50000) libwtc9.so => /home/oracle/OraHome1/lib/libwtc9.so (0x0027c000) libgdbm.so.2 => /usr/lib/libgdbm.so.2 (0x0027f000) libpam.so.0 => /lib/libpam.so.0 (0x00286000) liblaus.so.1 => /lib/liblaus.so.1 (0x0028e000) User's E-mail: dan-chase at utc dot edu ================================================================================ PHPINFO ================================================================================ phpinfo() PHP Version => 4.4.7 System => Linux theseus 2.4.21-47.0.1.ELsmp #1 SMP Fri Oct 13 17:56:20 EDT 2006 i686 Build Date => Jul 25 2007 10:08:57 Configure Command => './configure' '--with-apxs2=/usr/local/httpd-2.2.4/bin/apxs' '--with-mysql' '--with-dom' '--with-xslt-sablot' '--with-sablot-js' '--enable-xslt' '--with-zlib-dir=/usr/lib' '--with-bz2-dir=/usr/bin' '--with-iconv' '--enable-sockets' '--with-openssl' '--with-ldap=/usr' '--with-ldap-sasl=/usr' '--enable-dbx' '--with-oci8=/home/oracle/OraHome1' '--with-oracle=/home/oracle/OraHome1' '--with-crack' '--with-tidy' '--enable-sigchild' '--enable-mbstring' Server API => Command Line Interface Virtual Directory Support => disabled Configuration File (php.ini) Path => /usr/local/lib/php.ini PHP API => 20020918 PHP Extension => 20020429 Zend Extension => 20050606 Debug Build => no Zend Memory Manager => enabled Thread Safety => disabled Registered PHP Streams => php, http, ftp, https, ftps, compress.zlib This program makes use of the Zend Scripting Language Engine: Zend Engine v1.3.0, Copyright (c) 1998-2004 Zend Technologies with Zend Extension Manager v1.2.0, Copyright (c) 2003-2007, by Zend Technologies with Zend Optimizer v3.2.8, Copyright (c) 1998-2007, by Zend Technologies _______________________________________________________________________ Configuration PHP Core Directive => Local Value => Master Value allow_call_time_pass_reference => On => On allow_url_fopen => On => On always_populate_raw_post_data => Off => Off arg_separator.input => & => & arg_separator.output => & => & asp_tags => Off => Off auto_append_file => no value => no value auto_prepend_file => no value => no value browscap => no value => no value default_charset => no value => no value default_mimetype => text/html => text/html define_syslog_variables => Off => Off disable_classes => no value => no value disable_functions => no value => no value display_errors => Off => Off display_startup_errors => Off => Off doc_root => no value => no value docref_ext => .html => .html docref_root => /phpmanual/ => /phpmanual/ enable_dl => On => On error_append_string => </font> => </font> error_log => /www/logs/php_error_log => /www/logs/php_error_log error_prepend_string => <font color=ff0000> => <font color=ff0000> error_reporting => 2047 => 2047 expose_php => On => On extension_dir => /usr/local/lib/php/extensions/no-debug-non-zts-20020429 => /usr/local/lib/php/extensions/no-debug-non-zts-20020429 file_uploads => On => On gpc_order => GPC => GPC highlight.bg => #FFFFFF => #FFFFFF highlight.comment => #FF9900 => #FF9900 highlight.default => #0000BB => #0000BB highlight.html => #000000 => #000000 highlight.keyword => #007700 => #007700 highlight.string => #DD0000 => #DD0000 html_errors => Off => Off ignore_repeated_errors => Off => Off ignore_repeated_source => Off => Off ignore_user_abort => Off => Off implicit_flush => On => Off include_path => .:/usr/local/lib/php:/www/php/includes => .:/usr/local/lib/php:/www/php/includes log_errors => On => On log_errors_max_len => 1024 => 1024 magic_quotes_gpc => On => On magic_quotes_runtime => Off => Off magic_quotes_sybase => Off => Off max_execution_time => 0 => 30 max_input_time => 60 => 60 open_basedir => no value => no value output_buffering => 0 => no value output_handler => no value => no value post_max_size => 8M => 8M precision => 12 => 12 register_argc_argv => On => On register_globals => Off => Off report_memleaks => On => On safe_mode => Off => Off safe_mode_exec_dir => no value => no value safe_mode_gid => Off => Off safe_mode_include_dir => no value => no value sendmail_from => me@localhost.com => me@localhost.com sendmail_path => /usr/sbin/sendmail -t -i => /usr/sbin/sendmail -t -i serialize_precision => 100 => 100 short_open_tag => Off => Off SMTP => localhost => localhost smtp_port => 25 => 25 sql.safe_mode => Off => Off track_errors => On => On unserialize_callback_func => no value => no value upload_max_filesize => 2M => 2M upload_tmp_dir => no value => no value user_dir => no value => no value variables_order => EGPCS => EGPCS xmlrpc_error_number => 0 => 0 xmlrpc_errors => Off => Off y2k_compliance => On => On Zend Optimizer Optimization Pass 1 => enabled Optimization Pass 2 => enabled Optimization Pass 3 => enabled Optimization Pass 4 => enabled Optimization Pass 9 => enabled Zend Loader => enabled License Path => Obfuscation level => 3 crack crack support => enabled Directive => Local Value => Master Value crack.default_dictionary => /usr/lib/cracklib_dict => /usr/lib/cracklib_dict ctype ctype functions => enabled dbx dbx support => enabled dbx version => 1.0.0 supported databases => MySQL ODBC PostgreSQL Microsoft SQL Server FrontBase Oracle 8 (oci8) Sybase-CT Directive => Local Value => Master Value dbx.colnames_case => unchanged => unchanged domxml DOM/XML => enabled DOM/XML API Version => 20020815 libxml Version => 20615 HTML Support => enabled XPath Support => enabled XPointer Support => enabled iconv iconv support => enabled iconv implementation => glibc iconv library version => 2.3.2 Directive => Local Value => Master Value iconv.input_encoding => ISO-8859-1 => ISO-8859-1 iconv.internal_encoding => ISO-8859-1 => ISO-8859-1 iconv.output_encoding => ISO-8859-1 => ISO-8859-1 ldap LDAP Support => enabled RCS Version => $Id: ldap.c,v 1.130.2.13.2.2 2007/01/01 09:46:44 sebastian Exp $ Total Links => 0/unlimited API Version => 2004 Vendor Name => OpenLDAP Vendor Version => 20026 mbstring Multibyte Support => enabled Japanese support => enabled Simplified chinese support => enabled Traditional chinese support => enabled Korean support => enabled Russian support => enabled Multibyte (japanese) regex support => enabled mbstring extension makes use of "streamable kanji code filter and converter", which is distributed under the GNU Lesser General Public License version 2.1. Directive => Local Value => Master Value mbstring.detect_order => no value => no value mbstring.encoding_translation => Off => Off mbstring.func_overload => 0 => 0 mbstring.http_input => pass => pass mbstring.http_output => pass => pass mbstring.internal_encoding => ISO-8859-1 => no value mbstring.language => neutral => neutral mbstring.substitute_character => no value => no value mysql MySQL Support => enabled Active Persistent Links => 0 Active Links => 0 Client API version => 3.23.49 MYSQL_MODULE_TYPE => builtin MYSQL_SOCKET => /var/lib/mysql/mysql.sock MYSQL_INCLUDE => MYSQL_LIBS => Directive => Local Value => Master Value mysql.allow_persistent => On => On mysql.connect_timeout => -1 => -1 mysql.default_host => no value => no value mysql.default_password => no value => no value mysql.default_port => no value => no value mysql.default_socket => no value => no value mysql.default_user => no value => no value mysql.max_links => Unlimited => Unlimited mysql.max_persistent => Unlimited => Unlimited mysql.trace_mode => Off => Off oci8 OCI8 Support => enabled Revision => $Revision: 1.183.2.18.2.4 $ Oracle Version => 9.2 Compile-time ORACLE_HOME => /home/oracle/OraHome1 Libraries Used => openssl OpenSSL support => enabled OpenSSL Version => OpenSSL 0.9.7a Feb 19 2003 oracle Oracle Support => enabled Oracle Version => 9.0 Compile-time ORACLE_HOME => /home/oracle/OraHome1 Libraries Used => overload User-Space Object Overloading Support => enabled pcre PCRE (Perl Compatible Regular Expressions) Support => enabled PCRE Library Version => 7.0 18-Dec-2006 posix Revision => $Revision: 1.51.2.4.2.3 $ session Session Support => enabled Registered save handlers => files user Directive => Local Value => Master Value session.auto_start => Off => Off session.bug_compat_42 => On => On session.bug_compat_warn => On => On session.cache_expire => 180 => 180 session.cache_limiter => private_no_expire, must-revalidate => private_no_expire, must-revalidate session.cookie_domain => no value => no value session.cookie_lifetime => 0 => 0 session.cookie_path => / => / session.cookie_secure => Off => Off session.entropy_file => no value => no value session.entropy_length => 0 => 0 session.gc_divisor => 100 => 100 session.gc_maxlifetime => 1440 => 1440 session.gc_probability => 1 => 1 session.name => PHPSESSID => PHPSESSID session.referer_check => no value => no value session.save_handler => files => files session.save_path => /tmp => /tmp session.serialize_handler => php => php session.use_cookies => On => On session.use_only_cookies => Off => Off session.use_trans_sid => Off => Off sockets Sockets Support => enabled standard Regex Library => Bundled library enabled Dynamic Library Support => enabled Path to sendmail => /usr/sbin/sendmail -t -i Directive => Local Value => Master Value assert.active => 1 => 1 assert.bail => 0 => 0 assert.callback => no value => no value assert.quiet_eval => 0 => 0 assert.warning => 1 => 1 auto_detect_line_endings => 0 => 0 default_socket_timeout => 60 => 60 safe_mode_allowed_env_vars => PHP_ => PHP_ safe_mode_protected_env_vars => LD_LIBRARY_PATH => LD_LIBRARY_PATH url_rewriter.tags => a=href,area=href,frame=src,input=src,form=,fieldset= => a=href,area=href,frame=src,input=src,form=,fieldset= user_agent => no value => no value tokenizer Tokenizer Support => enabled xml XML Support => active XML Namespace Support => active EXPAT Version => 1.95.6 xslt XSLT support => enabled Backend => Sablotron Sablotron Version => 1.0.2 Sablotron Information => Cflags: -g -O2 Libs: -L/usr/local/lib -lexpat -ljs Prefix: /usr/local zlib ZLib Support => enabled Compiled Version => 1.1.4 Linked Version => 1.1.4 Directive => Local Value => Master Value zlib.output_compression => Off => Off zlib.output_compression_level => -1 => -1 zlib.output_handler => no value => no value Additional Modules Module Name Environment Variable => Value HOSTNAME => theseus TEST_PHP_SRCDIR => /src/php-4.4.7 TERM => xterm SHELL => /bin/sh HISTSIZE => 1000 MAKEFLAGS => NSR_BLOCK_ADMIN => YES ANT_HOME => /usr/local/ant-1.6.5 USER => root LS_COLORS => no=00:fi=00:di=00;34:ln=00;36:pi=40;33:so=00;35:bd=40;33;01:cd=40;33;01:or=01;05;37;41:mi=01;05;37;41:ex=00;32:*.cmd=00;32:*.exe=00;32:*.com=00;32:*.btm=00;32:*.bat=00;32:*.sh=00;32:*.csh=00;32:*.tar=00;31:*.tgz=00;31:*.arj=00;31:*.taz=00;31:*.lzh=00;31:*.zip=00;31:*.z=00;31:*.Z=00;31:*.gz=00;31:*.bz2=00;31:*.bz=00;31:*.tz=00;31:*.rpm=00;31:*.cpio=00;31:*.jpg=00;35:*.gif=00;35:*.bmp=00;35:*.xbm=00;35:*.xpm=00;35:*.png=00;35:*.tif=00;35: SCRIPT_FILENAME => USERNAME => root MAKELEVEL => 1 MFLAGS => PATH => /usr/kerberos/sbin:/usr/kerberos/bin:/usr/local/sbin:/usr/local/bin:/sbin:/bin:/usr/sbin:/usr/bin:/usr/X11R6/bin:/usr/local/apache-ant-1.6.5/bin:/usr/java/j2sdk1.4.2_09/bin:/home/oracle/OraHome1/bin:/root/bin MAIL => /var/spool/mail/root _ => /src/php-4.4.7/sapi/cli/php PWD => /src/php-4.4.7 INPUTRC => /etc/inputrc JAVA_HOME => /usr/java/j2sdk1.4.2_09 LANG => en_US.UTF-8 TEST_PHP_EXECUTABLE => /src/php-4.4.7/sapi/cli/php REDIRECT_STATUS => PATH_TRANSLATED => SSH_ASKPASS => /usr/libexec/openssh/gnome-ssh-askpass HOME => /root SHLVL => 4 CONTENT_LENGTH => BASH_ENV => /root/.bashrc LOGNAME => root QUERY_STRING => LESSOPEN => |/usr/bin/lesspipe.sh %s CONTENT_TYPE => CC => gcc ORACLE_HOME => /home/oracle/OraHome1 REQUEST_METHOD => G_BROKEN_FILENAMES => 1 PHP Variables Variable => Value _SERVER["HOSTNAME"] => theseus _SERVER["TEST_PHP_SRCDIR"] => /src/php-4.4.7 _SERVER["TERM"] => xterm _SERVER["SHELL"] => /bin/sh _SERVER["HISTSIZE"] => 1000 _SERVER["MAKEFLAGS"] => _SERVER["NSR_BLOCK_ADMIN"] => YES _SERVER["ANT_HOME"] => /usr/local/ant-1.6.5 _SERVER["USER"] => root _SERVER["LS_COLORS"] => no=00:fi=00:di=00;34:ln=00;36:pi=40;33:so=00;35:bd=40;33;01:cd=40;33;01:or=01;05;37;41:mi=01;05;37;41:ex=00;32:*.cmd=00;32:*.exe=00;32:*.com=00;32:*.btm=00;32:*.bat=00;32:*.sh=00;32:*.csh=00;32:*.tar=00;31:*.tgz=00;31:*.arj=00;31:*.taz=00;31:*.lzh=00;31:*.zip=00;31:*.z=00;31:*.Z=00;31:*.gz=00;31:*.bz2=00;31:*.bz=00;31:*.tz=00;31:*.rpm=00;31:*.cpio=00;31:*.jpg=00;35:*.gif=00;35:*.bmp=00;35:*.xbm=00;35:*.xpm=00;35:*.png=00;35:*.tif=00;35: _SERVER["SCRIPT_FILENAME"] => _SERVER["USERNAME"] => root _SERVER["MAKELEVEL"] => 1 _SERVER["MFLAGS"] => _SERVER["PATH"] => /usr/kerberos/sbin:/usr/kerberos/bin:/usr/local/sbin:/usr/local/bin:/sbin:/bin:/usr/sbin:/usr/bin:/usr/X11R6/bin:/usr/local/apache-ant-1.6.5/bin:/usr/java/j2sdk1.4.2_09/bin:/home/oracle/OraHome1/bin:/root/bin _SERVER["MAIL"] => /var/spool/mail/root _SERVER["_"] => /src/php-4.4.7/sapi/cli/php _SERVER["PWD"] => /src/php-4.4.7 _SERVER["INPUTRC"] => /etc/inputrc _SERVER["JAVA_HOME"] => /usr/java/j2sdk1.4.2_09 _SERVER["LANG"] => en_US.UTF-8 _SERVER["TEST_PHP_EXECUTABLE"] => /src/php-4.4.7/sapi/cli/php _SERVER["REDIRECT_STATUS"] => _SERVER["PATH_TRANSLATED"] => _SERVER["SSH_ASKPASS"] => /usr/libexec/openssh/gnome-ssh-askpass _SERVER["HOME"] => /root _SERVER["SHLVL"] => 4 _SERVER["CONTENT_LENGTH"] => _SERVER["BASH_ENV"] => /root/.bashrc _SERVER["LOGNAME"] => root _SERVER["QUERY_STRING"] => _SERVER["LESSOPEN"] => |/usr/bin/lesspipe.sh %s _SERVER["CONTENT_TYPE"] => _SERVER["CC"] => gcc _SERVER["ORACLE_HOME"] => /home/oracle/OraHome1 _SERVER["REQUEST_METHOD"] => _SERVER["G_BROKEN_FILENAMES"] => 1 _SERVER["PHP_SELF"] => _SERVER["SCRIPT_NAME"] => _SERVER["DOCUMENT_ROOT"] => _SERVER["argv"] => Array ( ) _SERVER["argc"] => 0 _ENV["HOSTNAME"] => theseus _ENV["TEST_PHP_SRCDIR"] => /src/php-4.4.7 _ENV["TERM"] => xterm _ENV["SHELL"] => /bin/sh _ENV["HISTSIZE"] => 1000 _ENV["MAKEFLAGS"] => _ENV["NSR_BLOCK_ADMIN"] => YES _ENV["ANT_HOME"] => /usr/local/ant-1.6.5 _ENV["USER"] => root _ENV["LS_COLORS"] => no=00:fi=00:di=00;34:ln=00;36:pi=40;33:so=00;35:bd=40;33;01:cd=40;33;01:or=01;05;37;41:mi=01;05;37;41:ex=00;32:*.cmd=00;32:*.exe=00;32:*.com=00;32:*.btm=00;32:*.bat=00;32:*.sh=00;32:*.csh=00;32:*.tar=00;31:*.tgz=00;31:*.arj=00;31:*.taz=00;31:*.lzh=00;31:*.zip=00;31:*.z=00;31:*.Z=00;31:*.gz=00;31:*.bz2=00;31:*.bz=00;31:*.tz=00;31:*.rpm=00;31:*.cpio=00;31:*.jpg=00;35:*.gif=00;35:*.bmp=00;35:*.xbm=00;35:*.xpm=00;35:*.png=00;35:*.tif=00;35: _ENV["SCRIPT_FILENAME"] => _ENV["USERNAME"] => root _ENV["MAKELEVEL"] => 1 _ENV["MFLAGS"] => _ENV["PATH"] => /usr/kerberos/sbin:/usr/kerberos/bin:/usr/local/sbin:/usr/local/bin:/sbin:/bin:/usr/sbin:/usr/bin:/usr/X11R6/bin:/usr/local/apache-ant-1.6.5/bin:/usr/java/j2sdk1.4.2_09/bin:/home/oracle/OraHome1/bin:/root/bin _ENV["MAIL"] => /var/spool/mail/root _ENV["_"] => /src/php-4.4.7/sapi/cli/php _ENV["PWD"] => /src/php-4.4.7 _ENV["INPUTRC"] => /etc/inputrc _ENV["JAVA_HOME"] => /usr/java/j2sdk1.4.2_09 _ENV["LANG"] => en_US.UTF-8 _ENV["TEST_PHP_EXECUTABLE"] => /src/php-4.4.7/sapi/cli/php _ENV["REDIRECT_STATUS"] => _ENV["PATH_TRANSLATED"] => _ENV["SSH_ASKPASS"] => /usr/libexec/openssh/gnome-ssh-askpass _ENV["HOME"] => /root _ENV["SHLVL"] => 4 _ENV["CONTENT_LENGTH"] => _ENV["BASH_ENV"] => /root/.bashrc _ENV["LOGNAME"] => root _ENV["QUERY_STRING"] => _ENV["LESSOPEN"] => |/usr/bin/lesspipe.sh %s _ENV["CONTENT_TYPE"] => _ENV["CC"] => gcc _ENV["ORACLE_HOME"] => /home/oracle/OraHome1 _ENV["REQUEST_METHOD"] => _ENV["G_BROKEN_FILENAMES"] => 1 PHP License This program is free software; you can redistribute it and/or modify it under the terms of the PHP License as published by the PHP Group and included in the distribution in the file: LICENSE This program is distributed in the hope that it will be useful, but WITHOUT ANY WARRANTY; without even the implied warranty of MERCHANTABILITY or FITNESS FOR A PARTICULAR PURPOSE. If you did not receive a copy of the PHP license, or have any questions about PHP licensing, please contact license@php.net.

« previous php.qa (#41744) next »