Test results for 5.2.3 [failed]

From: Date: Thu, 26 Jul 2007 05:42:39 +0000
Subject: Test results for 5.2.3 [failed]
Groups: php.qa 
Request: Send a blank email to php-qa+get-41913@lists.php.net to get a copy of this message
===================================================================== FAILED TEST SUMMARY --------------------------------------------------------------------- Error message handling (with ZendOptimizer) [tests/run-test/test008.phpt] Convert warnings to exceptions [tests/lang/038.phpt] Bug #32828 (Throwing exception in output_callback function with ob_start and ob_end_clean leads to segfault) [tests/lang/bug32828.phpt] Bug #36268 (Object destructors called even after fatal errors) [Zend/tests/bug36268.phpt] Bug #41421 (Uncaught exception from a stream wrapper segfaults) [Zend/tests/bug41421.phpt] double to string conversion tests [Zend/tests/double_to_string.phpt] easter_date() [ext/calendar/tests/easter_date.phpt] unixtojd() [ext/calendar/tests/unixtojd.phpt] Bug #16069 (ICONV transliteration failure) [ext/iconv/tests/bug16069.phpt] iconv stream filter [ext/iconv/tests/iconv_stream_filter.phpt] SPL: spl_autoload() with methods [ext/spl/tests/spl_autoload_005.phpt] SPL: spl_autoload() with inaccessible methods [ext/spl/tests/spl_autoload_007.phpt] SPL: spl_autoload() with exceptions [ext/spl/tests/spl_autoload_008.phpt] Bug #35821 (array_map() segfaults when exception is throwed from the callback) [ext/standard/tests/array/bug35821.phpt] Bug #38450 (constructor is not called for classes used in userspace stream wrappers) [ext/standard/tests/file/bug38450_2.phpt] proc_open() regression test 1 (proc_open() leak) [ext/standard/tests/file/proc_open01.phpt] error_get_last() tests [ext/standard/tests/general_functions/error_get_last.phpt] strripos() offset integer overflow [ext/standard/tests/strings/strripos_offset.phpt] Bug #32001 (xml_parse*() goes into infinite loop when autodetection in effect), using UTF-* [ext/xml/tests/bug32001.phpt] CLI long options [sapi/cli/tests/015.phpt] ===================================================================== ===================================================================== TEST RESULT SUMMARY --------------------------------------------------------------------- Exts skipped : 46 Exts tested : 34 --------------------------------------------------------------------- Number of tests : 3251 1872 Tests skipped : 1379 ( 42.4%) -------- Tests warned : 0 ( 0.0%) ( 0.0%) Tests failed : 20 ( 0.6%) ( 1.1%) Tests passed : 1852 ( 57.0%) ( 98.9%) --------------------------------------------------------------------- Time taken : 106 seconds ===================================================================== ===================================================================== FAILED TEST SUMMARY --------------------------------------------------------------------- Error message handling (with ZendOptimizer) [tests/run-test/test008.phpt] Convert warnings to exceptions [tests/lang/038.phpt] Bug #32828 (Throwing exception in output_callback function with ob_start and ob_end_clean leads to segfault) [tests/lang/bug32828.phpt] Bug #36268 (Object destructors called even after fatal errors) [Zend/tests/bug36268.phpt] Bug #41421 (Uncaught exception from a stream wrapper segfaults) [Zend/tests/bug41421.phpt] double to string conversion tests [Zend/tests/double_to_string.phpt] easter_date() [ext/calendar/tests/easter_date.phpt] unixtojd() [ext/calendar/tests/unixtojd.phpt] Bug #16069 (ICONV transliteration failure) [ext/iconv/tests/bug16069.phpt] iconv stream filter [ext/iconv/tests/iconv_stream_filter.phpt] SPL: spl_autoload() with methods [ext/spl/tests/spl_autoload_005.phpt] SPL: spl_autoload() with inaccessible methods [ext/spl/tests/spl_autoload_007.phpt] SPL: spl_autoload() with exceptions [ext/spl/tests/spl_autoload_008.phpt] Bug #35821 (array_map() segfaults when exception is throwed from the callback) [ext/standard/tests/array/bug35821.phpt] Bug #38450 (constructor is not called for classes used in userspace stream wrappers) [ext/standard/tests/file/bug38450_2.phpt] proc_open() regression test 1 (proc_open() leak) [ext/standard/tests/file/proc_open01.phpt] error_get_last() tests [ext/standard/tests/general_functions/error_get_last.phpt] strripos() offset integer overflow [ext/standard/tests/strings/strripos_offset.phpt] Bug #32001 (xml_parse*() goes into infinite loop when autodetection in effect), using UTF-* [ext/xml/tests/bug32001.phpt] CLI long options [sapi/cli/tests/015.phpt] ===================================================================== ================================================================================ /home/liber/download/php/php-5.2.3/tests/run-test/test008.phpt ================================================================================ string(1) "1" string(4) "8191" string(1) "0" string(1) "1" string(1) "0" NULL string(16) "Division by zero" ================================================================================ 001- %s: %sivision by zero in %s on line %d 006+ NULL 008- string(%d) "%sivision by zer%s" ================================================================================ ================================================================================ /home/liber/download/php/php-5.2.3/tests/lang/038.phpt ================================================================================ string(15) "Error2Exception" Fatal error: Uncaught exception 'MyException' with message 'Undefined offset: 1' in :0 Stack trace: #0 /home/liber/download/php/php-5.2.3/tests/lang/038.php(29): Error2Exception(8, 'Undefined offse...', '/home/liber/dow...', 29, Array) #1 {main} thrown in on line 158909616 ================================================================================ 002+ 003+ Fatal error: Uncaught exception 'MyException' with message 'Undefined offset: 1' in :0 002- string(5) "fopen" 003- ===DONE=== 004+ Stack trace: 005+ #0 /home/liber/download/php/php-5.2.3/tests/lang/038.php(29): Error2Exception(8, 'Undefined offse...', '/home/liber/dow...', 29, Array) 006+ #1 {main} 007+ thrown in on line 158909616 ================================================================================ ================================================================================ /home/liber/download/php/php-5.2.3/tests/lang/bug32828.phpt ================================================================================ Fatal error: Uncaught exception 'Exception' in /home/liber/download/php/php-5.2.3/tests/lang/bug32828.php:5 Stack trace: #0 /home/liber/download/php/php-5.2.3/tests/lang/bug32828.php(10): output_handler('', 5) #1 {main} thrown in /home/liber/download/php/php-5.2.3/tests/lang/bug32828.php on line 5 ================================================================================ 003+ #0 /home/liber/download/php/php-5.2.3/tests/lang/bug32828.php(10): output_handler('', 5) 004+ #1 {main} 003- #0 [internal function]: output_handler('', %d) 004- #1 %s(%d): ob_end_clean() 005- #2 {main} ================================================================================ ================================================================================ /home/liber/download/php/php-5.2.3/Zend/tests/bug36268.phpt ================================================================================ Fatal error: Call to undefined function bar() in /home/liber/download/php/php-5.2.3/Zend/tests/bug36268.php on line 8 ================================================================================ 001+ Fatal error: Call to undefined function bar() in /home/liber/download/php/php-5.2.3/Zend/tests/bug36268.php on line 8 001- Fatal error: Call to undefined function bar() in %sbug36268.php on line 8 ================================================================================ ================================================================================ /home/liber/download/php/php-5.2.3/Zend/tests/bug41421.phpt ================================================================================ Warning: feof(): wrapper::stream_eof is not implemented! Assuming EOF in /home/liber/download/php/php-5.2.3/Zend/tests/bug41421.php on line 18 Fatal error: Uncaught exception 'Exception' in /home/liber/download/php/php-5.2.3/Zend/tests/bug41421.php:8 Stack trace: #0 /home/liber/download/php/php-5.2.3/Zend/tests/bug41421.php(14): wrapper->stream_eof() #1 {main} thrown in /home/liber/download/php/php-5.2.3/Zend/tests/bug41421.php on line 8 ================================================================================ 005+ #0 /home/liber/download/php/php-5.2.3/Zend/tests/bug41421.php(14): wrapper->stream_eof() 006+ #1 {main} 005- #0 [internal function]: wrapper->stream_eof() 006- #1 %s(%d): feof(Resource id #6) 007- #2 {main} ================================================================================ ================================================================================ /home/liber/download/php/php-5.2.3/Zend/tests/double_to_string.phpt ================================================================================ string(7) "2.9E+17" string(7) "2.9E+14" string(7) "2.9E+13" string(14) "29000000000000" string(14) "29000000000001" string(13) "29000.7123123" string(15) "239234242.71231" string(16) "0.12345678901235" string(14) "10000000000000" string(7) "1.0E+14" string(7) "1.0E+18" string(7) "1.0E+14" string(11) "10000000000" string(7) "1.0E+15" string(7) "1.0E+16" string(1) "0" Done ================================================================================ 003+ string(7) "2.9E+13" 005- string(14) "29000000000001" ================================================================================ ================================================================================ /home/liber/download/php/php-5.2.3/ext/calendar/tests/easter_date.phpt ================================================================================ 2000-04-22 2001-04-14 2002-03-30 Warning: easter_date(): This function is only valid for years between 1970 and 2037 inclusive in /home/liber/download/php/php-5.2.3/ext/calendar/tests/easter_date.php on line 5 1970-01-01 ================================================================================ 001+ 2000-04-22 002+ 2001-04-14 003+ 2002-03-30 001- 2000-04-23 002- 2001-04-15 003- 2002-03-31 ================================================================================ ================================================================================ /home/liber/download/php/php-5.2.3/ext/calendar/tests/unixtojd.phpt ================================================================================ 2440588 2452162 2453926 ================================================================================ 002+ 2452162 002- 2452161 ================================================================================ ================================================================================ /home/liber/download/php/php-5.2.3/ext/iconv/tests/bug16069.phpt ================================================================================ ¥ß¥ê¥Ð¡¼¥ë¥ß¥ê¥Ð¡¼¥ë¥ß¥ê¥Ð¡¼¥ë¥ß¥ê¥Ð¡¼¥ë¥ß¥ê¥Ð¡¼¥ë¥ß¥ê¥Ð¡¼¥ë¥ß¥ê¥Ð¡¼¥ë¥ß¥ê¥Ð¡¼¥ë¥ß¥ê¥Ð¡¼¥ë¥ß¥ê¥Ð¡¼¥ë¥ß¥ê¥Ð¡¼¥ë¥ß¥ß¥ê¥Ð¡¼¥ë¥ß¥ê¥Ð¡¼¥ë¥ß¥ê¥Ð¡¼¥ë¥ß¥ê¥Ð¡¼¥ë¥ß¥ê¥Ð¡¼¥ë¥ß¥ê¥Ð¡¼¥ë¥ß¥ê¥Ð¡¼¥ë¥ß¥ê¥Ð¡¼¥ë¥ß¥ê¥Ð¡¼¥ë¥ß¥ê¥Ð¡¼¥ë¥ß¥ê¥Ð¡¼¥ë¥ß¥ê¥Ð¡¼¥ë¥ß¥ê¥Ð¡¼¥ë¥ß¥ê¥Ð¡¼¥ë¥ß¥ê¥Ð¡¼¥ë¥ß¥ê¥Ð¡¼¥ë¥ß¥ê¥Ð¡¼¥ë¥ß¥ê¥Ð¡¼¥ë¥ß¥ê¥Ð¡¼¥ë¥ß¥ê¥Ð¡¼¥ë¥ß¥ê¥Ð¡¼¥ë¥ß¥ê¥Ð¡¼¥ë¥ß¥ê¥Ð¡¼¥ë¥ß¥ê¥Ð¡¼¥ë¥ß¥ê¥Ð¡¼¥ë¥ß¥ê¥Ð¡¼¥ë¥ß¥ê¥Ð¡¼¥ë¥ß¥ê¥Ð¡¼¥ë¥ß¥ê¥Ð¡¼¥ë(¡ë§¥¡ë) ================================================================================ 001+ ¥ß¥ê¥Ð¡¼¥ë¥ß¥ê¥Ð¡¼¥ë¥ß¥ê¥Ð¡¼¥ë¥ß¥ê¥Ð¡¼¥ë¥ß¥ê¥Ð¡¼¥ë¥ß¥ê¥Ð¡¼¥ë¥ß¥ê¥Ð¡¼¥ë¥ß¥ê¥Ð¡¼¥ë¥ß¥ê¥Ð¡¼¥ë¥ß¥ê¥Ð¡¼¥ë¥ß¥ê¥Ð¡¼¥ë¥ß¥ß¥ê¥Ð¡¼¥ë¥ß¥ê¥Ð¡¼¥ë¥ß¥ê¥Ð¡¼¥ë¥ß¥ê¥Ð¡¼¥ë¥ß¥ê¥Ð¡¼¥ë¥ß¥ê¥Ð¡¼¥ë¥ß¥ê¥Ð¡¼¥ë¥ß¥ê¥Ð¡¼¥ë¥ß¥ê¥Ð¡¼¥ë¥ß¥ê¥Ð¡¼¥ë¥ß¥ê¥Ð¡¼¥ë¥ß¥ê¥Ð¡¼¥ë¥ß¥ê¥Ð¡¼¥ë¥ß¥ê¥Ð¡¼¥ë¥ß¥ê¥Ð¡¼¥ë¥ß¥ê¥Ð¡¼¥ë¥ß¥ê¥Ð¡¼¥ë¥ß¥ê¥Ð¡¼¥ë¥ß¥ê¥Ð¡¼¥ë¥ß¥ê¥Ð¡¼¥ë¥ß¥ê¥Ð¡¼¥ë¥ß¥ê¥Ð¡¼¥ë¥ß¥ê¥Ð¡¼¥ë¥ß¥ê¥Ð¡¼¥ë¥ß¥ê¥Ð¡¼¥ë¥ß¥ê¥Ð¡¼¥ë¥ß¥ê¥Ð¡¼¥ë¥ß¥ê¥Ð¡¼¥ë¥ß¥ê¥Ð¡¼¥ë(¡ë§¥¡ë) 001- ¥ß¥ê¥Ð¡¼¥ë¥ß¥ê¥Ð¡¼¥ë¥ß¥ê¥Ð¡¼¥ë¥ß¥ê¥Ð¡¼¥ë¥ß¥ê¥Ð¡¼¥ë¥ß¥ê¥Ð¡¼¥ë¥ß¥ê¥Ð¡¼¥ë¥ß¥ê¥Ð¡¼¥ë¥ß¥ê¥Ð¡¼¥ë¥ß¥ê¥Ð¡¼¥ë¥ß¥ê¥Ð¡¼¥ë¥ß¥ê¥Ð¡¼¥ë¥ß¥ê¥Ð¡¼¥ë¥ß¥ê¥Ð¡¼¥ë¥ß¥ê¥Ð¡¼¥ë¥ß¥ê¥Ð¡¼¥ë¥ß¥ê¥Ð¡¼¥ë¥ß¥ê¥Ð¡¼¥ë¥ß¥ê¥Ð¡¼¥ë¥ß¥ê¥Ð¡¼¥ë¥ß¥ê¥Ð¡¼¥ë¥ß¥ê¥Ð¡¼¥ë¥ß¥ê¥Ð¡¼¥ë¥ß¥ê¥Ð¡¼¥ë¥ß¥ê¥Ð¡¼¥ë¥ß¥ê¥Ð¡¼¥ë¥ß¥ê¥Ð¡¼¥ë¥ß¥ê¥Ð¡¼¥ë¥ß¥ê¥Ð¡¼¥ë¥ß¥ê¥Ð¡¼¥ë¥ß¥ê¥Ð¡¼¥ë¥ß¥ê¥Ð¡¼¥ë¥ß¥ê¥Ð¡¼¥ë¥ß¥ê¥Ð¡¼¥ë¥ß¥ê¥Ð¡¼¥ë¥ß¥ê¥Ð¡¼¥ë¥ß¥ê¥Ð¡¼¥ë¥ß¥ê¥Ð¡¼¥ë¥ß¥ê¥Ð¡¼¥ë¥ß¥ê¥Ð¡¼¥ë(¡ë§¥¡ë) ================================================================================ ================================================================================ /home/liber/download/php/php-5.2.3/ext/iconv/tests/iconv_stream_filter.phpt ================================================================================ string(20) "1b244224332473244b24" string(10) "41244f1b28" string(2) "42" string(20) "a4b3a4f3a4cba4c1a4cf" string(10) "69636f6e76" string(2) "0a" string(20) "1b244f24332466245824" string(10) "4e24421b28" string(2) "4f" ================================================================================ 007+ string(20) "1b244f24332466245824" 008+ string(10) "4e24421b28" 009+ string(2) "4f" 007- 008- Warning: fread(): iconv stream filter ("ISO-2022-JP"=>"EUC-JP"): invalid multibyte sequence in %s on line %d 009- string(0) "" 010- string(0) "" 011- string(0) "" ================================================================================ ================================================================================ /home/liber/download/php/php-5.2.3/ext/spl/tests/spl_autoload_005.phpt ================================================================================ Strict Standards: Non-static method MyAutoLoader::autoLoad() cannot be called statically in /home/liber/download/php/php-5.2.3/ext/spl/tests/spl_autoload_005.php on line 19 Exception: Passed array specifies a non static method but no object MyAutoLoader::autoLoad(TestClass) MyAutoLoader::autoThrow(TestClass) Exception: Unavailable ===DONE=== ================================================================================ 001+ Strict Standards: Non-static method MyAutoLoader::autoLoad() cannot be called statically in /home/liber/download/php/php-5.2.3/ext/spl/tests/spl_autoload_005.php on line 19 ================================================================================ ================================================================================ /home/liber/download/php/php-5.2.3/ext/spl/tests/spl_autoload_007.phpt ================================================================================ string(22) "MyAutoLoader::notExist" Function 'MyAutoLoader::notExist' not found string(22) "MyAutoLoader::noAccess" Function 'MyAutoLoader::noAccess' not callable string(22) "MyAutoLoader::autoLoad" ok string(22) "MyAutoLoader::dynaLoad" Function 'MyAutoLoader::dynaLoad' not callable array(2) { [0]=> string(12) "MyAutoLoader" [1]=> string(8) "notExist" } MyAutoLoader::autoLoad(321o67vfigy0) MyAutoLoader::autoLoad(321o67vfigy0) Passed array does not specify an existing static method array(2) { [0]=> string(12) "MyAutoLoader" [1]=> string(8) "noAccess" } Passed array does not specify a callable static method array(2) { [0]=> string(12) "MyAutoLoader" [1]=> string(8) "autoLoad" } ok array(2) { [0]=> string(12) "MyAutoLoader" [1]=> string(8) "dynaLoad" } Strict Standards: Non-static method MyAutoLoader::dynaLoad() cannot be called statically in /home/liber/download/php/php-5.2.3/ext/spl/tests/spl_autoload_007.php on line 41 Passed array specifies a non static method but no object array(2) { [0]=> object(MyAutoLoader)#1 (0) { } [1]=> string(8) "notExist" } Passed array does not specify an existing method array(2) { [0]=> object(MyAutoLoader)#1 (0) { } [1]=> string(8) "noAccess" } Passed array does not specify a callable method array(2) { [0]=> object(MyAutoLoader)#1 (0) { } [1]=> string(8) "autoLoad" } ok array(2) { [0]=> object(MyAutoLoader)#1 (0) { } [1]=> string(8) "dynaLoad" } ok ===DONE=== ================================================================================ 019+ MyAutoLoader::autoLoad(321o67vfigy0) 020+ MyAutoLoader::autoLoad(321o67vfigy0) 045+ 046+ Strict Standards: Non-static method MyAutoLoader::dynaLoad() cannot be called statically in /home/liber/download/php/php-5.2.3/ext/spl/tests/spl_autoload_007.php on line 41 ================================================================================ ================================================================================ /home/liber/download/php/php-5.2.3/ext/spl/tests/spl_autoload_008.phpt ================================================================================ ====0==== string(10) "MyAutoLoad" registered MyAutoLoad(NoExistingTestClass) Exception: Bla int(0) ====1==== string(22) "MyAutoLoader::autoLoad" registered MyAutoLoader::autoLoad(NoExistingTestClass) Exception: Bla int(0) ====2==== string(22) "MyAutoLoader::dynaLoad" LogicException: Function 'MyAutoLoader::dynaLoad' not callable int(0) ====3==== array(2) { [0]=> string(12) "MyAutoLoader" [1]=> string(8) "autoLoad" } registered MyAutoLoader::autoLoad(NoExistingTestClass) Exception: Bla int(0) ====4==== array(2) { [0]=> string(12) "MyAutoLoader" [1]=> string(8) "dynaLoad" } Strict Standards: Non-static method MyAutoLoader::dynaLoad() cannot be called statically in /home/liber/download/php/php-5.2.3/ext/spl/tests/spl_autoload_008.php on line 43 LogicException: Passed array specifies a non static method but no object int(0) ====5==== array(2) { [0]=> object(MyAutoLoader)#1 (0) { } [1]=> string(8) "autoLoad" } registered MyAutoLoader::autoLoad(NoExistingTestClass) Exception: Bla int(0) ====6==== array(2) { [0]=> object(MyAutoLoader)#1 (0) { } [1]=> string(8) "dynaLoad" } registered MyAutoLoader::dynaLoad(NoExistingTestClass) Exception: Bla int(0) ===DONE=== ================================================================================ 035+ 036+ Strict Standards: Non-static method MyAutoLoader::dynaLoad() cannot be called statically in /home/liber/download/php/php-5.2.3/ext/spl/tests/spl_autoload_008.php on line 43 ================================================================================ ================================================================================ /home/liber/download/php/php-5.2.3/ext/standard/tests/array/bug35821.phpt ================================================================================ Warning: array_map(): An error occurred while invoking the map callback in /home/liber/download/php/php-5.2.3/ext/standard/tests/array/bug35821.php on line 21 Fatal error: Uncaught exception 'Exception' in /home/liber/download/php/php-5.2.3/ext/standard/tests/array/bug35821.php:7 Stack trace: #0 /home/liber/download/php/php-5.2.3/ext/standard/tests/array/bug35821.php(12): Element->ThrowException() #1 /home/liber/download/php/php-5.2.3/ext/standard/tests/array/bug35821.php(17): Element::CallBack(Object(Element)) #2 {main} thrown in /home/liber/download/php/php-5.2.3/ext/standard/tests/array/bug35821.php on line 7 ================================================================================ 006+ #1 /home/liber/download/php/php-5.2.3/ext/standard/tests/array/bug35821.php(17): Element::CallBack(Object(Element)) 007+ #2 {main} 006- #1 [internal function]: Element::CallBack(Object(Element)) 007- #2 %s(%d): array_map(Array, Array) 008- #3 {main} ================================================================================ ================================================================================ /home/liber/download/php/php-5.2.3/ext/standard/tests/file/bug38450_2.phpt ================================================================================ Warning: Missing argument 1 for VariableStream::__construct() in /home/liber/download/php/php-5.2.3/ext/standard/tests/file/bug38450_2.php on line 7 Warning: fopen(var://myvar): failed to open stream: "VariableStream::stream_open" call failed in /home/liber/download/php/php-5.2.3/ext/standard/tests/file/bug38450_2.php on line 101 Fatal error: Uncaught exception 'Exception' with message 'constructor' in /home/liber/download/php/php-5.2.3/ext/standard/tests/file/bug38450_2.php:8 Stack trace: #0 /home/liber/download/php/php-5.2.3/ext/standard/tests/file/bug38450_2.php(86): VariableStream->__construct() #1 {main} thrown in /home/liber/download/php/php-5.2.3/ext/standard/tests/file/bug38450_2.php on line 8 ================================================================================ 007+ #0 /home/liber/download/php/php-5.2.3/ext/standard/tests/file/bug38450_2.php(86): VariableStream->__construct() 008+ #1 {main} 007- #0 [internal function]: VariableStream->__construct() 008- #1 %s(%d): fopen('var://myvar', 'r+') 009- #2 {main} ================================================================================ ================================================================================ /home/liber/download/php/php-5.2.3/ext/standard/tests/file/proc_open01.phpt ================================================================================ array(2) { [0]=> resource(4) of type (stream) [1]=> resource(5) of type (stream) } terminated after 1000 iterations string(0) "" array(3) { [0]=> int(1) [1]=> int(2) [2]=> int(3) } ================================================================================ 007+ terminated after 1000 iterations 008+ string(0) "" 007- string(5) "yay! 008- " ================================================================================ ================================================================================ /home/liber/download/php/php-5.2.3/ext/standard/tests/general_functions/error_get_last.phpt ================================================================================ array(4) { ["type"]=> int(32) ["message"]=> string(209) "PHP Startup: soap: Unable to initialize module Module compiled with module API=20050922, debug=0, thread-safety=0 PHP compiled with module API=20060613, debug=0, thread-safety=0 These options need to match " ["file"]=> string(7) "Unknown" ["line"]=> int(0) } Warning: Wrong parameter count for error_get_last() in /home/liber/download/php/php-5.2.3/ext/standard/tests/general_functions/error_get_last.php on line 4 NULL array(4) { ["type"]=> int(2) ["message"]=> string(42) "Wrong parameter count for error_get_last()" ["file"]=> string(90) "/home/liber/download/php/php-5.2.3/ext/standard/tests/general_functions/error_get_last.php" ["line"]=> int(4) } Notice: Undefined variable: b in /home/liber/download/php/php-5.2.3/ext/standard/tests/general_functions/error_get_last.php on line 7 array(4) { ["type"]=> int(8) ["message"]=> string(21) "Undefined variable: b" ["file"]=> string(90) "/home/liber/download/php/php-5.2.3/ext/standard/tests/general_functions/error_get_last.php" ["line"]=> int(7) } Done ================================================================================ 001- NULL 002- 003- Warning: Wrong parameter count for error_get_last() in %s on line %d 004- NULL 003+ int(32) 005+ string(209) "PHP Startup: soap: Unable to initialize module 006+ Module compiled with module API=20050922, debug=0, thread-safety=0 007+ PHP compiled with module API=20060613, debug=0, thread-safety=0 008+ These options need to match 009+ " 007- int(2) 009- string(42) "Wrong parameter count for error_get_last()" 016+ Warning: Wrong parameter count for error_get_last() in /home/liber/download/php/php-5.2.3/ext/standard/tests/general_functions/error_get_last.php on line 4 017+ NULL 016- Notice: Undefined variable: b in %s on line %d 019- int(8) 020+ int(2) 021- string(21) "Undefined variable: b" 022+ string(42) "Wrong parameter count for error_get_last()" 027- Done 028+ 029+ Notice: Undefined variable: b in /home/liber/download/php/php-5.2.3/ext/standard/tests/general_functions/error_get_last.php on line 7 030+ array(4) { 031+ ["type"]=> 032+ int(8) 033+ ["message"]=> 034+ string(21) "Undefined variable: b" 035+ ["file"]=> 036+ string(90) "/home/liber/download/php/php-5.2.3/ext/standard/tests/general_functions/error_get_last.php" 037+ ["line"]=> 038+ int(7) 039+ } 040+ Done ================================================================================ ================================================================================ /home/liber/download/php/php-5.2.3/ext/standard/tests/strings/strripos_offset.phpt ================================================================================ ================================================================================ 001- Notice: strripos(): Offset is greater than the length of haystack string in %s on line %d 002- bool(false) 004- Notice: strripos(): Offset is greater than the length of haystack string in %s on line %d 005- bool(false) 006- 007- Notice: strripos(): Offset is greater than the length of haystack string in %s on line %d 008- bool(false) 009- 010- Notice: strripos(): Offset is greater than the length of haystack string in %s on line %d 011- bool(false) 012- 013- Warning: strripos() expects parameter 1 to be string, array given in %s on line %d 014- bool(false) 015- 016- Notice: strripos(): Offset is greater than the length of haystack string in %s on line %d 017- bool(false) 018- 019- Notice: strripos(): Offset is greater than the length of haystack string in %s on line %d 020- bool(false) 021- 022- Notice: strripos(): Offset is greater than the length of haystack string in %s on line %d 023- bool(false) 024- 025- Notice: strripos(): Offset is greater than the length of haystack string in %s on line %d 026- bool(false) 027- Done ================================================================================ ================================================================================ /home/liber/download/php/php-5.2.3/ext/xml/tests/bug32001.phpt ================================================================================ libxml2 Version => 2.6.26 Encoding: UTF-8 XML Prologue: present Chunk size: all data at once BOM: not prepended array(3) { [0]=> string(128) "e38386e382b9e383883ae38386e382b9e3838831: 687474703a2f2f7777772e6578616d706c652e636f6d2fe38386e382b9e383882f, e38386e382b9e38388" [1]=> string(60) "e38386e382b9e383883ae38386e382b9e3838832: e38386e382b9e38388" [2]=> string(42) "e38386e382b9e383883ae38386e382b9e3838833: " } Encoding: UTF-8 XML Prologue: not present Chunk size: all data at once BOM: not prepended array(3) { [0]=> string(128) "e38386e382b9e383883ae38386e382b9e3838831: 687474703a2f2f7777772e6578616d706c652e636f6d2fe38386e382b9e383882f, e38386e382b9e38388" [1]=> string(60) "e38386e382b9e383883ae38386e382b9e3838832: e38386e382b9e38388" [2]=> string(42) "e38386e382b9e383883ae38386e382b9e3838833: " } Encoding: UTF-8 XML Prologue: present Chunk size: all data at once BOM: prepended array(3) { [0]=> string(128) "e38386e382b9e383883ae38386e382b9e3838831: 687474703a2f2f7777772e6578616d706c652e636f6d2fe38386e382b9e383882f, e38386e382b9e38388" [1]=> string(60) "e38386e382b9e383883ae38386e382b9e3838832: e38386e382b9e38388" [2]=> string(42) "e38386e382b9e383883ae38386e382b9e3838833: " } Encoding: UTF-8 XML Prologue: not present Chunk size: all data at once BOM: prepended array(3) { [0]=> string(128) "e38386e382b9e383883ae38386e382b9e3838831: 687474703a2f2f7777772e6578616d706c652e636f6d2fe38386e382b9e383882f, e38386e382b9e38388" [1]=> string(60) "e38386e382b9e383883ae38386e382b9e3838832: e38386e382b9e38388" [2]=> string(42) "e38386e382b9e383883ae38386e382b9e3838833: " } Encoding: UTF-16BE XML Prologue: present Chunk size: all data at once BOM: not prepended array(3) { [0]=> string(128) "e38386e382b9e383883ae38386e382b9e3838831: 687474703a2f2f7777772e6578616d706c652e636f6d2fe38386e382b9e383882f, e38386e382b9e38388" [1]=> string(60) "e38386e382b9e383883ae38386e382b9e3838832: e38386e382b9e38388" [2]=> string(42) "e38386e382b9e383883ae38386e382b9e3838833: " } Encoding: UTF-16BE XML Prologue: present Chunk size: all data at once BOM: prepended array(3) { [0]=> string(128) "e38386e382b9e383883ae38386e382b9e3838831: 687474703a2f2f7777772e6578616d706c652e636f6d2fe38386e382b9e383882f, e38386e382b9e38388" [1]=> string(60) "e38386e382b9e383883ae38386e382b9e3838832: e38386e382b9e38388" [2]=> string(42) "e38386e382b9e383883ae38386e382b9e3838833: " } Encoding: UTF-16BE XML Prologue: not present Chunk size: all data at once BOM: prepended array(3) { [0]=> string(128) "e38386e382b9e383883ae38386e382b9e3838831: 687474703a2f2f7777772e6578616d706c652e636f6d2fe38386e382b9e383882f, e38386e382b9e38388" [1]=> string(60) "e38386e382b9e383883ae38386e382b9e3838832: e38386e382b9e38388" [2]=> string(42) "e38386e382b9e383883ae38386e382b9e3838833: " } Encoding: UTF-16LE XML Prologue: present Chunk size: all data at once BOM: not prepended array(3) { [0]=> string(128) "e38386e382b9e383883ae38386e382b9e3838831: 687474703a2f2f7777772e6578616d706c652e636f6d2fe38386e382b9e383882f, e38386e382b9e38388" [1]=> string(60) "e38386e382b9e383883ae38386e382b9e3838832: e38386e382b9e38388" [2]=> string(42) "e38386e382b9e383883ae38386e382b9e3838833: " } Encoding: UTF-16LE XML Prologue: present Chunk size: all data at once BOM: prepended array(3) { [0]=> string(128) "e38386e382b9e383883ae38386e382b9e3838831: 687474703a2f2f7777772e6578616d706c652e636f6d2fe38386e382b9e383882f, e38386e382b9e38388" [1]=> string(60) "e38386e382b9e383883ae38386e382b9e3838832: e38386e382b9e38388" [2]=> string(42) "e38386e382b9e383883ae38386e382b9e3838833: " } Encoding: UTF-16LE XML Prologue: not present Chunk size: all data at once BOM: prepended array(3) { [0]=> string(128) "e38386e382b9e383883ae38386e382b9e3838831: 687474703a2f2f7777772e6578616d706c652e636f6d2fe38386e382b9e383882f, e38386e382b9e38388" [1]=> string(60) "e38386e382b9e383883ae38386e382b9e3838832: e38386e382b9e38388" [2]=> string(42) "e38386e382b9e383883ae38386e382b9e3838833: " } Encoding: UTF-8 XML Prologue: present Chunk size: 1 byte(s) BOM: not prepended array(3) { [0]=> string(128) "e38386e382b9e383883ae38386e382b9e3838831: 687474703a2f2f7777772e6578616d706c652e636f6d2fe38386e382b9e383882f, e38386e382b9e38388" [1]=> string(60) "e38386e382b9e383883ae38386e382b9e3838832: e38386e382b9e38388" [2]=> string(42) "e38386e382b9e383883ae38386e382b9e3838833: " } ================================================================================ 134- Encoding: UTF-8 135- XML Prologue: not present 136- Chunk size: 1 byte(s) 137- BOM: not prepended 138- array(3) { 139- [0]=> 140- string(128) "e38386e382b9e383883ae38386e382b9e3838831: 687474703a2f2f7777772e6578616d706c652e636f6d2fe38386e382b9e383882f, e38386e382b9e38388" 141- [1]=> 142- string(60) "e38386e382b9e383883ae38386e382b9e3838832: e38386e382b9e38388" 143- [2]=> 144- string(42) "e38386e382b9e383883ae38386e382b9e3838833: " 145- } 146- Encoding: UTF-8 147- XML Prologue: present 148- Chunk size: 1 byte(s) 149- BOM: prepended 150- array(3) { 151- [0]=> 152- string(128) "e38386e382b9e383883ae38386e382b9e3838831: 687474703a2f2f7777772e6578616d706c652e636f6d2fe38386e382b9e383882f, e38386e382b9e38388" 153- [1]=> 154- string(60) "e38386e382b9e383883ae38386e382b9e3838832: e38386e382b9e38388" 155- [2]=> 156- string(42) "e38386e382b9e383883ae38386e382b9e3838833: " 157- } 158- Encoding: UTF-8 159- XML Prologue: not present 160- Chunk size: 1 byte(s) 161- BOM: prepended 162- array(3) { 163- [0]=> 164- string(128) "e38386e382b9e383883ae38386e382b9e3838831: 687474703a2f2f7777772e6578616d706c652e636f6d2fe38386e382b9e383882f, e38386e382b9e38388" 165- [1]=> 166- string(60) "e38386e382b9e383883ae38386e382b9e3838832: e38386e382b9e38388" 167- [2]=> 168- string(42) "e38386e382b9e383883ae38386e382b9e3838833: " 169- } 170- Encoding: UTF-16BE 171- XML Prologue: present 172- Chunk size: 1 byte(s) 173- BOM: not prepended 174- array(3) { 175- [0]=> 176- string(128) "e38386e382b9e383883ae38386e382b9e3838831: 687474703a2f2f7777772e6578616d706c652e636f6d2fe38386e382b9e383882f, e38386e382b9e38388" 177- [1]=> 178- string(60) "e38386e382b9e383883ae38386e382b9e3838832: e38386e382b9e38388" 179- [2]=> 180- string(42) "e38386e382b9e383883ae38386e382b9e3838833: " 181- } 182- Encoding: UTF-16BE 183- XML Prologue: present 184- Chunk size: 1 byte(s) 185- BOM: prepended 186- array(3) { 187- [0]=> 188- string(128) "e38386e382b9e383883ae38386e382b9e3838831: 687474703a2f2f7777772e6578616d706c652e636f6d2fe38386e382b9e383882f, e38386e382b9e38388" 189- [1]=> 190- string(60) "e38386e382b9e383883ae38386e382b9e3838832: e38386e382b9e38388" 191- [2]=> 192- string(42) "e38386e382b9e383883ae38386e382b9e3838833: " 193- } 194- Encoding: UTF-16BE 195- XML Prologue: not present 196- Chunk size: 1 byte(s) 197- BOM: prepended 198- array(3) { 199- [0]=> 200- string(128) "e38386e382b9e383883ae38386e382b9e3838831: 687474703a2f2f7777772e6578616d706c652e636f6d2fe38386e382b9e383882f, e38386e382b9e38388" 201- [1]=> 202- string(60) "e38386e382b9e383883ae38386e382b9e3838832: e38386e382b9e38388" 203- [2]=> 204- string(42) "e38386e382b9e383883ae38386e382b9e3838833: " 205- } 206- Encoding: UTF-16LE 207- XML Prologue: present 208- Chunk size: 1 byte(s) 209- BOM: not prepended 210- array(3) { 211- [0]=> 212- string(128) "e38386e382b9e383883ae38386e382b9e3838831: 687474703a2f2f7777772e6578616d706c652e636f6d2fe38386e382b9e383882f, e38386e382b9e38388" 213- [1]=> 214- string(60) "e38386e382b9e383883ae38386e382b9e3838832: e38386e382b9e38388" 215- [2]=> 216- string(42) "e38386e382b9e383883ae38386e382b9e3838833: " 217- } 218- Encoding: UTF-16LE 219- XML Prologue: present 220- Chunk size: 1 byte(s) 221- BOM: prepended 222- array(3) { 223- [0]=> 224- string(128) "e38386e382b9e383883ae38386e382b9e3838831: 687474703a2f2f7777772e6578616d706c652e636f6d2fe38386e382b9e383882f, e38386e382b9e38388" 225- [1]=> 226- string(60) "e38386e382b9e383883ae38386e382b9e3838832: e38386e382b9e38388" 227- [2]=> 228- string(42) "e38386e382b9e383883ae38386e382b9e3838833: " 229- } 230- Encoding: UTF-16LE 231- XML Prologue: not present 232- Chunk size: 1 byte(s) 233- BOM: prepended 234- array(3) { 235- [0]=> 236- string(128) "e38386e382b9e383883ae38386e382b9e3838831: 687474703a2f2f7777772e6578616d706c652e636f6d2fe38386e382b9e383882f, e38386e382b9e38388" 237- [1]=> 238- string(60) "e38386e382b9e383883ae38386e382b9e3838832: e38386e382b9e38388" 239- [2]=> 240- string(42) "e38386e382b9e383883ae38386e382b9e3838833: " 241- } ================================================================================ ================================================================================ /home/liber/download/php/php-5.2.3/sapi/cli/tests/015.phpt ================================================================================ PHP 5.2.3 (cli) (built: Jul 26 2007 13:35:33) PHP 5.2.3 (cli) (built: Jul 26 2007 13:35:33) Usage: php [options] [-f] <file> [--] [args...] Done ================================================================================ 002+ 003+ PHP 5.2.3 (cli) (built: Jul 26 2007 13:35:33) 004+ Usage: php [options] [-f] <file> [--] [args...] 005+ Done 002- Array 003- ( 004- [0] => - 005- [1] => foo 006- [2] => bar 007- [3] => baz 008- ) 009- 010- PHP %d.%d.%d%s(cli) (built: %s)%s 011- Usage: php [options] [-f] <file> [--] [args...] 012- Done ================================================================================ ================================================================================ BUILD ENVIRONMENT ================================================================================ OS: Linux - Linux host1.iproom.com 2.6.18-8.1.3.el5 #1 SMP Mon Apr 30 19:55:44 EDT 2007 i686 Autoconf: Bundled Libtool: ltmain.sh (GNU libtool) 1.5.20 (1.1220.2.287 2005/08/31 18:54:15) Copyright (C) 2005 Free Software Foundation, Inc. This is free software; see the source for copying conditions. There is NO warranty; not even for MERCHANTABILITY or FITNESS FOR A PARTICULAR PURPOSE. System Libtool: N/A Compiler: Using built-in specs. Target: i386-redhat-linux Configured with: ../configure --prefix=/usr --mandir=/usr/share/man --infodir=/usr/share/info --enable-shared --enable-threads=posix --enable-checking=release --with-system-zlib --enable-__cxa_atexit --disable-libunwind-exceptions --enable-libgcj-multifile --enable-languages=c,c++,objc,obj-c++,java,fortran,ada --enable-java-awt=gtk --disable-dssi --enable-plugin --with-java-home=/usr/lib/jvm/java-1.4.2-gcj-1.4.2.0/jre --with-cpu=generic --host=i386-redhat-linux Thread model: posix gcc version 4.1.1 20070105 (Red Hat 4.1.1-52) Bison: bison (GNU Bison) 2.3 Written by Robert Corbett and Richard Stallman. Copyright (C) 2006 Free Software Foundation, Inc. This is free software; see the source for copying conditions. There is NO warranty; not even for MERCHANTABILITY or FITNESS FOR A PARTICULAR PURPOSE. Libraries: linux-gate.so.1 => (0x40000000) libcrypt.so.1 => /lib/libcrypt.so.1 (0x00712000) libaspell.so.15 => /usr/lib/libaspell.so.15 (0x00cc7000) libpspell.so.15 => /usr/lib/libpspell.so.15 (0x006ac000) libgmp.so.3 => /usr/lib/sse2/libgmp.so.3 (0x007a1000) libcurl.so.3 => /usr/lib/libcurl.so.3 (0x00763000) libbz2.so.1 => /usr/lib/libbz2.so.1 (0x00750000) libz.so.1 => /usr/lib/libz.so.1 (0x006c1000) libpcre.so.0 => /lib/libpcre.so.0 (0x006d6000) libresolv.so.2 => /lib/libresolv.so.2 (0x007e2000) libm.so.6 => /lib/libm.so.6 (0x00650000) libdl.so.2 => /lib/libdl.so.2 (0x00631000) libnsl.so.1 => /lib/libnsl.so.1 (0x006fa000) libxml2.so.2 => /usr/lib/libxml2.so.2 (0x00b93000) libgssapi_krb5.so.2 => /usr/lib/libgssapi_krb5.so.2 (0x4000b000) libkrb5.so.3 => /usr/lib/libkrb5.so.3 (0x40036000) libk5crypto.so.3 => /usr/lib/libk5crypto.so.3 (0x400be000) libcom_err.so.2 => /lib/libcom_err.so.2 (0x004ed000) libssl.so.6 => /lib/libssl.so.6 (0x00b42000) libcrypto.so.6 => /lib/libcrypto.so.6 (0x00838000) libidn.so.11 => /usr/lib/libidn.so.11 (0x00679000) libc.so.6 => /lib/libc.so.6 (0x004f2000) libstdc++.so.6 => /usr/lib/libstdc++.so.6 (0x009a3000) libgcc_s.so.1 => /lib/libgcc_s.so.1 (0x00742000) /lib/ld-linux.so.2 (0x004d0000) libkrb5support.so.0 => /usr/lib/libkrb5support.so.0 (0x400e6000) User's E-mail: liber at iproom dot com ================================================================================ PHPINFO ================================================================================ phpinfo() PHP Version => 5.2.3 System => Linux host1.iproom.com 2.6.18-8.1.3.el5 #1 SMP Mon Apr 30 19:55:44 EDT 2007 i686 Build Date => Jul 26 2007 13:33:56 Configure Command => './configure' '--build=i686-redhat-linux-gnu' '--host=i686-redhat-linux-gnu' '--target=i386-redhat-linux-gnu' '--program-prefix=' '--prefix=/usr' '--exec-prefix=/usr' '--bindir=/usr/bin' '--sbindir=/usr/sbin' '--sysconfdir=/etc' '--datadir=/usr/share' '--includedir=/usr/include' '--libdir=/usr/lib' '--libexecdir=/usr/libexec' '--localstatedir=/var' '--sharedstatedir=/usr/com' '--mandir=/usr/share/man' '--infodir=/usr/share/info' '--cache-file=../config.cache' '--with-libdir=lib' '--with-config-file-path=/etc' '--with-config-file-scan-dir=/etc/php.d' '--disable-debug' '--with-pic' '--disable-rpath' '--without-pear' '--with-bz2' '--with-curl' '--with-exec-dir=/usr/bin' '--with-freetype-dir=/usr' '--with-png-dir=/usr' '--enable-gd-native-ttf' '--without-gdbm' '--with-gettext' '--with-gmp' '--with-iconv' '--with-jpeg-dir=/usr' '--with-openssl' '--with-png' '--with-pspell' '--with-expat-dir=/usr' '--with-pcre-regex=/usr' '--with-zlib' '--with-layout=GNU' '--! enable-exif' '--enable-ftp' '--enable-magic-quotes' '--enable-sockets' '--enable-sysvsem' '--enable-sysvshm' '--enable-sysvmsg' '--enable-track-vars' '--enable-trans-sid' '--enable-yp' '--enable-wddx' '--with-kerberos' '--enable-ucd-snmp-hack' '--with-unixODBC=shared,/usr' '--enable-memory-limit' '--enable-shmop' '--enable-calendar' '--enable-dbx' '--enable-dio' '--with-mime-magic=/etc/httpd/conf/magic' '--without-sqlite' '--with-libxml-dir=/usr' '--with-xml' '--with-apxs2=/usr/sbin/apxs' '--without-mysql' '--without-gd' '--without-odbc' '--disable-dom' '--disable-dba' '--without-unixODBC' '--disable-pdo' '--disable-xmlreader' '--disable-xmlwriter' Server API => Command Line Interface Virtual Directory Support => disabled Configuration File (php.ini) Path => /etc Loaded Configuration File => /usr/local/Zend/etc/php.ini Scan this dir for additional .ini files => /etc/php.d additional .ini files parsed => /etc/php.d/gd.ini, /etc/php.d/ldap.ini, /etc/php.d/mbstring.ini, /etc/php.d/mysql.ini, /etc/php.d/mysqli.ini, /etc/php.d/pdo.ini, /etc/php.d/pdo_mysql.ini, /etc/php.d/pdo_sqlite.ini, /etc/php.d/soap.ini PHP API => 20041225 PHP Extension => 20060613 Zend Extension => 220060519 Debug Build => no Thread Safety => disabled Zend Memory Manager => enabled IPv6 Support => enabled Registered PHP Streams => php, file, data, http, ftp, compress.bzip2, compress.zlib, https, ftps Registered Stream Socket Transports => tcp, udp, unix, udg, ssl, sslv3, sslv2, tls Registered Stream Filters => string.rot13, string.toupper, string.tolower, string.strip_tags, convert.*, consumed, convert.iconv.*, bzip2.*, zlib.* This program makes use of the Zend Scripting Language Engine: Zend Engine v2.2.0, Copyright (c) 1998-2007 Zend Technologies with Zend Extension Manager v1.2.0, Copyright (c) 2003-2007, by Zend Technologies with Zend Optimizer v3.3.0, Copyright (c) 1998-2007, by Zend Technologies _______________________________________________________________________ Configuration PHP Core Directive => Local Value => Master Value allow_call_time_pass_reference => Off => Off allow_url_fopen => On => On allow_url_include => Off => Off always_populate_raw_post_data => Off => Off arg_separator.input => & => & arg_separator.output => & => & asp_tags => Off => Off auto_append_file => no value => no value auto_globals_jit => On => On auto_prepend_file => no value => no value browscap => no value => no value default_charset => no value => no value default_mimetype => text/html => text/html define_syslog_variables => Off => Off disable_classes => no value => no value disable_functions => no value => no value display_errors => Off => Off display_startup_errors => Off => Off doc_root => no value => no value docref_ext => no value => no value docref_root => no value => no value enable_dl => On => On error_append_string => no value => no value error_log => /var/log/httpd/php.log => /var/log/httpd/php.log error_prepend_string => no value => no value error_reporting => 6143 => 6143 expose_php => On => On extension_dir => /usr/lib/php/modules => /usr/lib/php/modules file_uploads => On => On highlight.bg => <font style="color: #FFFFFF">#FFFFFF</font> => <font style="color: #FFFFFF">#FFFFFF</font> highlight.comment => <font style="color: #FF8000">#FF8000</font> => <font style="color: #FF8000">#FF8000</font> highlight.default => <font style="color: #0000BB">#0000BB</font> => <font style="color: #0000BB">#0000BB</font> highlight.html => <font style="color: #000000">#000000</font> => <font style="color: #000000">#000000</font> highlight.keyword => <font style="color: #007700">#007700</font> => <font style="color: #007700">#007700</font> highlight.string => <font style="color: #DD0000">#DD0000</font> => <font style="color: #DD0000">#DD0000</font> html_errors => Off => Off ignore_repeated_errors => Off => Off ignore_repeated_source => Off => Off ignore_user_abort => Off => Off implicit_flush => On => On include_path => .: => .: log_errors => On => On log_errors_max_len => 1024 => 1024 magic_quotes_gpc => Off => Off magic_quotes_runtime => Off => Off magic_quotes_sybase => Off => Off mail.force_extra_parameters => no value => no value max_execution_time => 0 => 0 max_input_nesting_level => 64 => 64 max_input_time => -1 => -1 memory_limit => 16M => 16M open_basedir => no value => no value output_buffering => 0 => 0 output_handler => no value => no value post_max_size => 8M => 8M precision => 14 => 14 realpath_cache_size => 16K => 16K realpath_cache_ttl => 120 => 120 register_argc_argv => On => On register_globals => Off => Off register_long_arrays => Off => Off report_memleaks => On => On report_zend_debug => Off => Off safe_mode => Off => Off safe_mode_exec_dir => no value => no value safe_mode_gid => Off => Off safe_mode_include_dir => no value => no value sendmail_from => no value => no value sendmail_path => /usr/sbin/sendmail -t -i => /usr/sbin/sendmail -t -i serialize_precision => 100 => 100 short_open_tag => On => On SMTP => localhost => localhost smtp_port => 25 => 25 sql.safe_mode => Off => Off track_errors => Off => Off unserialize_callback_func => no value => no value upload_max_filesize => 2M => 2M upload_tmp_dir => no value => no value user_dir => no value => no value variables_order => EGPCS => EGPCS xmlrpc_error_number => 0 => 0 xmlrpc_errors => Off => Off y2k_compliance => On => On zend.ze1_compatibility_mode => Off => Off bz2 BZip2 Support => Enabled Stream Wrapper support => compress.bz2:// Stream Filter support => bzip2.decompress, bzip2.compress BZip2 Version => 1.0.3, 15-Feb-2005 calendar Calendar support => enabled ctype ctype functions => enabled curl cURL support => enabled cURL Information => libcurl/7.15.5 OpenSSL/0.9.8b zlib/1.2.3 libidn/0.6.5 date date/time support => enabled "Olson" Timezone Database Version => 2007.5 Timezone Database => internal Default timezone => Asia/Chongqing Directive => Local Value => Master Value date.default_latitude => 31.7667 => 31.7667 date.default_longitude => 35.2333 => 35.2333 date.sunrise_zenith => 90.583333 => 90.583333 date.sunset_zenith => 90.583333 => 90.583333 date.timezone => no value => no value exif EXIF Support => enabled EXIF Version => 1.4 $Id: exif.c,v 1.173.2.5.2.19 2007/02/27 03:04:40 iliaa Exp $ Supported EXIF Version => 0220 Supported filetypes => JPEG,TIFF filter Input Validation and Filtering => enabled Revision => $Revision: 1.52.2.39 $ Directive => Local Value => Master Value filter.default => unsafe_raw => unsafe_raw filter.default_flags => no value => no value ftp FTP support => enabled gettext GetText Support => enabled gmp gmp support => enabled GMP version => 4.1.4 hash hash support => enabled Hashing Engines => md2 md4 md5 sha1 sha256 sha384 sha512 ripemd128 ripemd160 ripemd256 ripemd320 whirlpool tiger128,3 tiger160,3 tiger192,3 tiger128,4 tiger160,4 tiger192,4 snefru gost adler32 crc32 crc32b haval128,3 haval160,3 haval192,3 haval224,3 haval256,3 haval128,4 haval160,4 haval192,4 haval224,4 haval256,4 haval128,5 haval160,5 haval192,5 haval224,5 haval256,5 iconv iconv support => enabled iconv implementation => glibc iconv library version => 2.5 Directive => Local Value => Master Value iconv.input_encoding => ISO-8859-1 => ISO-8859-1 iconv.internal_encoding => ISO-8859-1 => ISO-8859-1 iconv.output_encoding => ISO-8859-1 => ISO-8859-1 json json support => enabled json version => 1.2.1 libxml libXML support => active libXML Version => 2.6.26 libXML streams => enabled mime_magic mime_magic support => enabled Directive => Local Value => Master Value mime_magic.debug => Off => Off mime_magic.magicfile => /etc/httpd/conf/magic => /etc/httpd/conf/magic openssl OpenSSL support => enabled OpenSSL Version => OpenSSL 0.9.8b 04 May 2006 pcre PCRE (Perl Compatible Regular Expressions) Support => enabled PCRE Library Version => 6.6 06-Feb-2006 posix Revision => $Revision: 1.70.2.3.2.15 $ pspell PSpell Support => enabled Reflection Reflection => enabled Version => $Id: php_reflection.c,v 1.164.2.33.2.39 2007/05/29 08:44:05 helly Exp $ session Session Support => enabled Registered save handlers => files user Registered serializer handlers => php php_binary wddx Directive => Local Value => Master Value session.auto_start => Off => Off session.bug_compat_42 => Off => Off session.bug_compat_warn => On => On session.cache_expire => 180 => 180 session.cache_limiter => nocache => nocache session.cookie_domain => no value => no value session.cookie_httponly => Off => Off session.cookie_lifetime => 0 => 0 session.cookie_path => / => / session.cookie_secure => Off => Off session.entropy_file => no value => no value session.entropy_length => 0 => 0 session.gc_divisor => 1000 => 1000 session.gc_maxlifetime => 1440 => 1440 session.gc_probability => 1 => 1 session.hash_bits_per_character => 5 => 5 session.hash_function => 0 => 0 session.name => PHPSESSID => PHPSESSID session.referer_check => no value => no value session.save_handler => files => files session.save_path => /var/lib/php/session => /var/lib/php/session session.serialize_handler => php => php session.use_cookies => On => On session.use_only_cookies => Off => Off session.use_trans_sid => 0 => 0 shmop shmop support => enabled SimpleXML Simplexml support => enabled Revision => $Revision: 1.151.2.22.2.26 $ Schema support => enabled sockets Sockets Support => enabled SPL SPL support => enabled Interfaces => Countable, OuterIterator, RecursiveIterator, SeekableIterator, SplObserver, SplSubject Classes => AppendIterator, ArrayIterator, ArrayObject, BadFunctionCallException, BadMethodCallException, CachingIterator, DirectoryIterator, DomainException, EmptyIterator, FilterIterator, InfiniteIterator, InvalidArgumentException, IteratorIterator, LengthException, LimitIterator, LogicException, NoRewindIterator, OutOfBoundsException, OutOfRangeException, OverflowException, ParentIterator, RangeException, RecursiveArrayIterator, RecursiveCachingIterator, RecursiveDirectoryIterator, RecursiveFilterIterator, RecursiveIteratorIterator, RecursiveRegexIterator, RegexIterator, RuntimeException, SimpleXMLIterator, SplFileInfo, SplFileObject, SplObjectStorage, SplTempFileObject, UnderflowException, UnexpectedValueException standard Regex Library => Bundled library enabled Dynamic Library Support => enabled Path to sendmail => /usr/sbin/sendmail -t -i Directive => Local Value => Master Value assert.active => 1 => 1 assert.bail => 0 => 0 assert.callback => no value => no value assert.quiet_eval => 0 => 0 assert.warning => 1 => 1 auto_detect_line_endings => 0 => 0 default_socket_timeout => 60 => 60 safe_mode_allowed_env_vars => PHP_ => PHP_ safe_mode_protected_env_vars => LD_LIBRARY_PATH => LD_LIBRARY_PATH url_rewriter.tags => a=href,area=href,frame=src,input=src,form=fakeentry => a=href,area=href,frame=src,input=src,form=fakeentry user_agent => no value => no value sysvmsg sysvmsg support => enabled Revision => $Revision: 1.20.2.3.2.6 $ tokenizer Tokenizer Support => enabled wddx WDDX Support => enabled WDDX Session Serializer => enabled xml XML Support => active XML Namespace Support => active libxml2 Version => 2.6.26 Zend Optimizer Optimization Pass 1 => enabled Optimization Pass 2 => enabled Optimization Pass 3 => enabled Optimization Pass 4 => enabled Optimization Pass 9 => enabled Zend Loader => enabled License Path => Obfuscation level => 3 zlib ZLib Support => enabled Stream Wrapper support => compress.zlib:// Stream Filter support => zlib.inflate, zlib.deflate Compiled Version => 1.2.3 Linked Version => 1.2.3 Directive => Local Value => Master Value zlib.output_compression => Off => Off zlib.output_compression_level => -1 => -1 zlib.output_handler => no value => no value Additional Modules Module Name sysvsem sysvshm Environment Variable => Value HOSTNAME => host1.iproom.com TEST_PHP_SRCDIR => /home/liber/download/php/php-5.2.3 SHELL => /bin/bash TERM => xterm MAKEFLAGS => HISTSIZE => 1000 SSH_CLIENT => deleted SSH_TTY => deleted USER => liber LS_COLORS => no=00:fi=00:di=00;34:ln=00;36:pi=40;33:so=00;35:bd=40;33;01:cd=40;33;01:or=01;05;37;41:mi=01;05;37;41:ex=00;32:*.cmd=00;32:*.exe=00;32:*.com=00;32:*.btm=00;32:*.bat=00;32:*.sh=00;32:*.csh=00;32:*.tar=00;31:*.tgz=00;31:*.arj=00;31:*.taz=00;31:*.lzh=00;31:*.zip=00;31:*.z=00;31:*.Z=00;31:*.gz=00;31:*.bz2=00;31:*.bz=00;31:*.tz=00;31:*.rpm=00;31:*.cpio=00;31:*.jpg=00;35:*.gif=00;35:*.bmp=00;35:*.xbm=00;35:*.xpm=00;35:*.png=00;35:*.tif=00;35: SSH_AUTH_SOCK => deleted MAKELEVEL => 1 MFLAGS => PATH => /usr/kerberos/sbin:/usr/kerberos/bin:/usr/local/bin:/bin:/usr/bin:/home/liber/bin:/sbin:/usr/sbin MAIL => /var/spool/mail/liber _ => /home/liber/download/php/php-5.2.3/sapi/cli/php PWD => /home/liber/download/php/php-5.2.3 INPUTRC => /etc/inputrc LANG => en_US.UTF-8 TEST_PHP_EXECUTABLE => /home/liber/download/php/php-5.2.3/sapi/cli/php HOME => /root SHLVL => 4 LOGNAME => liber SSH_CONNECTION => deleted LESSOPEN => |/usr/bin/lesspipe.sh %s CC => gcc G_BROKEN_FILENAMES => 1 PHP Variables Variable => Value _SERVER["HOSTNAME"] => host1.iproom.com _SERVER["TEST_PHP_SRCDIR"] => /home/liber/download/php/php-5.2.3 _SERVER["SHELL"] => /bin/bash _SERVER["TERM"] => xterm _SERVER["MAKEFLAGS"] => _SERVER["HISTSIZE"] => 1000 _SERVER["SSH_CLIENT"] => deleted _SERVER["SSH_TTY"] => deleted _SERVER["USER"] => liber _SERVER["LS_COLORS"] => no=00:fi=00:di=00;34:ln=00;36:pi=40;33:so=00;35:bd=40;33;01:cd=40;33;01:or=01;05;37;41:mi=01;05;37;41:ex=00;32:*.cmd=00;32:*.exe=00;32:*.com=00;32:*.btm=00;32:*.bat=00;32:*.sh=00;32:*.csh=00;32:*.tar=00;31:*.tgz=00;31:*.arj=00;31:*.taz=00;31:*.lzh=00;31:*.zip=00;31:*.z=00;31:*.Z=00;31:*.gz=00;31:*.bz2=00;31:*.bz=00;31:*.tz=00;31:*.rpm=00;31:*.cpio=00;31:*.jpg=00;35:*.gif=00;35:*.bmp=00;35:*.xbm=00;35:*.xpm=00;35:*.png=00;35:*.tif=00;35: _SERVER["SSH_AUTH_SOCK"] => deleted _SERVER["MAKELEVEL"] => 1 _SERVER["MFLAGS"] => _SERVER["PATH"] => /usr/kerberos/sbin:/usr/kerberos/bin:/usr/local/bin:/bin:/usr/bin:/home/liber/bin:/sbin:/usr/sbin _SERVER["MAIL"] => /var/spool/mail/liber _SERVER["_"] => /home/liber/download/php/php-5.2.3/sapi/cli/php _SERVER["PWD"] => /home/liber/download/php/php-5.2.3 _SERVER["INPUTRC"] => /etc/inputrc _SERVER["LANG"] => en_US.UTF-8 _SERVER["TEST_PHP_EXECUTABLE"] => /home/liber/download/php/php-5.2.3/sapi/cli/php _SERVER["HOME"] => /root _SERVER["SHLVL"] => 4 _SERVER["LOGNAME"] => liber _SERVER["SSH_CONNECTION"] => deleted _SERVER["LESSOPEN"] => |/usr/bin/lesspipe.sh %s _SERVER["CC"] => gcc _SERVER["G_BROKEN_FILENAMES"] => 1 _SERVER["PHP_SELF"] => _SERVER["SCRIPT_NAME"] => _SERVER["SCRIPT_FILENAME"] => _SERVER["PATH_TRANSLATED"] => _SERVER["DOCUMENT_ROOT"] => _SERVER["REQUEST_TIME"] => 1185428557 _SERVER["argv"] => Array ( ) _SERVER["argc"] => 0 _ENV["HOSTNAME"] => host1.iproom.com _ENV["TEST_PHP_SRCDIR"] => /home/liber/download/php/php-5.2.3 _ENV["SHELL"] => /bin/bash _ENV["TERM"] => xterm _ENV["MAKEFLAGS"] => _ENV["HISTSIZE"] => 1000 _ENV["SSH_CLIENT"] => deleted _ENV["SSH_TTY"] => deleted _ENV["USER"] => liber _ENV["LS_COLORS"] => no=00:fi=00:di=00;34:ln=00;36:pi=40;33:so=00;35:bd=40;33;01:cd=40;33;01:or=01;05;37;41:mi=01;05;37;41:ex=00;32:*.cmd=00;32:*.exe=00;32:*.com=00;32:*.btm=00;32:*.bat=00;32:*.sh=00;32:*.csh=00;32:*.tar=00;31:*.tgz=00;31:*.arj=00;31:*.taz=00;31:*.lzh=00;31:*.zip=00;31:*.z=00;31:*.Z=00;31:*.gz=00;31:*.bz2=00;31:*.bz=00;31:*.tz=00;31:*.rpm=00;31:*.cpio=00;31:*.jpg=00;35:*.gif=00;35:*.bmp=00;35:*.xbm=00;35:*.xpm=00;35:*.png=00;35:*.tif=00;35: _ENV["SSH_AUTH_SOCK"] => deleted _ENV["MAKELEVEL"] => 1 _ENV["MFLAGS"] => _ENV["PATH"] => /usr/kerberos/sbin:/usr/kerberos/bin:/usr/local/bin:/bin:/usr/bin:/home/liber/bin:/sbin:/usr/sbin _ENV["MAIL"] => /var/spool/mail/liber _ENV["_"] => /home/liber/download/php/php-5.2.3/sapi/cli/php _ENV["PWD"] => /home/liber/download/php/php-5.2.3 _ENV["INPUTRC"] => /etc/inputrc _ENV["LANG"] => en_US.UTF-8 _ENV["TEST_PHP_EXECUTABLE"] => /home/liber/download/php/php-5.2.3/sapi/cli/php _ENV["HOME"] => /root _ENV["SHLVL"] => 4 _ENV["LOGNAME"] => liber _ENV["SSH_CONNECTION"] => deleted _ENV["LESSOPEN"] => |/usr/bin/lesspipe.sh %s _ENV["CC"] => gcc _ENV["G_BROKEN_FILENAMES"] => 1 PHP License This program is free software; you can redistribute it and/or modify it under the terms of the PHP License as published by the PHP Group and included in the distribution in the file: LICENSE This program is distributed in the hope that it will be useful, but WITHOUT ANY WARRANTY; without even the implied warranty of MERCHANTABILITY or FITNESS FOR A PARTICULAR PURPOSE. If you did not receive a copy of the PHP license, or have any questions about PHP licensing, please contact license@php.net.

« previous php.qa (#41913) next »