Test results for 5.2.4 [failed]
| From: | noreply@php.net | Date: | Fri, 31 Aug 2007 17:25:45 +0000 |
| Subject: | Test results for 5.2.4 [failed] | ||
| Groups: | php.qa | ||
| Request: | Send a blank email to php-qa+get-43657@lists.php.net to get a copy of this message | ||
=====================================================================
FAILED TEST SUMMARY
---------------------------------------------------------------------
libgd #106 (imagerectangle 1x1 draws 1x3) [ext/gd/tests/libgd00106.phpt]
Bug #31422 (No Error-Logging on SoapServer-Side) [ext/soap/tests/bugs/bug31422.phpt]
SOAP typemap 1: SoapServer support for typemap's from_xml() [ext/soap/tests/typemap001.phpt]
SOAP Typemap 3: SoapClient support for typemap's from_xml() [ext/soap/tests/typemap003.phpt]
SOAP typemap 5: SoapServer support for typemap's from_xml() (without WSDL)
[ext/soap/tests/typemap005.phpt]
SOAP Typemap 7: SoapClient support for typemap's from_xml() (without WSDL)
[ext/soap/tests/typemap007.phpt]
flock() tests [ext/standard/tests/file/flock.phpt]
Test flock() function: Basic functionality [ext/standard/tests/file/flock_basic.phpt]
Test flock() function: Variations [ext/standard/tests/file/flock_variation.phpt]
Test lstat() and stat() functions: usage variations - effects of touch() on link
[ext/standard/tests/file/lstat_stat_variation6.phpt]
proc_open() regression test 1 (proc_open() leak) [ext/standard/tests/file/proc_open01.phpt]
Bug #24142 (round() problems) [ext/standard/tests/math/bug24142.phpt]
Bug #25694 (round() and number_format() inconsistency) [ext/standard/tests/math/bug25694.phpt]
highlight_file() and output buffer [ext/standard/tests/strings/006.phpt]
php_strip_whitespace() and output buffer [ext/standard/tests/strings/007.phpt]
version string [sapi/cli/tests/001.phpt]
show information about function [sapi/cli/tests/004.phpt]
show information about class [sapi/cli/tests/005.phpt]
show information about extension [sapi/cli/tests/006.phpt]
strip comments and whitespace with -w [sapi/cli/tests/007.phpt]
execute a file with -f [sapi/cli/tests/008.phpt]
using invalid combinations of cmdline options [sapi/cli/tests/009.phpt]
syntax check [sapi/cli/tests/011.phpt]
invalid arguments and error messages [sapi/cli/tests/012.phpt]
syntax highlighting [sapi/cli/tests/014.phpt]
CLI long options [sapi/cli/tests/015.phpt]
=====================================================================
=====================================================================
TEST RESULT SUMMARY
---------------------------------------------------------------------
Exts skipped : 54
Exts tested : 25
---------------------------------------------------------------------
Number of tests : 3879 2521
Tests skipped : 1358 ( 35.0%) --------
Tests warned : 0 ( 0.0%) ( 0.0%)
Tests failed : 26 ( 0.7%) ( 1.0%)
Tests passed : 2495 ( 64.3%) ( 99.0%)
---------------------------------------------------------------------
Time taken : 417 seconds
=====================================================================
=====================================================================
FAILED TEST SUMMARY
---------------------------------------------------------------------
libgd #106 (imagerectangle 1x1 draws 1x3) [ext/gd/tests/libgd00106.phpt]
Bug #31422 (No Error-Logging on SoapServer-Side) [ext/soap/tests/bugs/bug31422.phpt]
SOAP typemap 1: SoapServer support for typemap's from_xml() [ext/soap/tests/typemap001.phpt]
SOAP Typemap 3: SoapClient support for typemap's from_xml() [ext/soap/tests/typemap003.phpt]
SOAP typemap 5: SoapServer support for typemap's from_xml() (without WSDL)
[ext/soap/tests/typemap005.phpt]
SOAP Typemap 7: SoapClient support for typemap's from_xml() (without WSDL)
[ext/soap/tests/typemap007.phpt]
flock() tests [ext/standard/tests/file/flock.phpt]
Test flock() function: Basic functionality [ext/standard/tests/file/flock_basic.phpt]
Test flock() function: Variations [ext/standard/tests/file/flock_variation.phpt]
Test lstat() and stat() functions: usage variations - effects of touch() on link
[ext/standard/tests/file/lstat_stat_variation6.phpt]
proc_open() regression test 1 (proc_open() leak) [ext/standard/tests/file/proc_open01.phpt]
Bug #24142 (round() problems) [ext/standard/tests/math/bug24142.phpt]
Bug #25694 (round() and number_format() inconsistency) [ext/standard/tests/math/bug25694.phpt]
highlight_file() and output buffer [ext/standard/tests/strings/006.phpt]
php_strip_whitespace() and output buffer [ext/standard/tests/strings/007.phpt]
version string [sapi/cli/tests/001.phpt]
show information about function [sapi/cli/tests/004.phpt]
show information about class [sapi/cli/tests/005.phpt]
show information about extension [sapi/cli/tests/006.phpt]
strip comments and whitespace with -w [sapi/cli/tests/007.phpt]
execute a file with -f [sapi/cli/tests/008.phpt]
using invalid combinations of cmdline options [sapi/cli/tests/009.phpt]
syntax check [sapi/cli/tests/011.phpt]
invalid arguments and error messages [sapi/cli/tests/012.phpt]
syntax highlighting [sapi/cli/tests/014.phpt]
CLI long options [sapi/cli/tests/015.phpt]
=====================================================================
================================================================================
/usr/local/src/php-5.2.4/ext/gd/tests/libgd00106.phpt
================================================================================
failed
================================================================================
001+ failed
001- Ok
================================================================================
================================================================================
/usr/local/src/php-5.2.4/ext/soap/tests/bugs/bug31422.phpt
================================================================================
<?xml version="1.0" encoding="UTF-8"?>
<SOAP-ENV:Envelope xmlns:SOAP-ENV="http://schemas.xmlsoap.org/soap/envelope/"><SOAP-ENV:Body><SOAP-ENV:Fault><faultcode>SOAP-ENV:Server</faultcode><faultstring>Hello</faultstring></SOAP-ENV:Fault></SOAP-ENV:Body></SOAP-ENV:Envelope>
================================================================================
001- PHP Warning: fopen() expects at least 2 parameters, 0 given in %sbug31422.php on line %d
002- PHP Fatal error: Hello in %sbug31422.php on line %d
================================================================================
================================================================================
/usr/local/src/php-5.2.4/ext/soap/tests/typemap001.phpt
================================================================================
<?xml version="1.0" encoding="UTF-8"?>
<SOAP-ENV:Envelope xmlns:SOAP-ENV="http://schemas.xmlsoap.org/soap/envelope/"><SOAP-ENV:Body><SOAP-ENV:Fault><faultcode>SOAP-ENV:Server</faultcode><faultstring>Call
to undefined function
simplexml_load_string()</faultstring></SOAP-ENV:Fault></SOAP-ENV:Body></SOAP-ENV:Envelope>
================================================================================
002+ <SOAP-ENV:Envelope xmlns:SOAP-ENV="http://schemas.xmlsoap.org/soap/envelope/"><SOAP-ENV:Body><SOAP-ENV:Fault><faultcode>SOAP-ENV:Server</faultcode><faultstring>Call
to undefined function
simplexml_load_string()</faultstring></SOAP-ENV:Fault></SOAP-ENV:Body></SOAP-ENV:Envelope>
002- <SOAP-ENV:Envelope xmlns:SOAP-ENV="http://schemas.xmlsoap.org/soap/envelope/"
xmlns:ns1="http://schemas.nothing.com"
xmlns:xsd="http://www.w3.org/2001/XMLSchema"
xmlns:xsi="http://www.w3.org/2001/XMLSchema-instance"
xmlns:SOAP-ENC="http://schemas.xmlsoap.org/soap/encoding/"
SOAP-ENV:encodingStyle="http://schemas.xmlsoap.org/soap/encoding/"><SOAP-ENV:Body><ns1:dotestResponse><res
xsi:type="xsd:string">Object:
book(foo,bar)</res></ns1:dotestResponse></SOAP-ENV:Body></SOAP-ENV:Envelope>
003- ok
================================================================================
================================================================================
/usr/local/src/php-5.2.4/ext/soap/tests/typemap003.phpt
================================================================================
Fatal error: Uncaught SoapFault exception: [Client] Call to undefined function
simplexml_load_string() in /usr/local/src/php-5.2.4/ext/soap/tests/typemap003.php:23
Stack trace:
#0 /usr/local/src/php-5.2.4/ext/soap/tests/typemap003.php(23): book_from_xml()
#1 [internal function]: book_from_xml('<res xmlns:xsi=...')
#2 [internal function]: SoapClient->__call('dotest2', Array)
#3 /usr/local/src/php-5.2.4/ext/soap/tests/typemap003.php(38):
TestSoapClient->dotest2('???')
#4 {main}
thrown in /usr/local/src/php-5.2.4/ext/soap/tests/typemap003.php on line 23
================================================================================
001+ Fatal error: Uncaught SoapFault exception: [Client] Call to undefined function
simplexml_load_string() in /usr/local/src/php-5.2.4/ext/soap/tests/typemap003.php:23
002+ Stack trace:
003+ #0 /usr/local/src/php-5.2.4/ext/soap/tests/typemap003.php(23): book_from_xml()
004+ #1 [internal function]: book_from_xml('<res xmlns:xsi=...')
005+ #2 [internal function]: SoapClient->__call('dotest2', Array)
006+ #3 /usr/local/src/php-5.2.4/ext/soap/tests/typemap003.php(38):
TestSoapClient->dotest2('???')
007+ #4 {main}
001- object(book)#%d (2) {
002- ["a"]=>
003- string(3) "foo"
004- ["b"]=>
005- string(3) "bar"
006- }
007- ok
008+ thrown in /usr/local/src/php-5.2.4/ext/soap/tests/typemap003.php on line 23
================================================================================
================================================================================
/usr/local/src/php-5.2.4/ext/soap/tests/typemap005.phpt
================================================================================
<?xml version="1.0" encoding="UTF-8"?>
<SOAP-ENV:Envelope xmlns:SOAP-ENV="http://schemas.xmlsoap.org/soap/envelope/"><SOAP-ENV:Body><SOAP-ENV:Fault><faultcode>SOAP-ENV:Server</faultcode><faultstring>Call
to undefined function
simplexml_load_string()</faultstring></SOAP-ENV:Fault></SOAP-ENV:Body></SOAP-ENV:Envelope>
================================================================================
002+ <SOAP-ENV:Envelope xmlns:SOAP-ENV="http://schemas.xmlsoap.org/soap/envelope/"><SOAP-ENV:Body><SOAP-ENV:Fault><faultcode>SOAP-ENV:Server</faultcode><faultstring>Call
to undefined function
simplexml_load_string()</faultstring></SOAP-ENV:Fault></SOAP-ENV:Body></SOAP-ENV:Envelope>
002- <SOAP-ENV:Envelope xmlns:SOAP-ENV="http://schemas.xmlsoap.org/soap/envelope/"
xmlns:ns1="http://schemas.nothing.com"
xmlns:xsd="http://www.w3.org/2001/XMLSchema"
xmlns:xsi="http://www.w3.org/2001/XMLSchema-instance"
xmlns:SOAP-ENC="http://schemas.xmlsoap.org/soap/encoding/"
SOAP-ENV:encodingStyle="http://schemas.xmlsoap.org/soap/encoding/"><SOAP-ENV:Body><ns1:dotestResponse><return
xsi:type="xsd:string">Object:
book(foo,bar)</return></ns1:dotestResponse></SOAP-ENV:Body></SOAP-ENV:Envelope>
003- ok
================================================================================
================================================================================
/usr/local/src/php-5.2.4/ext/soap/tests/typemap007.phpt
================================================================================
Fatal error: Uncaught SoapFault exception: [Client] Call to undefined function
simplexml_load_string() in /usr/local/src/php-5.2.4/ext/soap/tests/typemap007.php:23
Stack trace:
#0 /usr/local/src/php-5.2.4/ext/soap/tests/typemap007.php(23): book_from_xml()
#1 [internal function]: book_from_xml('<res xmlns:xsi=...')
#2 [internal function]: SoapClient->__call('dotest2', Array)
#3 /usr/local/src/php-5.2.4/ext/soap/tests/typemap007.php(40):
TestSoapClient->dotest2('???')
#4 {main}
thrown in /usr/local/src/php-5.2.4/ext/soap/tests/typemap007.php on line 23
================================================================================
001+ Fatal error: Uncaught SoapFault exception: [Client] Call to undefined function
simplexml_load_string() in /usr/local/src/php-5.2.4/ext/soap/tests/typemap007.php:23
002+ Stack trace:
003+ #0 /usr/local/src/php-5.2.4/ext/soap/tests/typemap007.php(23): book_from_xml()
004+ #1 [internal function]: book_from_xml('<res xmlns:xsi=...')
005+ #2 [internal function]: SoapClient->__call('dotest2', Array)
006+ #3 /usr/local/src/php-5.2.4/ext/soap/tests/typemap007.php(40):
TestSoapClient->dotest2('???')
007+ #4 {main}
001- object(book)#%d (2) {
002- ["a"]=>
003- string(3) "foo"
004- ["b"]=>
005- string(3) "bar"
006- }
007- ok
008+ thrown in /usr/local/src/php-5.2.4/ext/soap/tests/typemap007.php on line 23
================================================================================
================================================================================
/usr/local/src/php-5.2.4/ext/standard/tests/file/flock.phpt
================================================================================
Warning: flock() expects at least 2 parameters, 0 given in
/usr/local/src/php-5.2.4/ext/standard/tests/file/flock.php on line 5
NULL
Warning: flock() expects parameter 1 to be resource, string given in
/usr/local/src/php-5.2.4/ext/standard/tests/file/flock.php on line 6
NULL
Warning: flock(): 5 is not a valid stream resource in
/usr/local/src/php-5.2.4/ext/standard/tests/file/flock.php on line 11
bool(false)
bool(false)
bool(true)
bool(true)
bool(true)
bool(false)
int(0)
bool(true)
int(0)
bool(true)
int(0)
bool(true)
int(0)
bool(true)
Warning: flock(): Illegal operation argument in
/usr/local/src/php-5.2.4/ext/standard/tests/file/flock.php on line 31
bool(false)
Done
================================================================================
009+ bool(false)
012- bool(true)
013- bool(true)
013+ bool(false)
================================================================================
================================================================================
/usr/local/src/php-5.2.4/ext/standard/tests/file/flock_basic.phpt
================================================================================
*** Testing flock() fun with file and dir ***
bool(false)
bool(true)
bool(true)
bool(true)
bool(false)
bool(false)
bool(false)
bool(false)
*** Done ***
================================================================================
002+ bool(false)
005- bool(true)
================================================================================
================================================================================
/usr/local/src/php-5.2.4/ext/standard/tests/file/flock_variation.phpt
================================================================================
*** Testing flock() fun with the various operation and
wouldblock values ***
--- Outer iteration 0 ---
bool(false)
-- Inner iteration 0 in 0 --
bool(false)
-- Inner iteration 1 in 0 --
bool(false)
-- Inner iteration 2 in 0 --
bool(false)
-- Inner iteration 3 in 0 --
bool(false)
-- Inner iteration 4 in 0 --
bool(false)
-- Inner iteration 5 in 0 --
bool(false)
-- Inner iteration 6 in 0 --
bool(false)
-- Inner iteration 7 in 0 --
bool(false)
-- Inner iteration 8 in 0 --
bool(false)
-- Inner iteration 9 in 0 --
bool(false)
-- Inner iteration 10 in 0 --
bool(false)
-- Inner iteration 11 in 0 --
bool(false)
--- Outer iteration 1 ---
bool(true)
-- Inner iteration 0 in 1 --
bool(true)
-- Inner iteration 1 in 1 --
bool(true)
-- Inner iteration 2 in 1 --
bool(true)
-- Inner iteration 3 in 1 --
bool(true)
-- Inner iteration 4 in 1 --
bool(true)
-- Inner iteration 5 in 1 --
bool(true)
-- Inner iteration 6 in 1 --
bool(true)
-- Inner iteration 7 in 1 --
bool(true)
-- Inner iteration 8 in 1 --
bool(true)
-- Inner iteration 9 in 1 --
bool(true)
-- Inner iteration 10 in 1 --
bool(true)
-- Inner iteration 11 in 1 --
bool(true)
--- Outer iteration 2 ---
bool(false)
-- Inner iteration 0 in 2 --
bool(false)
-- Inner iteration 1 in 2 --
bool(false)
-- Inner iteration 2 in 2 --
bool(false)
-- Inner iteration 3 in 2 --
bool(false)
-- Inner iteration 4 in 2 --
bool(false)
-- Inner iteration 5 in 2 --
bool(false)
-- Inner iteration 6 in 2 --
bool(false)
-- Inner iteration 7 in 2 --
bool(false)
-- Inner iteration 8 in 2 --
bool(false)
-- Inner iteration 9 in 2 --
bool(false)
-- Inner iteration 10 in 2 --
bool(false)
-- Inner iteration 11 in 2 --
bool(false)
--- Outer iteration 3 ---
bool(true)
-- Inner iteration 0 in 3 --
bool(true)
-- Inner iteration 1 in 3 --
bool(true)
-- Inner iteration 2 in 3 --
bool(true)
-- Inner iteration 3 in 3 --
bool(true)
-- Inner iteration 4 in 3 --
bool(true)
-- Inner iteration 5 in 3 --
bool(true)
-- Inner iteration 6 in 3 --
bool(true)
-- Inner iteration 7 in 3 --
bool(true)
-- Inner iteration 8 in 3 --
bool(true)
-- Inner iteration 9 in 3 --
bool(true)
-- Inner iteration 10 in 3 --
bool(true)
-- Inner iteration 11 in 3 --
bool(true)
--- Outer iteration 4 ---
bool(true)
-- Inner iteration 0 in 4 --
bool(true)
-- Inner iteration 1 in 4 --
bool(true)
-- Inner iteration 2 in 4 --
bool(true)
-- Inner iteration 3 in 4 --
bool(true)
-- Inner iteration 4 in 4 --
bool(true)
-- Inner iteration 5 in 4 --
bool(true)
-- Inner iteration 6 in 4 --
bool(true)
-- Inner iteration 7 in 4 --
bool(true)
-- Inner iteration 8 in 4 --
bool(true)
-- Inner iteration 9 in 4 --
bool(true)
-- Inner iteration 10 in 4 --
bool(true)
-- Inner iteration 11 in 4 --
bool(true)
--- Outer iteration 5 ---
bool(true)
-- Inner iteration 0 in 5 --
bool(true)
-- Inner iteration 1 in 5 --
bool(true)
-- Inner iteration 2 in 5 --
bool(true)
-- Inner iteration 3 in 5 --
bool(true)
-- Inner iteration 4 in 5 --
bool(true)
-- Inner iteration 5 in 5 --
bool(true)
-- Inner iteration 6 in 5 --
bool(true)
-- Inner iteration 7 in 5 --
bool(true)
-- Inner iteration 8 in 5 --
bool(true)
-- Inner iteration 9 in 5 --
bool(true)
-- Inner iteration 10 in 5 --
bool(true)
-- Inner iteration 11 in 5 --
bool(true)
--- Outer iteration 6 ---
bool(false)
-- Inner iteration 0 in 6 --
bool(false)
-- Inner iteration 1 in 6 --
bool(false)
-- Inner iteration 2 in 6 --
bool(false)
-- Inner iteration 3 in 6 --
bool(false)
-- Inner iteration 4 in 6 --
bool(false)
-- Inner iteration 5 in 6 --
bool(false)
-- Inner iteration 6 in 6 --
bool(false)
-- Inner iteration 7 in 6 --
bool(false)
-- Inner iteration 8 in 6 --
bool(false)
-- Inner iteration 9 in 6 --
bool(false)
-- Inner iteration 10 in 6 --
bool(false)
-- Inner iteration 11 in 6 --
bool(false)
--- Outer iteration 7 ---
bool(true)
-- Inner iteration 0 in 7 --
bool(true)
-- Inner iteration 1 in 7 --
bool(true)
-- Inner iteration 2 in 7 --
bool(true)
-- Inner iteration 3 in 7 --
bool(true)
-- Inner iteration 4 in 7 --
bool(true)
-- Inner iteration 5 in 7 --
bool(true)
-- Inner iteration 6 in 7 --
bool(true)
-- Inner iteration 7 in 7 --
bool(true)
-- Inner iteration 8 in 7 --
bool(true)
-- Inner iteration 9 in 7 --
bool(true)
-- Inner iteration 10 in 7 --
bool(true)
-- Inner iteration 11 in 7 --
bool(true)
--- Outer iteration 8 ---
bool(true)
-- Inner iteration 0 in 8 --
bool(true)
-- Inner iteration 1 in 8 --
bool(true)
-- Inner iteration 2 in 8 --
bool(true)
-- Inner iteration 3 in 8 --
bool(true)
-- Inner iteration 4 in 8 --
bool(true)
-- Inner iteration 5 in 8 --
bool(true)
-- Inner iteration 6 in 8 --
bool(true)
-- Inner iteration 7 in 8 --
bool(true)
-- Inner iteration 8 in 8 --
bool(true)
-- Inner iteration 9 in 8 --
bool(true)
-- Inner iteration 10 in 8 --
bool(true)
-- Inner iteration 11 in 8 --
bool(true)
--- Outer iteration 9 ---
bool(false)
-- Inner iteration 0 in 9 --
bool(false)
-- Inner iteration 1 in 9 --
bool(false)
-- Inner iteration 2 in 9 --
bool(false)
-- Inner iteration 3 in 9 --
bool(false)
-- Inner iteration 4 in 9 --
bool(false)
-- Inner iteration 5 in 9 --
bool(false)
-- Inner iteration 6 in 9 --
bool(false)
-- Inner iteration 7 in 9 --
bool(false)
-- Inner iteration 8 in 9 --
bool(false)
-- Inner iteration 9 in 9 --
bool(false)
-- Inner iteration 10 in 9 --
bool(false)
-- Inner iteration 11 in 9 --
bool(false)
*** Done ***
================================================================================
004+ bool(false)
004- bool(true)
006+ bool(false)
006- bool(true)
008+ bool(false)
008- bool(true)
010+ bool(false)
010- bool(true)
012+ bool(false)
012- bool(true)
014+ bool(false)
014- bool(true)
016+ bool(false)
016- bool(true)
018+ bool(false)
018- bool(true)
020+ bool(false)
020- bool(true)
022+ bool(false)
022- bool(true)
024+ bool(false)
024- bool(true)
026+ bool(false)
026- bool(true)
028+ bool(false)
028- bool(true)
056+ bool(false)
056- bool(true)
058+ bool(false)
058- bool(true)
060+ bool(false)
060- bool(true)
062+ bool(false)
062- bool(true)
064+ bool(false)
064- bool(true)
066+ bool(false)
066- bool(true)
068+ bool(false)
068- bool(true)
070+ bool(false)
070- bool(true)
072+ bool(false)
072- bool(true)
074+ bool(false)
074- bool(true)
076+ bool(false)
076- bool(true)
078+ bool(false)
078- bool(true)
080+ bool(false)
080- bool(true)
160+ bool(false)
160- bool(true)
162+ bool(false)
162- bool(true)
164+ bool(false)
164- bool(true)
166+ bool(false)
166- bool(true)
168+ bool(false)
168- bool(true)
170+ bool(false)
170- bool(true)
172+ bool(false)
172- bool(true)
174+ bool(false)
174- bool(true)
176+ bool(false)
176- bool(true)
178+ bool(false)
178- bool(true)
180+ bool(false)
180- bool(true)
182+ bool(false)
182- bool(true)
184+ bool(false)
184- bool(true)
238+ bool(false)
238- bool(true)
240+ bool(false)
240- bool(true)
242+ bool(false)
242- bool(true)
244+ bool(false)
244- bool(true)
246+ bool(false)
246- bool(true)
248+ bool(false)
248- bool(true)
250+ bool(false)
250- bool(true)
252+ bool(false)
252- bool(true)
254+ bool(false)
254- bool(true)
256+ bool(false)
256- bool(true)
258+ bool(false)
258- bool(true)
260+ bool(false)
260- bool(true)
262+ bool(false)
262- bool(true)
================================================================================
================================================================================
/usr/local/src/php-5.2.4/ext/standard/tests/file/lstat_stat_variation6.phpt
================================================================================
*** Testing lstat() for link after using touch() on the link ***
bool(true)
bool(true)
bool(true)
Error: stat1 is not lesser than stat2 at key value: 8
Error: stat1 is not lesser than stat2 at key value: atime
Dumping stat array 1...
array(26) {
[0]=>
int(64768)
[1]=>
int(4313890)
[2]=>
int(41471)
[3]=>
int(1)
[4]=>
int(500)
[5]=>
int(500)
[6]=>
int(0)
[7]=>
int(74)
[8]=>
int(1188580672)
[9]=>
int(1188580672)
[10]=>
int(1188580672)
[11]=>
int(4096)
[12]=>
int(8)
["dev"]=>
int(64768)
["ino"]=>
int(4313890)
["mode"]=>
int(41471)
["nlink"]=>
int(1)
["uid"]=>
int(500)
["gid"]=>
int(500)
["rdev"]=>
int(0)
["size"]=>
int(74)
["atime"]=>
int(1188580672)
["mtime"]=>
int(1188580672)
["ctime"]=>
int(1188580672)
["blksize"]=>
int(4096)
["blocks"]=>
int(8)
}
Dumping stat array 2...
array(26) {
[0]=>
int(64768)
[1]=>
int(4313890)
[2]=>
int(41471)
[3]=>
int(1)
[4]=>
int(500)
[5]=>
int(500)
[6]=>
int(0)
[7]=>
int(74)
[8]=>
int(1188580672)
[9]=>
int(1188580672)
[10]=>
int(1188580672)
[11]=>
int(4096)
[12]=>
int(8)
["dev"]=>
int(64768)
["ino"]=>
int(4313890)
["mode"]=>
int(41471)
["nlink"]=>
int(1)
["uid"]=>
int(500)
["gid"]=>
int(500)
["rdev"]=>
int(0)
["size"]=>
int(74)
["atime"]=>
int(1188580672)
["mtime"]=>
int(1188580672)
["ctime"]=>
int(1188580672)
["blksize"]=>
int(4096)
["blocks"]=>
int(8)
}
bool(false)
--- Done ---
================================================================================
005+ Error: stat1 is not lesser than stat2 at key value: 8
006+ Error: stat1 is not lesser than stat2 at key value: atime
005- bool(true)
007- --- Done ---
008+ Dumping stat array 1...
009+ array(26) {
010+ [0]=>
011+ int(64768)
012+ [1]=>
013+ int(4313890)
014+ [2]=>
015+ int(41471)
016+ [3]=>
017+ int(1)
018+ [4]=>
019+ int(500)
020+ [5]=>
021+ int(500)
022+ [6]=>
023+ int(0)
024+ [7]=>
025+ int(74)
026+ [8]=>
027+ int(1188580672)
028+ [9]=>
029+ int(1188580672)
030+ [10]=>
031+ int(1188580672)
032+ [11]=>
033+ int(4096)
034+ [12]=>
035+ int(8)
036+ ["dev"]=>
037+ int(64768)
038+ ["ino"]=>
039+ int(4313890)
040+ ["mode"]=>
041+ int(41471)
042+ ["nlink"]=>
043+ int(1)
044+ ["uid"]=>
045+ int(500)
046+ ["gid"]=>
047+ int(500)
048+ ["rdev"]=>
049+ int(0)
050+ ["size"]=>
051+ int(74)
052+ ["atime"]=>
053+ int(1188580672)
054+ ["mtime"]=>
055+ int(1188580672)
056+ ["ctime"]=>
057+ int(1188580672)
058+ ["blksize"]=>
059+ int(4096)
060+ ["blocks"]=>
061+ int(8)
062+ }
063+
064+ Dumping stat array 2...
065+ array(26) {
066+ [0]=>
067+ int(64768)
068+ [1]=>
069+ int(4313890)
070+ [2]=>
071+ int(41471)
072+ [3]=>
073+ int(1)
074+ [4]=>
075+ int(500)
076+ [5]=>
077+ int(500)
078+ [6]=>
079+ int(0)
080+ [7]=>
081+ int(74)
082+ [8]=>
083+ int(1188580672)
084+ [9]=>
085+ int(1188580672)
086+ [10]=>
087+ int(1188580672)
088+ [11]=>
089+ int(4096)
090+ [12]=>
091+ int(8)
092+ ["dev"]=>
093+ int(64768)
094+ ["ino"]=>
095+ int(4313890)
096+ ["mode"]=>
097+ int(41471)
098+ ["nlink"]=>
099+ int(1)
100+ ["uid"]=>
101+ int(500)
102+ ["gid"]=>
103+ int(500)
104+ ["rdev"]=>
105+ int(0)
106+ ["size"]=>
107+ int(74)
108+ ["atime"]=>
109+ int(1188580672)
110+ ["mtime"]=>
111+ int(1188580672)
112+ ["ctime"]=>
113+ int(1188580672)
114+ ["blksize"]=>
115+ int(4096)
116+ ["blocks"]=>
117+ int(8)
118+ }
119+ bool(false)
120+
121+ --- Done ---
================================================================================
================================================================================
/usr/local/src/php-5.2.4/ext/standard/tests/file/proc_open01.phpt
================================================================================
array(2) {
[0]=>
resource(4) of type (stream)
[1]=>
resource(5) of type (stream)
}
string(5) "yay!
"
No log handling enabled - turning on stderr logging
read_config_store open failure on /var/net-snmp/snmpapp.conf
read_config_store open failure on /var/net-snmp/snmpapp.conf
read_config_store open failure on /var/net-snmp/snmpapp.conf
array(3) {
[0]=>
int(1)
[1]=>
int(2)
[2]=>
int(3)
}
================================================================================
009+ No log handling enabled - turning on stderr logging
010+ read_config_store open failure on /var/net-snmp/snmpapp.conf
011+ read_config_store open failure on /var/net-snmp/snmpapp.conf
012+ read_config_store open failure on /var/net-snmp/snmpapp.conf
================================================================================
================================================================================
/usr/local/src/php-5.2.4/ext/standard/tests/math/bug24142.phpt
================================================================================
round(0.005, 2) -> 0.01
round(0.015, 2) -> 0.01
round(0.025, 2) -> 0.03
round(0.035, 2) -> 0.04
round(0.045, 2) -> 0.05
round(0.055, 2) -> 0.06
round(0.065, 2) -> 0.07
round(0.075, 2) -> 0.07
round(0.085, 2) -> 0.08
================================================================================
002+ round(0.015, 2) -> 0.01
002- round(0.015, 2) -> 0.02
008+ round(0.075, 2) -> 0.07
009+ round(0.085, 2) -> 0.08
008- round(0.075, 2) -> 0.08
009- round(0.085, 2) -> 0.09
================================================================================
================================================================================
/usr/local/src/php-5.2.4/ext/standard/tests/math/bug25694.phpt
================================================================================
round 0.045 = 0.04
number format 0.045 = 0.04
round 0.055 = 0.06
number format 0.055 = 0.06
round 5.045 = 5.04
number format 5.045 = 5.04
round 5.055 = 5.05
number format 5.055 = 5.05
round 3.025 = 3.02
number format 3.025 = 3.02
round 4.025 = 4.03
number format 4.025 = 4.03
================================================================================
001+ round 0.045 = 0.04
002+ number format 0.045 = 0.04
001- round 0.045 = 0.05
002- number format 0.045 = 0.05
007+ round 5.045 = 5.04
008+ number format 5.045 = 5.04
009+
010+ round 5.055 = 5.05
011+ number format 5.055 = 5.05
012+
013+ round 3.025 = 3.02
014+ number format 3.025 = 3.02
007- round 5.045 = 5.05
008- number format 5.045 = 5.05
010- round 5.055 = 5.06
011- number format 5.055 = 5.06
012-
013- round 3.025 = 3.03
014- number format 3.025 = 3.03
015-
================================================================================
================================================================================
/usr/local/src/php-5.2.4/ext/standard/tests/strings/006.phpt
================================================================================
Warning:
highlight_file(AAAAAAAAAAAAAAAAAAAAAAAAAAAAAAAAAAAAAAAAAAAAAAAAAAAAAAAAAAAAAAAAAAAAAAAAAAAAAAAAAAAAAAAAAAAAAAAAAAAAAAAAAAAAAAAAAAAAAAAAAAAAAAAAAAAAAAAAAAAAAAAAAAAAAAAAAAAAAAAAAAAAAAAAAAAAAAAAAAAAAAAAAAAAAAAAAAAAAAAAAAAAAAAAAAAAAAAAAAAAAAAAAAAAAAAAAAAAAAAAAAAAAAAAAAAAAAAAAAAAAAAAAAAAAAAAAAAAAAAAAAAAAAAAAAAAAAAAAAAAAAAAAAAAAAAAAAAAAAAAAAAAAAAAAAAAAAAAAAAAAAAAAAAAAAAAAAAAAAAAAAAAAAAAAAAAAAAAAAAAAAAAAAAAAAAAAAAAAAAAAAAAAAAAAAAAAAAAAAAAAAAAAAAAAAAAAAAAAAAAAAAAAAAAAAAAAAAAAAAAAAAAAAAAAAAAAAAAAAAAAAAAAAAAAAAAAAAAAAAAAAAAAAAAAAAAAAAAAAAAAAAAAAAAAAAAAAAAAAAAAAAAAAAAAAAAAAAAAAAAAAAAAAAAAAAAAAAAAAAAAAAAAAAAAAAAAAAAAAAAAAAAAAAAAAAAAAAAAAAAAAAAAAAAAAAAAAAAAAAAAAAAAAAAAAAAAAAAAAAAAAAAAAAAAAAAAAAAAAAAAAAAAAAAAAAAAAAAAAAAAAAAAAAAAAAAAAAAAAAAAAAAAAAAAAAAAAAAAAAAAAAAAAAAAAAAAAAAAAAAAAAAAAAAAAAAAAAAAAAAAAAAAAAAAAAAAAAAAAAAAAAAAAAAAAAAAAAAAAAAAAAAAAAAAAAAAAAAAAAAAAAAAAAAAAAAAAAAAAAAAAAAAAAAAAAAAAAAAAAAAAAAAAAAAAAAAAAAAAAAAAAAAAAAAAAAAAAAAAAAAAAAAAAAAAAAAAAAAAAAAAAAAAAAAAAAAAAAAAAAAAAAA!
AAAAAAAAAAAAAAAAAAAAAAAAAAAAAAAAAAAAAAAAAAAAAAAAAAAAAAAAAAA): failed to open stream: File name too
long in /usr/local/src/php-5.2.4/ext/standard/tests/strings/006.php on line 5
Warning: highlight_file(): Failed opening
'AAAAAAAAAAAAAAAAAAAAAAAAAAAAAAAAAAAAAAAAAAAAAAAAAAAAAAAAAAAAAAAAAAAAAAAAAAAAAAAAAAAAAAAAAAAAAAAAAAAAAAAAAAAAAAAAAAAAAAAAAAAAAAAAAAAAAAAAAAAAAAAAAAAAAAAAAAAAAAAAAAAAAAAAAAAAAAAAAAAAAAAAAAAAAAAAAAAAAAAAAAAAAAAAAAAAAAAAAAAAAAAAAAAAAAAAAAAAAAAAAAAAAAAAAAAAAAAAAAAAAAAAAAAAAAAAAAAAAAAAAAAAAAAAAAAAAAAAAAAAAAAAAAAAAAAAAAAAAAAAAAAAAAAAAAAAAAAAAAAAAAAAAAAAAAAAAAAAAAAAAAAAAAAAAAAAAAAAAAAAAAAAAAAAAAAAAAAAAAAAAAAAAAAAAAAAAAAAAAAAAAAAAAAAAAAAAAAAAAAAAAAAAAAAAAAAAAAAAAAAAAAAAAAAAAAAAAAAAAAAAAAAAAAAAAAAAAAAAAAAAAAAAAAAAAAAAAAAAAAAAAAAAAAAAAAAAAAAAAAAAAAAAAAAAAAAAAAAAAAAAAAAAAAAAAAAAAAAAAAAAAAAAAAAAAAAAAAAAAAAAAAAAAAAAAAAAAAAAAAAAAAAAAAAAAAAAAAAAAAAAAAAAAAAAAAAAAAAAAAAAAAAAAAAAAAAAAAAAAAAAAAAAAAAAAAAAAAAAAAAAAAAAAAAAAAAAAAAAAAAAAAAAAAAAAAAAAAAAAAAAAAAAAAAAAAAAAAAAAAAAAAAAAAAAAAAAAAAAAAAAAAAAAAAAAAAAAAAAAAAAAAAAAAAAAAAAAAAAAAAAAAAAAAAAAAAAAAAAAAAAAAAAAAAAAAAAAAAAAAAAAAAAAAAAAAAAAAAAAAAAAAAAAAAAAAAAAAAAAAAAAAAAAAAAAAAAAAAAAAAAAAAAAAAAAAAAAAAAAAAAAAAAA!
AAAAAAAAAAAAAAAAAAAAAAAAAAAAAAAAAAAAAAAAAAAAAAAAAAAAAAAAAAAAAAAAAAAAAAAAAAAAAA' for
highlighting in /usr/local/src/php-5.2.4/ext/standard/tests/strings/006.php on line 5
bool(false)
bool(false)
Done
================================================================================
001+ Warning:
highlight_file(AAAAAAAAAAAAAAAAAAAAAAAAAAAAAAAAAAAAAAAAAAAAAAAAAAAAAAAAAAAAAAAAAAAAAAAAAAAAAAAAAAAAAAAAAAAAAAAAAAAAAAAAAAAAAAAAAAAAAAAAAAAAAAAAAAAAAAAAAAAAAAAAAAAAAAAAAAAAAAAAAAAAAAAAAAAAAAAAAAAAAAAAAAAAAAAAAAAAAAAAAAAAAAAAAAAAAAAAAAAAAAAAAAAAAAAAAAAAAAAAAAAAAAAAAAAAAAAAAAAAAAAAAAAAAAAAAAAAAAAAAAAAAAAAAAAAAAAAAAAAAAAAAAAAAAAAAAAAAAAAAAAAAAAAAAAAAAAAAAAAAAAAAAAAAAAAAAAAAAAAAAAAAAAAAAAAAAAAAAAAAAAAAAAAAAAAAAAAAAAAAAAAAAAAAAAAAAAAAAAAAAAAAAAAAAAAAAAAAAAAAAAAAAAAAAAAAAAAAAAAAAAAAAAAAAAAAAAAAAAAAAAAAAAAAAAAAAAAAAAAAAAAAAAAAAAAAAAAAAAAAAAAAAAAAAAAAAAAAAAAAAAAAAAAAAAAAAAAAAAAAAAAAAAAAAAAAAAAAAAAAAAAAAAAAAAAAAAAAAAAAAAAAAAAAAAAAAAAAAAAAAAAAAAAAAAAAAAAAAAAAAAAAAAAAAAAAAAAAAAAAAAAAAAAAAAAAAAAAAAAAAAAAAAAAAAAAAAAAAAAAAAAAAAAAAAAAAAAAAAAAAAAAAAAAAAAAAAAAAAAAAAAAAAAAAAAAAAAAAAAAAAAAAAAAAAAAAAAAAAAAAAAAAAAAAAAAAAAAAAAAAAAAAAAAAAAAAAAAAAAAAAAAAAAAAAAAAAAAAAAAAAAAAAAAAAAAAAAAAAAAAAAAAAAAAAAAAAAAAAAAAAAAAAAAAAAAAAAAAAAAAAAAAAAAAAAAAAAAAAAAAAAAAAAAAAAAAAAAAAAAAAAAAAAAAAAAAAAAAAA!
AAAAAAAAAAAAAAAAAAAAAAAAAAAAAAAAAAAAAAAAAAAAAAAAAAAAAAAAAAAAAAAA): failed to open stream: File name
too long in /usr/local/src/php-5.2.4/ext/standard/tests/strings/006.php on line 5
001- Warning:
highlight_file(AAAAAAAAAAAAAAAAAAAAAAAAAAAAAAAAAAAAAAAAAAAAAAAAAAAAAAAAAAAAAAAAAAAAAAAAAAAAAAAAAAAAAAAAAAAAAAAAAAAAAAAAAAAAAAAAAAAAAAAAAAAAAAAAAAAAAAAAAAAAAAAAAAAAAAAAAAAAAAAAAAAAAAAAAAAAAAAAAAAAAAAAAAAAAAAAAAAAAAAAAAAAAAAAAAAAAAAAAAAAAAAAAAAAAAAAAAAAAAAAAAAAAAAAAAAAAAAAAAAAAAAAAAAAAAAAAAAAAAAAAAAAAAAAAAAAAAAAAAAAAAAAAAAAAAAAAAAAAAAAAAAAAAAAAAAAAAAAAAAAAAAAAAAAAAAAAAAAAAAAAAAAAAAAAAAAAAAAAAAAAAAAAAAAAAAAAAAAAAAAAAAAAAAAAAAAAAAAAAAAAAAAAAAAAAAAAAAAAAAAAAAAAAAAAAAAAAAAAAAAAAAAAAAAAAAAAAAAAAAAAAAAAAAAAAAAAAAAAAAAAAAAAAAAAAAAAAAAAAAAAAAAAAAAAAAAAAAAAAAAAAAAAAAAAAAAAAAAAAAAAAAAAAAAAAAAAAAAAAAAAAAAAAAAAAAAAAAAAAAAAAAAAAAAAAAAAAAAAAAAAAAAAAAAAAAAAAAAAAAAAAAAAAAAAAAAAAAAAAAAAAAAAAAAAAAAAAAAAAAAAAAAAAAAAAAAAAAAAAAAAAAAAAAAAAAAAAAAAAAAAAAAAAAAAAAAAAAAAAAAAAAAAAAAAAAAAAAAAAAAAAAAAAAAAAAAAAAAAAAAAAAAAAAAAAAAAAAAAAAAAAAAAAAAAAAAAAAAAAAAAAAAAAAAAAAAAAAAAAAAAAAAAAAAAAAAAAAAAAAAAAAAAAAAAAAAAAAAAAAAAAAAAAAAAAAAAAAAAAAAAAAAAAAAAAAAAAAAAAAAAAAAAAAAAAAAAAAAAAAAAAAAAAAAAAAAAAAAAAAA!
AAAAAAAAAAAAAAAAAAAAAAAAAAAAAAAAAAAAAAAAAAAAAAAAA in %s on line %d
003+ Warning: highlight_file(): Failed opening
'AAAAAAAAAAAAAAAAAAAAAAAAAAAAAAAAAAAAAAAAAAAAAAAAAAAAAAAAAAAAAAAAAAAAAAAAAAAAAAAAAAAAAAAAAAAAAAAAAAAAAAAAAAAAAAAAAAAAAAAAAAAAAAAAAAAAAAAAAAAAAAAAAAAAAAAAAAAAAAAAAAAAAAAAAAAAAAAAAAAAAAAAAAAAAAAAAAAAAAAAAAAAAAAAAAAAAAAAAAAAAAAAAAAAAAAAAAAAAAAAAAAAAAAAAAAAAAAAAAAAAAAAAAAAAAAAAAAAAAAAAAAAAAAAAAAAAAAAAAAAAAAAAAAAAAAAAAAAAAAAAAAAAAAAAAAAAAAAAAAAAAAAAAAAAAAAAAAAAAAAAAAAAAAAAAAAAAAAAAAAAAAAAAAAAAAAAAAAAAAAAAAAAAAAAAAAAAAAAAAAAAAAAAAAAAAAAAAAAAAAAAAAAAAAAAAAAAAAAAAAAAAAAAAAAAAAAAAAAAAAAAAAAAAAAAAAAAAAAAAAAAAAAAAAAAAAAAAAAAAAAAAAAAAAAAAAAAAAAAAAAAAAAAAAAAAAAAAAAAAAAAAAAAAAAAAAAAAAAAAAAAAAAAAAAAAAAAAAAAAAAAAAAAAAAAAAAAAAAAAAAAAAAAAAAAAAAAAAAAAAAAAAAAAAAAAAAAAAAAAAAAAAAAAAAAAAAAAAAAAAAAAAAAAAAAAAAAAAAAAAAAAAAAAAAAAAAAAAAAAAAAAAAAAAAAAAAAAAAAAAAAAAAAAAAAAAAAAAAAAAAAAAAAAAAAAAAAAAAAAAAAAAAAAAAAAAAAAAAAAAAAAAAAAAAAAAAAAAAAAAAAAAAAAAAAAAAAAAAAAAAAAAAAAAAAAAAAAAAAAAAAAAAAAAAAAAAAAAAAAAAAAAAAAAAAAAAAAAAAAAAAAAAAAAAAAAAAAAAAAAAAAAAAAAAAAAAAAAAAAAA!
AAAAAAAAAAAAAAAAAAAAAAAAAAAAAAAAAAAAAAAAAAAAAAAAAAAAAAAAAAAAAAAAAAAAAAAAAAAAAAAAAAA' for
highlighting in /usr/local/src/php-5.2.4/ext/standard/tests/strings/006.php on line 5
003- Warning: highlight_file(): Failed opening
'AAAAAAAAAAAAAAAAAAAAAAAAAAAAAAAAAAAAAAAAAAAAAAAAAAAAAAAAAAAAAAAAAAAAAAAAAAAAAAAAAAAAAAAAAAAAAAAAAAAAAAAAAAAAAAAAAAAAAAAAAAAAAAAAAAAAAAAAAAAAAAAAAAAAAAAAAAAAAAAAAAAAAAAAAAAAAAAAAAAAAAAAAAAAAAAAAAAAAAAAAAAAAAAAAAAAAAAAAAAAAAAAAAAAAAAAAAAAAAAAAAAAAAAAAAAAAAAAAAAAAAAAAAAAAAAAAAAAAAAAAAAAAAAAAAAAAAAAAAAAAAAAAAAAAAAAAAAAAAAAAAAAAAAAAAAAAAAAAAAAAAAAAAAAAAAAAAAAAAAAAAAAAAAAAAAAAAAAAAAAAAAAAAAAAAAAAAAAAAAAAAAAAAAAAAAAAAAAAAAAAAAAAAAAAAAAAAAAAAAAAAAAAAAAAAAAAAAAAAAAAAAAAAAAAAAAAAAAAAAAAAAAAAAAAAAAAAAAAAAAAAAAAAAAAAAAAAAAAAAAAAAAAAAAAAAAAAAAAAAAAAAAAAAAAAAAAAAAAAAAAAAAAAAAAAAAAAAAAAAAAAAAAAAAAAAAAAAAAAAAAAAAAAAAAAAAAAAAAAAAAAAAAAAAAAAAAAAAAAAAAAAAAAAAAAAAAAAAAAAAAAAAAAAAAAAAAAAAAAAAAAAAAAAAAAAAAAAAAAAAAAAAAAAAAAAAAAAAAAAAAAAAAAAAAAAAAAAAAAAAAAAAAAAAAAAAAAAAAAAAAAAAAAAAAAAAAAAAAAAAAAAAAAAAAAAAAAAAAAAAAAAAAAAAAAAAAAAAAAAAAAAAAAAAAAAAAAAAAAAAAAAAAAAAAAAAAAAAAAAAAAAAAAAAAAAAAAAAAAAAAAAAAAAAAAAAAAAAAAAAAAAAAAAAAAAAAAAAAAAAAAAAAAAAAAAAAAAAAAAAA!
AAAAAAAAAAAAAAAAAAAAAAAAAAAAAAAAAAAAAAAAAAAAAAAAA in %s on line %d
================================================================================
================================================================================
/usr/local/src/php-5.2.4/ext/standard/tests/strings/007.phpt
================================================================================
Warning:
php_strip_whitespace(AAAAAAAAAAAAAAAAAAAAAAAAAAAAAAAAAAAAAAAAAAAAAAAAAAAAAAAAAAAAAAAAAAAAAAAAAAAAAAAAAAAAAAAAAAAAAAAAAAAAAAAAAAAAAAAAAAAAAAAAAAAAAAAAAAAAAAAAAAAAAAAAAAAAAAAAAAAAAAAAAAAAAAAAAAAAAAAAAAAAAAAAAAAAAAAAAAAAAAAAAAAAAAAAAAAAAAAAAAAAAAAAAAAAAAAAAAAAAAAAAAAAAAAAAAAAAAAAAAAAAAAAAAAAAAAAAAAAAAAAAAAAAAAAAAAAAAAAAAAAAAAAAAAAAAAAAAAAAAAAAAAAAAAAAAAAAAAAAAAAAAAAAAAAAAAAAAAAAAAAAAAAAAAAAAAAAAAAAAAAAAAAAAAAAAAAAAAAAAAAAAAAAAAAAAAAAAAAAAAAAAAAAAAAAAAAAAAAAAAAAAAAAAAAAAAAAAAAAAAAAAAAAAAAAAAAAAAAAAAAAAAAAAAAAAAAAAAAAAAAAAAAAAAAAAAAAAAAAAAAAAAAAAAAAAAAAAAAAAAAAAAAAAAAAAAAAAAAAAAAAAAAAAAAAAAAAAAAAAAAAAAAAAAAAAAAAAAAAAAAAAAAAAAAAAAAAAAAAAAAAAAAAAAAAAAAAAAAAAAAAAAAAAAAAAAAAAAAAAAAAAAAAAAAAAAAAAAAAAAAAAAAAAAAAAAAAAAAAAAAAAAAAAAAAAAAAAAAAAAAAAAAAAAAAAAAAAAAAAAAAAAAAAAAAAAAAAAAAAAAAAAAAAAAAAAAAAAAAAAAAAAAAAAAAAAAAAAAAAAAAAAAAAAAAAAAAAAAAAAAAAAAAAAAAAAAAAAAAAAAAAAAAAAAAAAAAAAAAAAAAAAAAAAAAAAAAAAAAAAAAAAAAAAAAAAAAAAAAAAAAAAAAAAAAAAAAAAAAAAAAAAAAAAAAAAAAAAAAAAAAAAAAAAAAAAAAAAAAAA!
AAAAAAAAAAAAAAAAAAAAAAAAAAAAAAAAAAAAAAAAAAAAAAAAAAAAAAAAAAAAAAAAA): failed to open stream: File
name too long in /usr/local/src/php-5.2.4/ext/standard/tests/strings/007.php on line 5
string(0) ""
bool(false)
Done
================================================================================
001+ Warning:
php_strip_whitespace(AAAAAAAAAAAAAAAAAAAAAAAAAAAAAAAAAAAAAAAAAAAAAAAAAAAAAAAAAAAAAAAAAAAAAAAAAAAAAAAAAAAAAAAAAAAAAAAAAAAAAAAAAAAAAAAAAAAAAAAAAAAAAAAAAAAAAAAAAAAAAAAAAAAAAAAAAAAAAAAAAAAAAAAAAAAAAAAAAAAAAAAAAAAAAAAAAAAAAAAAAAAAAAAAAAAAAAAAAAAAAAAAAAAAAAAAAAAAAAAAAAAAAAAAAAAAAAAAAAAAAAAAAAAAAAAAAAAAAAAAAAAAAAAAAAAAAAAAAAAAAAAAAAAAAAAAAAAAAAAAAAAAAAAAAAAAAAAAAAAAAAAAAAAAAAAAAAAAAAAAAAAAAAAAAAAAAAAAAAAAAAAAAAAAAAAAAAAAAAAAAAAAAAAAAAAAAAAAAAAAAAAAAAAAAAAAAAAAAAAAAAAAAAAAAAAAAAAAAAAAAAAAAAAAAAAAAAAAAAAAAAAAAAAAAAAAAAAAAAAAAAAAAAAAAAAAAAAAAAAAAAAAAAAAAAAAAAAAAAAAAAAAAAAAAAAAAAAAAAAAAAAAAAAAAAAAAAAAAAAAAAAAAAAAAAAAAAAAAAAAAAAAAAAAAAAAAAAAAAAAAAAAAAAAAAAAAAAAAAAAAAAAAAAAAAAAAAAAAAAAAAAAAAAAAAAAAAAAAAAAAAAAAAAAAAAAAAAAAAAAAAAAAAAAAAAAAAAAAAAAAAAAAAAAAAAAAAAAAAAAAAAAAAAAAAAAAAAAAAAAAAAAAAAAAAAAAAAAAAAAAAAAAAAAAAAAAAAAAAAAAAAAAAAAAAAAAAAAAAAAAAAAAAAAAAAAAAAAAAAAAAAAAAAAAAAAAAAAAAAAAAAAAAAAAAAAAAAAAAAAAAAAAAAAAAAAAAAAAAAAAAAAAAAAAAAAAAAAAAAAAAAAAAAAAAAAAAAAAAAAAAAAAAAAAAAAAA!
AAAAAAAAAAAAAAAAAAAAAAAAAAAAAAAAAAAAAAAAAAAAAAAAAAAAAAAAAAAAAAAAAAAAAA): failed to open stream:
File name too long in /usr/local/src/php-5.2.4/ext/standard/tests/strings/007.php on line 5
001- Warning:
php_strip_whitespace(AAAAAAAAAAAAAAAAAAAAAAAAAAAAAAAAAAAAAAAAAAAAAAAAAAAAAAAAAAAAAAAAAAAAAAAAAAAAAAAAAAAAAAAAAAAAAAAAAAAAAAAAAAAAAAAAAAAAAAAAAAAAAAAAAAAAAAAAAAAAAAAAAAAAAAAAAAAAAAAAAAAAAAAAAAAAAAAAAAAAAAAAAAAAAAAAAAAAAAAAAAAAAAAAAAAAAAAAAAAAAAAAAAAAAAAAAAAAAAAAAAAAAAAAAAAAAAAAAAAAAAAAAAAAAAAAAAAAAAAAAAAAAAAAAAAAAAAAAAAAAAAAAAAAAAAAAAAAAAAAAAAAAAAAAAAAAAAAAAAAAAAAAAAAAAAAAAAAAAAAAAAAAAAAAAAAAAAAAAAAAAAAAAAAAAAAAAAAAAAAAAAAAAAAAAAAAAAAAAAAAAAAAAAAAAAAAAAAAAAAAAAAAAAAAAAAAAAAAAAAAAAAAAAAAAAAAAAAAAAAAAAAAAAAAAAAAAAAAAAAAAAAAAAAAAAAAAAAAAAAAAAAAAAAAAAAAAAAAAAAAAAAAAAAAAAAAAAAAAAAAAAAAAAAAAAAAAAAAAAAAAAAAAAAAAAAAAAAAAAAAAAAAAAAAAAAAAAAAAAAAAAAAAAAAAAAAAAAAAAAAAAAAAAAAAAAAAAAAAAAAAAAAAAAAAAAAAAAAAAAAAAAAAAAAAAAAAAAAAAAAAAAAAAAAAAAAAAAAAAAAAAAAAAAAAAAAAAAAAAAAAAAAAAAAAAAAAAAAAAAAAAAAAAAAAAAAAAAAAAAAAAAAAAAAAAAAAAAAAAAAAAAAAAAAAAAAAAAAAAAAAAAAAAAAAAAAAAAAAAAAAAAAAAAAAAAAAAAAAAAAAAAAAAAAAAAAAAAAAAAAAAAAAAAAAAAAAAAAAAAAAAAAAAAAAAAAAAAAAAAAAAAAAAAAAAAAAAAAAAAAAAAAAAAAAAAAA!
AAAAAAAAAAAAAAAAAAAAAAAAAAAAAAAAAAAAAAAAAAAAAAAAA in %s on line %d
================================================================================
================================================================================
/usr/local/src/php-5.2.4/sapi/cli/tests/001.phpt
================================================================================
No log handling enabled - turning on stderr logging
read_config_store open failure on /var/net-snmp/snmpapp.conf
read_config_store open failure on /var/net-snmp/snmpapp.conf
read_config_store open failure on /var/net-snmp/snmpapp.conf
string(147) "PHP 5.2.4 (cli) (built: Aug 31 2007 10:04:08)
Copyright (c) 1997-2007 The PHP Group
Zend Engine v2.2.0, Copyright (c) 1998-2007 Zend Technologies
"
Done
================================================================================
001+ No log handling enabled - turning on stderr logging
002+ read_config_store open failure on /var/net-snmp/snmpapp.conf
003+ read_config_store open failure on /var/net-snmp/snmpapp.conf
004+ read_config_store open failure on /var/net-snmp/snmpapp.conf
================================================================================
================================================================================
/usr/local/src/php-5.2.4/sapi/cli/tests/004.phpt
================================================================================
No log handling enabled - turning on stderr logging
read_config_store open failure on /var/net-snmp/snmpapp.conf
read_config_store open failure on /var/net-snmp/snmpapp.conf
read_config_store open failure on /var/net-snmp/snmpapp.conf
string(45) "Exception: Function unknown() does not exist
"
No log handling enabled - turning on stderr logging
read_config_store open failure on /var/net-snmp/snmpapp.conf
read_config_store open failure on /var/net-snmp/snmpapp.conf
read_config_store open failure on /var/net-snmp/snmpapp.conf
string(42) "Exception: Function echo() does not exist
"
No log handling enabled - turning on stderr logging
read_config_store open failure on /var/net-snmp/snmpapp.conf
read_config_store open failure on /var/net-snmp/snmpapp.conf
read_config_store open failure on /var/net-snmp/snmpapp.conf
string(119) "Function [ <internal:standard> function phpinfo ] {
- Parameters [1] {
Parameter #0 [ <optional> $what ]
}
}
"
Done
================================================================================
001+ No log handling enabled - turning on stderr logging
002+ read_config_store open failure on /var/net-snmp/snmpapp.conf
003+ read_config_store open failure on /var/net-snmp/snmpapp.conf
004+ read_config_store open failure on /var/net-snmp/snmpapp.conf
007+ No log handling enabled - turning on stderr logging
008+ read_config_store open failure on /var/net-snmp/snmpapp.conf
009+ read_config_store open failure on /var/net-snmp/snmpapp.conf
010+ read_config_store open failure on /var/net-snmp/snmpapp.conf
013+ No log handling enabled - turning on stderr logging
014+ read_config_store open failure on /var/net-snmp/snmpapp.conf
015+ read_config_store open failure on /var/net-snmp/snmpapp.conf
016+ read_config_store open failure on /var/net-snmp/snmpapp.conf
================================================================================
================================================================================
/usr/local/src/php-5.2.4/sapi/cli/tests/005.phpt
================================================================================
No log handling enabled - turning on stderr logging
read_config_store open failure on /var/net-snmp/snmpapp.conf
read_config_store open failure on /var/net-snmp/snmpapp.conf
read_config_store open failure on /var/net-snmp/snmpapp.conf
string(40) "Exception: Class unknown does not exist
"
No log handling enabled - turning on stderr logging
read_config_store open failure on /var/net-snmp/snmpapp.conf
read_config_store open failure on /var/net-snmp/snmpapp.conf
read_config_store open failure on /var/net-snmp/snmpapp.conf
string(178) "Class [ <internal> class stdClass ] {
- Constants [0] {
}
- Static properties [0] {
}
- Static methods [0] {
}
- Properties [0] {
}
- Methods [0] {
}
}
"
No log handling enabled - turning on stderr logging
read_config_store open failure on /var/net-snmp/snmpapp.conf
read_config_store open failure on /var/net-snmp/snmpapp.conf
read_config_store open failure on /var/net-snmp/snmpapp.conf
string(1141) "Class [ <internal> class Exception ] {
- Constants [0] {
}
- Static properties [0] {
}
- Static methods [0] {
}
- Properties [6] {
Property [ <default> protected $message ]
Property [ <default> private $string ]
Property [ <default> protected $code ]
Property [ <default> protected $file ]
Property [ <default> protected $line ]
Property [ <default> private $trace ]
}
- Methods [9] {
Method [ <internal> final private method __clone ] {
}
Method [ <internal, ctor> public method __construct ] {
- Parameters [2] {
Parameter #0 [ <optional> $message ]
Parameter #1 [ <optional> $code ]
}
}
Method [ <internal> final public method getMessage ] {
}
Method [ <internal> final public method getCode ] {
}
Method [ <internal> final public method getFile ] {
}
Method [ <internal> final public method getLine ] {
}
Method [ <internal> final public method getTrace ] {
}
Method [ <internal> final public method getTraceAsString ] {
}
Method [ <internal> public method __toString ] {
}
}
}
"
Done
================================================================================
001+ No log handling enabled - turning on stderr logging
002+ read_config_store open failure on /var/net-snmp/snmpapp.conf
003+ read_config_store open failure on /var/net-snmp/snmpapp.conf
004+ read_config_store open failure on /var/net-snmp/snmpapp.conf
007+ No log handling enabled - turning on stderr logging
008+ read_config_store open failure on /var/net-snmp/snmpapp.conf
009+ read_config_store open failure on /var/net-snmp/snmpapp.conf
010+ read_config_store open failure on /var/net-snmp/snmpapp.conf
030+ No log handling enabled - turning on stderr logging
031+ read_config_store open failure on /var/net-snmp/snmpapp.conf
032+ read_config_store open failure on /var/net-snmp/snmpapp.conf
033+ read_config_store open failure on /var/net-snmp/snmpapp.conf
================================================================================
================================================================================
/usr/local/src/php-5.2.4/sapi/cli/tests/006.phpt
================================================================================
No log handling enabled - turning on stderr logging
read_config_store open failure on /var/net-snmp/snmpapp.conf
read_config_store open failure on /var/net-snmp/snmpapp.conf
read_config_store open failure on /var/net-snmp/snmpapp.conf
string(44) "Exception: Extension unknown does not exist
"
No log handling enabled - turning on stderr logging
read_config_store open failure on /var/net-snmp/snmpapp.conf
read_config_store open failure on /var/net-snmp/snmpapp.conf
read_config_store open failure on /var/net-snmp/snmpapp.conf
string(37) "Exception: Extension does not exist
"
No log handling enabled - turning on stderr logging
read_config_store open failure on /var/net-snmp/snmpapp.conf
read_config_store open failure on /var/net-snmp/snmpapp.conf
read_config_store open failure on /var/net-snmp/snmpapp.conf
string(8329) "Extension [ <persistent> extension #20 date version 5.2.4 ] {
- Dependencies {
Dependency [ session (Optional) ]
}
- INI {
Entry [ date.timezone <ALL> ]
Current = ''
}
Entry [ date.default_latitude <ALL> ]
Current = '31.7667'
}
Entry [ date.default_longitude <ALL> ]
Current = '35.2333'
}
Entry [ date.sunset_zenith <ALL> ]
Current = '90.583333'
}
Entry [ date.sunrise_zenith <ALL> ]
Current = '90.583333'
}
}
- Constants [14] {
Constant [ string DATE_ATOM ] { Y-m-d\TH:i:sP }
Constant [ string DATE_COOKIE ] { l, d-M-y H:i:s T }
Constant [ string DATE_ISO8601 ] { Y-m-d\TH:i:sO }
Constant [ string DATE_RFC822 ] { D, d M y H:i:s O }
Constant [ string DATE_RFC850 ] { l, d-M-y H:i:s T }
Constant [ string DATE_RFC1036 ] { D, d M y H:i:s O }
Constant [ string DATE_RFC1123 ] { D, d M Y H:i:s O }
Constant [ string DATE_RFC2822 ] { D, d M Y H:i:s O }
Constant [ string DATE_RFC3339 ] { Y-m-d\TH:i:sP }
Constant [ string DATE_RSS ] { D, d M Y H:i:s O }
Constant [ string DATE_W3C ] { Y-m-d\TH:i:sP }
Constant [ integer SUNFUNCS_RET_TIMESTAMP ] { 0 }
Constant [ integer SUNFUNCS_RET_STRING ] { 1 }
Constant [ integer SUNFUNCS_RET_DOUBLE ] { 2 }
}
- Functions {
Function [ <internal:date> function strtotime ] {
- Parameters [2] {
Parameter #0 [ <required> $time ]
Parameter #1 [ <optional> $now ]
}
}
Function [ <internal:date> function date ] {
- Parameters [2] {
Parameter #0 [ <required> $format ]
Parameter #1 [ <optional> $timestamp ]
}
}
Function [ <internal:date> function idate ] {
- Parameters [2] {
Parameter #0 [ <required> $format ]
Parameter #1 [ <optional> $timestamp ]
}
}
Function [ <internal:date> function gmdate ] {
- Parameters [2] {
Parameter #0 [ <required> $format ]
Parameter #1 [ <optional> $timestamp ]
}
}
Function [ <internal:date> function mktime ] {
- Parameters [6] {
Parameter #0 [ <optional> $hour ]
Parameter #1 [ <optional> $min ]
Parameter #2 [ <optional> $sec ]
Parameter #3 [ <optional> $mon ]
Parameter #4 [ <optional> $day ]
Parameter #5 [ <optional> $year ]
}
}
Function [ <internal:date> function gmmktime ] {
- Parameters [6] {
Parameter #0 [ <optional> $hour ]
Parameter #1 [ <optional> $min ]
Parameter #2 [ <optional> $sec ]
Parameter #3 [ <optional> $mon ]
Parameter #4 [ <optional> $day ]
Parameter #5 [ <optional> $year ]
}
}
Function [ <internal:date> function checkdate ] {
- Parameters [3] {
Parameter #0 [ <required> $month ]
Parameter #1 [ <required> $day ]
Parameter #2 [ <required> $year ]
}
}
Function [ <internal:date> function strftime ] {
- Parameters [2] {
Parameter #0 [ <required> $format ]
Parameter #1 [ <optional> $timestamp ]
}
}
Function [ <internal:date> function gmstrftime ] {
- Parameters [2] {
Parameter #0 [ <required> $format ]
Parameter #1 [ <optional> $timestamp ]
}
}
Function [ <internal:date> function time ] {
- Parameters [0] {
}
}
Function [ <internal:date> function localtime ] {
- Parameters [2] {
Parameter #0 [ <optional> $timestamp ]
Parameter #1 [ <optional> $associative_array ]
}
}
Function [ <internal:date> function getdate ] {
- Parameters [1] {
Parameter #0 [ <optional> $timestamp ]
}
}
Function [ <internal:date> function date_create ] {
}
Function [ <internal:date> function date_parse ] {
}
Function [ <internal:date> function date_format ] {
}
Function [ <internal:date> function date_modify ] {
}
Function [ <internal:date> function date_timezone_get ] {
}
Function [ <internal:date> function date_timezone_set ] {
}
Function [ <internal:date> function date_offset_get ] {
}
Function [ <internal:date> function date_time_set ] {
}
Function [ <internal:date> function date_date_set ] {
}
Function [ <internal:date> function date_isodate_set ] {
}
Function [ <internal:date> function timezone_open ] {
}
Function [ <internal:date> function timezone_name_get ] {
}
Function [ <internal:date> function timezone_name_from_abbr ] {
}
Function [ <internal:date> function timezone_offset_get ] {
}
Function [ <internal:date> function timezone_transitions_get ] {
}
Function [ <internal:date> function timezone_identifiers_list ] {
}
Function [ <internal:date> function timezone_abbreviations_list ] {
}
Function [ <internal:date> function date_default_timezone_set ] {
- Parameters [1] {
Parameter #0 [ <required> $timezone_identifier ]
}
}
Function [ <internal:date> function date_default_timezone_get ] {
- Parameters [0] {
}
}
Function [ <internal:date> function date_sunrise ] {
- Parameters [6] {
Parameter #0 [ <required> $time ]
Parameter #1 [ <optional> $format ]
Parameter #2 [ <optional> $latitude ]
Parameter #3 [ <optional> $longitude ]
Parameter #4 [ <optional> $zenith ]
Parameter #5 [ <optional> $gmt_offset ]
}
}
Function [ <internal:date> function date_sunset ] {
- Parameters [6] {
Parameter #0 [ <required> $time ]
Parameter #1 [ <optional> $format ]
Parameter #2 [ <optional> $latitude ]
Parameter #3 [ <optional> $longitude ]
Parameter #4 [ <optional> $zenith ]
Parameter #5 [ <optional> $gmt_offset ]
}
}
Function [ <internal:date> function date_sun_info ] {
- Parameters [3] {
Parameter #0 [ <required> $time ]
Parameter #1 [ <required> $latitude ]
Parameter #2 [ <required> $longitude ]
}
}
}
- Classes [2] {
Class [ <internal:date> class DateTime ] {
- Constants [11] {
Constant [ string ATOM ] { Y-m-d\TH:i:sP }
Constant [ string COOKIE ] { l, d-M-y H:i:s T }
Constant [ string ISO8601 ] { Y-m-d\TH:i:sO }
Constant [ string RFC822 ] { D, d M y H:i:s O }
Constant [ string RFC850 ] { l, d-M-y H:i:s T }
Constant [ string RFC1036 ] { D, d M y H:i:s O }
Constant [ string RFC1123 ] { D, d M Y H:i:s O }
Constant [ string RFC2822 ] { D, d M Y H:i:s O }
Constant [ string RFC3339 ] { Y-m-d\TH:i:sP }
Constant [ string RSS ] { D, d M Y H:i:s O }
Constant [ string W3C ] { Y-m-d\TH:i:sP }
}
- Static properties [0] {
}
- Static methods [0] {
}
- Properties [0] {
}
- Methods [9] {
Method [ <internal:date, ctor> public method __construct ] {
}
Method [ <internal:date> public method format ] {
}
Method [ <internal:date> public method modify ] {
}
Method [ <internal:date> public method getTimezone ] {
}
Method [ <internal:date> public method setTimezone ] {
}
Method [ <internal:date> public method getOffset ] {
}
Method [ <internal:date> public method setTime ] {
}
Method [ <internal:date> public method setDate ] {
}
Method [ <internal:date> public method setISODate ] {
}
}
}
Class [ <internal:date> class DateTimeZone ] {
- Constants [0] {
}
- Static properties [0] {
}
- Static methods [2] {
Method [ <internal:date> static public method listAbbreviations ] {
}
Method [ <internal:date> static public method listIdentifiers ] {
}
}
- Properties [0] {
}
- Methods [4] {
Method [ <internal:date, ctor> public method __construct ] {
}
Method [ <internal:date> public method getName ] {
}
Method [ <internal:date> public method getOffset ] {
}
Method [ <internal:date> public method getTransitions ] {
}
}
}
}
}
"
Done
================================================================================
001+ No log handling enabled - turning on stderr logging
002+ read_config_store open failure on /var/net-snmp/snmpapp.conf
003+ read_config_store open failure on /var/net-snmp/snmpapp.conf
004+ read_config_store open failure on /var/net-snmp/snmpapp.conf
007+ No log handling enabled - turning on stderr logging
008+ read_config_store open failure on /var/net-snmp/snmpapp.conf
009+ read_config_store open failure on /var/net-snmp/snmpapp.conf
010+ read_config_store open failure on /var/net-snmp/snmpapp.conf
013+ No log handling enabled - turning on stderr logging
014+ read_config_store open failure on /var/net-snmp/snmpapp.conf
015+ read_config_store open failure on /var/net-snmp/snmpapp.conf
016+ read_config_store open failure on /var/net-snmp/snmpapp.conf
================================================================================
================================================================================
/usr/local/src/php-5.2.4/sapi/cli/tests/007.phpt
================================================================================
No log handling enabled - turning on stderr logging
read_config_store open failure on /var/net-snmp/snmpapp.conf
read_config_store open failure on /var/net-snmp/snmpapp.conf
read_config_store open failure on /var/net-snmp/snmpapp.conf
string(81) "
<?php
class test { public $var = "test"; private $pri; function foo() { } } ?>
"
Could not open input file: wrong
No log handling enabled - turning on stderr logging
read_config_store open failure on /var/net-snmp/snmpapp.conf
read_config_store open failure on /var/net-snmp/snmpapp.conf
read_config_store open failure on /var/net-snmp/snmpapp.conf
NULL
No log handling enabled - turning on stderr logging
read_config_store open failure on /var/net-snmp/snmpapp.conf
read_config_store open failure on /var/net-snmp/snmpapp.conf
read_config_store open failure on /var/net-snmp/snmpapp.conf
string(43) "<?php class test { function foo() {} } ?>
"
Done
================================================================================
001+ No log handling enabled - turning on stderr logging
002+ read_config_store open failure on /var/net-snmp/snmpapp.conf
003+ read_config_store open failure on /var/net-snmp/snmpapp.conf
004+ read_config_store open failure on /var/net-snmp/snmpapp.conf
010+ No log handling enabled - turning on stderr logging
011+ read_config_store open failure on /var/net-snmp/snmpapp.conf
012+ read_config_store open failure on /var/net-snmp/snmpapp.conf
013+ read_config_store open failure on /var/net-snmp/snmpapp.conf
015+ No log handling enabled - turning on stderr logging
016+ read_config_store open failure on /var/net-snmp/snmpapp.conf
017+ read_config_store open failure on /var/net-snmp/snmpapp.conf
018+ read_config_store open failure on /var/net-snmp/snmpapp.conf
================================================================================
================================================================================
/usr/local/src/php-5.2.4/sapi/cli/tests/008.phpt
================================================================================
string(123) "
Fatal error: Cannot access private property test::$pri in
/usr/local/src/php-5.2.4/sapi/cli/tests/008.test.php on line 8
"
Could not open input file: wrong
No log handling enabled - turning on stderr logging
read_config_store open failure on /var/net-snmp/snmpapp.conf
read_config_store open failure on /var/net-snmp/snmpapp.conf
read_config_store open failure on /var/net-snmp/snmpapp.conf
NULL
Done
================================================================================
006+ No log handling enabled - turning on stderr logging
007+ read_config_store open failure on /var/net-snmp/snmpapp.conf
008+ read_config_store open failure on /var/net-snmp/snmpapp.conf
009+ read_config_store open failure on /var/net-snmp/snmpapp.conf
================================================================================
================================================================================
/usr/local/src/php-5.2.4/sapi/cli/tests/009.phpt
================================================================================
You cannot use both -n and -c switch. Use -h for help.
No log handling enabled - turning on stderr logging
read_config_store open failure on /var/net-snmp/snmpapp.conf
read_config_store open failure on /var/net-snmp/snmpapp.conf
read_config_store open failure on /var/net-snmp/snmpapp.conf
NULL
Either execute direct code, process stdin or use a file.
No log handling enabled - turning on stderr logging
read_config_store open failure on /var/net-snmp/snmpapp.conf
read_config_store open failure on /var/net-snmp/snmpapp.conf
read_config_store open failure on /var/net-snmp/snmpapp.conf
NULL
Either execute direct code, process stdin or use a file.
No log handling enabled - turning on stderr logging
read_config_store open failure on /var/net-snmp/snmpapp.conf
read_config_store open failure on /var/net-snmp/snmpapp.conf
read_config_store open failure on /var/net-snmp/snmpapp.conf
NULL
Done
================================================================================
002+ No log handling enabled - turning on stderr logging
003+ read_config_store open failure on /var/net-snmp/snmpapp.conf
004+ read_config_store open failure on /var/net-snmp/snmpapp.conf
005+ read_config_store open failure on /var/net-snmp/snmpapp.conf
008+ No log handling enabled - turning on stderr logging
009+ read_config_store open failure on /var/net-snmp/snmpapp.conf
010+ read_config_store open failure on /var/net-snmp/snmpapp.conf
011+ read_config_store open failure on /var/net-snmp/snmpapp.conf
014+ No log handling enabled - turning on stderr logging
015+ read_config_store open failure on /var/net-snmp/snmpapp.conf
016+ read_config_store open failure on /var/net-snmp/snmpapp.conf
017+ read_config_store open failure on /var/net-snmp/snmpapp.conf
================================================================================
================================================================================
/usr/local/src/php-5.2.4/sapi/cli/tests/011.phpt
================================================================================
No log handling enabled - turning on stderr logging
read_config_store open failure on /var/net-snmp/snmpapp.conf
read_config_store open failure on /var/net-snmp/snmpapp.conf
read_config_store open failure on /var/net-snmp/snmpapp.conf
string(82) "No syntax errors detected in /usr/local/src/php-5.2.4/sapi/cli/tests/011.test.php
"
Could not open input file: some.unknown
No log handling enabled - turning on stderr logging
read_config_store open failure on /var/net-snmp/snmpapp.conf
read_config_store open failure on /var/net-snmp/snmpapp.conf
read_config_store open failure on /var/net-snmp/snmpapp.conf
NULL
No log handling enabled - turning on stderr logging
read_config_store open failure on /var/net-snmp/snmpapp.conf
read_config_store open failure on /var/net-snmp/snmpapp.conf
read_config_store open failure on /var/net-snmp/snmpapp.conf
string(198) "
Parse error: syntax error, unexpected T_PRIVATE, expecting '{' in
/usr/local/src/php-5.2.4/sapi/cli/tests/011.test.php on line 5
Errors parsing /usr/local/src/php-5.2.4/sapi/cli/tests/011.test.php
"
Done
================================================================================
001+ No log handling enabled - turning on stderr logging
002+ read_config_store open failure on /var/net-snmp/snmpapp.conf
003+ read_config_store open failure on /var/net-snmp/snmpapp.conf
004+ read_config_store open failure on /var/net-snmp/snmpapp.conf
008+ No log handling enabled - turning on stderr logging
009+ read_config_store open failure on /var/net-snmp/snmpapp.conf
010+ read_config_store open failure on /var/net-snmp/snmpapp.conf
011+ read_config_store open failure on /var/net-snmp/snmpapp.conf
013+ No log handling enabled - turning on stderr logging
014+ read_config_store open failure on /var/net-snmp/snmpapp.conf
015+ read_config_store open failure on /var/net-snmp/snmpapp.conf
016+ read_config_store open failure on /var/net-snmp/snmpapp.conf
================================================================================
================================================================================
/usr/local/src/php-5.2.4/sapi/cli/tests/012.phpt
================================================================================
You can use -R or -F only once.
No log handling enabled - turning on stderr logging
read_config_store open failure on /var/net-snmp/snmpapp.conf
read_config_store open failure on /var/net-snmp/snmpapp.conf
read_config_store open failure on /var/net-snmp/snmpapp.conf
NULL
You can use -R or -F only once.
No log handling enabled - turning on stderr logging
read_config_store open failure on /var/net-snmp/snmpapp.conf
read_config_store open failure on /var/net-snmp/snmpapp.conf
read_config_store open failure on /var/net-snmp/snmpapp.conf
NULL
You can use -R or -F only once.
No log handling enabled - turning on stderr logging
read_config_store open failure on /var/net-snmp/snmpapp.conf
read_config_store open failure on /var/net-snmp/snmpapp.conf
read_config_store open failure on /var/net-snmp/snmpapp.conf
NULL
You can use -R or -F only once.
No log handling enabled - turning on stderr logging
read_config_store open failure on /var/net-snmp/snmpapp.conf
read_config_store open failure on /var/net-snmp/snmpapp.conf
read_config_store open failure on /var/net-snmp/snmpapp.conf
NULL
You can use -f only once.
No log handling enabled - turning on stderr logging
read_config_store open failure on /var/net-snmp/snmpapp.conf
read_config_store open failure on /var/net-snmp/snmpapp.conf
read_config_store open failure on /var/net-snmp/snmpapp.conf
NULL
You can use -B only once.
No log handling enabled - turning on stderr logging
read_config_store open failure on /var/net-snmp/snmpapp.conf
read_config_store open failure on /var/net-snmp/snmpapp.conf
read_config_store open failure on /var/net-snmp/snmpapp.conf
NULL
You can use -E only once.
No log handling enabled - turning on stderr logging
read_config_store open failure on /var/net-snmp/snmpapp.conf
read_config_store open failure on /var/net-snmp/snmpapp.conf
read_config_store open failure on /var/net-snmp/snmpapp.conf
NULL
You can use -r only once.
No log handling enabled - turning on stderr logging
read_config_store open failure on /var/net-snmp/snmpapp.conf
read_config_store open failure on /var/net-snmp/snmpapp.conf
read_config_store open failure on /var/net-snmp/snmpapp.conf
NULL
Done
================================================================================
002+ No log handling enabled - turning on stderr logging
003+ read_config_store open failure on /var/net-snmp/snmpapp.conf
004+ read_config_store open failure on /var/net-snmp/snmpapp.conf
005+ read_config_store open failure on /var/net-snmp/snmpapp.conf
008+ No log handling enabled - turning on stderr logging
009+ read_config_store open failure on /var/net-snmp/snmpapp.conf
010+ read_config_store open failure on /var/net-snmp/snmpapp.conf
011+ read_config_store open failure on /var/net-snmp/snmpapp.conf
014+ No log handling enabled - turning on stderr logging
015+ read_config_store open failure on /var/net-snmp/snmpapp.conf
016+ read_config_store open failure on /var/net-snmp/snmpapp.conf
017+ read_config_store open failure on /var/net-snmp/snmpapp.conf
020+ No log handling enabled - turning on stderr logging
021+ read_config_store open failure on /var/net-snmp/snmpapp.conf
022+ read_config_store open failure on /var/net-snmp/snmpapp.conf
023+ read_config_store open failure on /var/net-snmp/snmpapp.conf
026+ No log handling enabled - turning on stderr logging
027+ read_config_store open failure on /var/net-snmp/snmpapp.conf
028+ read_config_store open failure on /var/net-snmp/snmpapp.conf
029+ read_config_store open failure on /var/net-snmp/snmpapp.conf
032+ No log handling enabled - turning on stderr logging
033+ read_config_store open failure on /var/net-snmp/snmpapp.conf
034+ read_config_store open failure on /var/net-snmp/snmpapp.conf
035+ read_config_store open failure on /var/net-snmp/snmpapp.conf
038+ No log handling enabled - turning on stderr logging
039+ read_config_store open failure on /var/net-snmp/snmpapp.conf
040+ read_config_store open failure on /var/net-snmp/snmpapp.conf
041+ read_config_store open failure on /var/net-snmp/snmpapp.conf
044+ No log handling enabled - turning on stderr logging
045+ read_config_store open failure on /var/net-snmp/snmpapp.conf
046+ read_config_store open failure on /var/net-snmp/snmpapp.conf
047+ read_config_store open failure on /var/net-snmp/snmpapp.conf
================================================================================
================================================================================
/usr/local/src/php-5.2.4/sapi/cli/tests/014.phpt
================================================================================
No log handling enabled - turning on stderr logging
read_config_store open failure on /var/net-snmp/snmpapp.conf
read_config_store open failure on /var/net-snmp/snmpapp.conf
read_config_store open failure on /var/net-snmp/snmpapp.conf
string(1478) "<code><span style="color: #000000">
<br /><span style="color: #0000BB"><?php<br
/>$test </span><span style="color:
#007700">= </span><span style="color:
#DD0000">"var"</span><span style="color:
#007700">; </span><span style="color: #FF8000">//var<br
/>/* test class */<br /></span><span style="color:
#007700">class </span><span style="color:
#0000BB">test </span><span style="color: #007700">{<br
/> private </span><span
style="color: #0000BB">$var </span><span style="color:
#007700">= array();<br /><br
/> public static function </span><span
style="color: #0000BB">foo</span><span style="color:
#007700">(</span><span style="color:
#0000BB">Test $arg</span><span style="color:
#007700">) {<br
/> echo </span><span
style="color: #DD0000">"hello"</span><span style="color:
#007700">;<br
/> </span!
><span style="color: #0000BB">var_dump</span><span style="color:
>#007700">(</span><span style="color:
>#0000BB">$this</span><span style="color: #007700">);<br
>/> }<br />}<br /><br
>/></span><span style="color: #0000BB">$o </span><span
>style="color: #007700">= new </span><span style="color:
>#0000BB">test</span><span style="color: #007700">;<br
>/></span><span style="color: #0000BB">?><br /></span>
</span>
</code>"
Could not open input file: unknown
No log handling enabled - turning on stderr logging
read_config_store open failure on /var/net-snmp/snmpapp.conf
read_config_store open failure on /var/net-snmp/snmpapp.conf
read_config_store open failure on /var/net-snmp/snmpapp.conf
NULL
Done
================================================================================
001+ No log handling enabled - turning on stderr logging
002+ read_config_store open failure on /var/net-snmp/snmpapp.conf
003+ read_config_store open failure on /var/net-snmp/snmpapp.conf
004+ read_config_store open failure on /var/net-snmp/snmpapp.conf
010+ No log handling enabled - turning on stderr logging
011+ read_config_store open failure on /var/net-snmp/snmpapp.conf
012+ read_config_store open failure on /var/net-snmp/snmpapp.conf
013+ read_config_store open failure on /var/net-snmp/snmpapp.conf
================================================================================
================================================================================
/usr/local/src/php-5.2.4/sapi/cli/tests/015.phpt
================================================================================
No log handling enabled - turning on stderr logging
read_config_store open failure on /var/net-snmp/snmpapp.conf
read_config_store open failure on /var/net-snmp/snmpapp.conf
read_config_store open failure on /var/net-snmp/snmpapp.conf
PHP 5.2.4 (cli) (built: Aug 31 2007 10:04:08)
No log handling enabled - turning on stderr logging
read_config_store open failure on /var/net-snmp/snmpapp.conf
read_config_store open failure on /var/net-snmp/snmpapp.conf
read_config_store open failure on /var/net-snmp/snmpapp.conf
Array
(
[0] => -
[1] => foo
[2] => bar
[3] => baz
)
No log handling enabled - turning on stderr logging
read_config_store open failure on /var/net-snmp/snmpapp.conf
read_config_store open failure on /var/net-snmp/snmpapp.conf
read_config_store open failure on /var/net-snmp/snmpapp.conf
PHP 5.2.4 (cli) (built: Aug 31 2007 10:04:08)
No log handling enabled - turning on stderr logging
read_config_store open failure on /var/net-snmp/snmpapp.conf
read_config_store open failure on /var/net-snmp/snmpapp.conf
read_config_store open failure on /var/net-snmp/snmpapp.conf
Usage: php [options] [-f] <file> [--] [args...]
Done
================================================================================
001+ No log handling enabled - turning on stderr logging
002+ read_config_store open failure on /var/net-snmp/snmpapp.conf
003+ read_config_store open failure on /var/net-snmp/snmpapp.conf
004+ read_config_store open failure on /var/net-snmp/snmpapp.conf
006+ No log handling enabled - turning on stderr logging
007+ read_config_store open failure on /var/net-snmp/snmpapp.conf
008+ read_config_store open failure on /var/net-snmp/snmpapp.conf
009+ read_config_store open failure on /var/net-snmp/snmpapp.conf
018+ No log handling enabled - turning on stderr logging
019+ read_config_store open failure on /var/net-snmp/snmpapp.conf
020+ read_config_store open failure on /var/net-snmp/snmpapp.conf
021+ read_config_store open failure on /var/net-snmp/snmpapp.conf
023+ No log handling enabled - turning on stderr logging
024+ read_config_store open failure on /var/net-snmp/snmpapp.conf
025+ read_config_store open failure on /var/net-snmp/snmpapp.conf
026+ read_config_store open failure on /var/net-snmp/snmpapp.conf
================================================================================
================================================================================
BUILD ENVIRONMENT
================================================================================
OS:
Linux - Linux fire 2.6.9-55.0.2.ELsmp #1 SMP Tue Jun 26 14:30:58 EDT 2007 i686
Autoconf:
autoconf (GNU Autoconf) 2.59
Written by David J. MacKenzie and Akim Demaille.
Copyright (C) 2003 Free Software Foundation, Inc.
This is free software; see the source for copying conditions. There is NO
warranty; not even for MERCHANTABILITY or FITNESS FOR A PARTICULAR PURPOSE.
Bundled Libtool:
ltmain.sh (GNU libtool) 1.5.20 (1.1220.2.287 2005/08/31 18:54:15)
Copyright (C) 2005 Free Software Foundation, Inc.
This is free software; see the source for copying conditions. There is NO
warranty; not even for MERCHANTABILITY or FITNESS FOR A PARTICULAR PURPOSE.
System Libtool:
ltmain.sh (GNU libtool) 1.5.6 (1.1220.2.95 2004/04/11 05:50:42)
Copyright (C) 2003 Free Software Foundation, Inc.
This is free software; see the source for copying conditions. There is NO
warranty; not even for MERCHANTABILITY or FITNESS FOR A PARTICULAR PURPOSE.
Compiler:
Reading specs from /usr/lib/gcc/i386-redhat-linux/3.4.6/specs
Configured with: ../configure --prefix=/usr --mandir=/usr/share/man --infodir=/usr/share/info
--enable-shared --enable-threads=posix --disable-checking --with-system-zlib --enable-__cxa_atexit
--disable-libunwind-exceptions --enable-java-awt=gtk --host=i386-redhat-linux
Thread model: posix
gcc version 3.4.6 20060404 (Red Hat 3.4.6-8)
Bison:
bison (GNU Bison) 1.875c
Written by Robert Corbett and Richard Stallman.
Copyright (C) 2003 Free Software Foundation, Inc.
This is free software; see the source for copying conditions. There is NO
warranty; not even for MERCHANTABILITY or FITNESS FOR A PARTICULAR PURPOSE.
Libraries:
libcrypt.so.1 => /lib/libcrypt.so.1 (0x00d70000)
libc-client.so.0 => /usr/lib/libc-client.so.0 (0x0063a000)
libpq.so.5 => /usr/local/pgsql/lib/libpq.so.5 (0x0013b000)
libmhash.so.2 => /usr/local/lib/libmhash.so.2 (0x004a7000)
libmcrypt.so.4 => /usr/local/lib/libmcrypt.so.4 (0x0083e000)
libltdl.so.3 => /usr/lib/libltdl.so.3 (0x001e1000)
libdl.so.2 => /lib/libdl.so.2 (0x00d0f000)
libldap-2.2.so.7 => /usr/lib/libldap-2.2.so.7 (0x00db5000)
liblber-2.2.so.7 => /usr/lib/liblber-2.2.so.7 (0x00d2b000)
libssl.so.4 => /lib/libssl.so.4 (0x0043e000)
libcrypto.so.4 => /lib/libcrypto.so.4 (0x00286000)
libpam.so.0 => /lib/libpam.so.0 (0x00371000)
libfreetype.so.6 => /usr/lib/libfreetype.so.6 (0x0015b000)
libz.so.1 => /usr/lib/libz.so.1 (0x00d3a000)
libpng12.so.0 => /usr/lib/libpng12.so.0 (0x00111000)
libjpeg.so.62 => /usr/lib/libjpeg.so.62 (0x00474000)
libcurl.so.3 => /usr/lib/libcurl.so.3 (0x001e8000)
libresolv.so.2 => /lib/libresolv.so.2 (0x00da0000)
libm.so.6 => /lib/tls/libm.so.6 (0x00217000)
libnsl.so.1 => /lib/libnsl.so.1 (0x001c6000)
libgssapi_krb5.so.2 => /usr/lib/libgssapi_krb5.so.2 (0x00270000)
libkrb5.so.3 => /usr/lib/libkrb5.so.3 (0x00379000)
libk5crypto.so.3 => /usr/lib/libk5crypto.so.3 (0x0023a000)
libcom_err.so.2 => /lib/libcom_err.so.2 (0x00d60000)
libidn.so.11 => /usr/lib/libidn.so.11 (0x003de000)
libnetsnmp.so.5 => /usr/lib/libnetsnmp.so.5 (0x004cd000)
libelf.so.1 => /usr/lib/libelf.so.1 (0x0025b000)
libxml2.so.2 => /usr/lib/libxml2.so.2 (0x006f6000)
libpthread.so.0 => /lib/tls/libpthread.so.0 (0x00d4c000)
libc.so.6 => /lib/tls/libc.so.6 (0x00be1000)
/lib/ld-linux.so.2 (0x00bc7000)
libsasl2.so.2 => /usr/lib/libsasl2.so.2 (0x00d15000)
libaudit.so.0 => /lib/libaudit.so.0 (0x0040e000)
User's E-mail: tep at geotrax dot com
================================================================================
PHPINFO
================================================================================
phpinfo()
PHP Version => 5.2.4
System => Linux fire 2.6.9-55.0.2.ELsmp #1 SMP Tue Jun 26 14:30:58 EDT 2007 i686
Build Date => Aug 31 2007 10:02:11
Configure Command => './configure' '--disable-all'
'--disable-cgi' '--with-apxs2filter'
'--with-config-file-path=/etc/httpd/conf' '--with-layout=GNU'
'--with-pgsql=/usr/local/pgsql' '--enable-session' '--enable-ctype'
'--with-pcre-regex' '--with-gd' '--enable-gd-native-ttf'
'--with-ttf' '--with-freetype-dir=/usr' '--with-png-dir=/usr'
'--with-jpeg-dir=/usr' '--enable-sysvshm' '--enable-sysvsem'
'--enable-inline-optimization' '--enable-sockets'
'--with-openssl=/usr' '--with-zlib' '--enable-ftp'
'--with-mhash' '--with-curl' '--with-mcrypt=/usr/local'
'--enable-wddx' '--with-pear' '--with-ldap'
'--with-ldap-sasl' '--with-imap' '--with-imap-ssl'
'--with-kerberos=/usr' '--enable-soap' '--disable-debug'
'--with-pdo-pgsql=/usr/local/pgsql' '--with-gettext' '--disable-ipv6'
'--enable-libxml' '--enable-xml' '--with-snmp'
Server API => Command Line Interface
Virtual Directory Support => disabled
Configuration File (php.ini) Path => /etc/httpd/conf
Loaded Configuration File => /etc/httpd/conf/php.ini
PHP API => 20041225
PHP Extension => 20060613
Zend Extension => 220060519
Debug Build => no
Thread Safety => disabled
Zend Memory Manager => enabled
IPv6 Support => disabled
Registered PHP Streams => php, file, data, http, ftp, compress.zlib, https, ftps
Registered Stream Socket Transports => tcp, udp, unix, udg, ssl, sslv3, sslv2, tls
Registered Stream Filters => string.rot13, string.toupper, string.tolower, string.strip_tags,
convert.*, consumed, zlib.*
This program makes use of the Zend Scripting Language Engine:
Zend Engine v2.2.0, Copyright (c) 1998-2007 Zend Technologies
_______________________________________________________________________
Configuration
PHP Core
Directive => Local Value => Master Value
allow_call_time_pass_reference => Off => Off
allow_url_fopen => On => On
allow_url_include => Off => Off
always_populate_raw_post_data => Off => Off
arg_separator.input => & => &
arg_separator.output => & => &
asp_tags => Off => Off
auto_append_file => no value => no value
auto_globals_jit => On => On
auto_prepend_file => no value => no value
browscap => no value => no value
default_charset => no value => no value
default_mimetype => text/html => text/html
define_syslog_variables => Off => Off
disable_classes => no value => no value
disable_functions => no value => no value
display_errors => Off => Off
display_startup_errors => Off => Off
doc_root => no value => no value
docref_ext => no value => no value
docref_root => no value => no value
enable_dl => On => On
error_append_string => no value => no value
error_log => syslog => syslog
error_prepend_string => no value => no value
error_reporting => 6143 => 6143
expose_php => Off => Off
extension_dir => /usr/local/lib/php/20060613 => /usr/local/lib/php/20060613
file_uploads => On => On
highlight.bg => <font style="color: #FFFFFF">#FFFFFF</font> => <font
style="color: #FFFFFF">#FFFFFF</font>
highlight.comment => <font style="color: #FF8000">#FF8000</font> =>
<font style="color: #FF8000">#FF8000</font>
highlight.default => <font style="color: #0000BB">#0000BB</font> =>
<font style="color: #0000BB">#0000BB</font>
highlight.html => <font style="color: #000000">#000000</font> =>
<font style="color: #000000">#000000</font>
highlight.keyword => <font style="color: #007700">#007700</font> =>
<font style="color: #007700">#007700</font>
highlight.string => <font style="color: #DD0000">#DD0000</font> =>
<font style="color: #DD0000">#DD0000</font>
html_errors => Off => Off
ignore_repeated_errors => Off => Off
ignore_repeated_source => Off => Off
ignore_user_abort => Off => Off
implicit_flush => On => On
include_path => .:/usr/local/share/pear_local:/usr/local/share/pear =>
.:/usr/local/share/pear_local:/usr/local/share/pear
log_errors => On => On
log_errors_max_len => 0 => 0
magic_quotes_gpc => Off => Off
magic_quotes_runtime => Off => Off
magic_quotes_sybase => Off => Off
mail.force_extra_parameters => no value => no value
max_execution_time => 0 => 0
max_input_nesting_level => 64 => 64
max_input_time => -1 => -1
memory_limit => 32M => 32M
open_basedir => no value => no value
output_buffering => 0 => 0
output_handler => no value => no value
post_max_size => 8M => 8M
precision => 14 => 14
realpath_cache_size => 16K => 16K
realpath_cache_ttl => 120 => 120
register_argc_argv => On => On
register_globals => Off => Off
register_long_arrays => Off => Off
report_memleaks => On => On
report_zend_debug => Off => Off
safe_mode => Off => Off
safe_mode_exec_dir => no value => no value
safe_mode_gid => Off => Off
safe_mode_include_dir => no value => no value
sendmail_from => no value => no value
sendmail_path => /usr/sbin/sendmail -t -i => /usr/sbin/sendmail -t -i
serialize_precision => 100 => 100
short_open_tag => Off => Off
SMTP => localhost => localhost
smtp_port => 25 => 25
sql.safe_mode => Off => Off
track_errors => Off => Off
unserialize_callback_func => no value => no value
upload_max_filesize => 10M => 10M
upload_tmp_dir => no value => no value
user_dir => no value => no value
variables_order => GPCS => GPCS
xmlrpc_error_number => 0 => 0
xmlrpc_errors => Off => Off
y2k_compliance => On => On
zend.ze1_compatibility_mode => Off => Off
ctype
ctype functions => enabled
curl
cURL support => enabled
cURL Information => libcurl/7.12.1 OpenSSL/0.9.7a zlib/1.2.1.2 libidn/0.5.6
date
date/time support => enabled
"Olson" Timezone Database Version => 2007.6
Timezone Database => internal
Default timezone => America/Los_Angeles
Directive => Local Value => Master Value
date.default_latitude => 31.7667 => 31.7667
date.default_longitude => 35.2333 => 35.2333
date.sunrise_zenith => 90.583333 => 90.583333
date.sunset_zenith => 90.583333 => 90.583333
date.timezone => America/Los_Angeles => America/Los_Angeles
ftp
FTP support => enabled
gd
GD Support => enabled
GD Version => bundled (2.0.34 compatible)
FreeType Support => enabled
FreeType Linkage => with freetype
FreeType Version => 2.1.9
GIF Read Support => enabled
GIF Create Support => enabled
JPG Support => enabled
PNG Support => enabled
WBMP Support => enabled
XBM Support => enabled
gettext
GetText Support => enabled
imap
IMAP c-Client Version => 2001
SSL Support => enabled
Kerberos Support => enabled
ldap
LDAP Support => enabled
RCS Version => $Id: ldap.c,v 1.161.2.3.2.11 2007/07/17 09:09:42 jani Exp $
Total Links => 0/unlimited
API Version => 3001
Vendor Name => OpenLDAP
Vendor Version => 20213
SASL Support => Enabled
libxml
libXML support => active
libXML Version => 2.6.16
libXML streams => enabled
mcrypt
mcrypt support => enabled
Version => 2.5.7
Api No => 20021217
Supported ciphers => cast-128 gost rijndael-128 twofish arcfour cast-256 loki97 rijndael-192
saferplus wake blowfish-compat des rijndael-256 serpent xtea blowfish enigma rc2 tripledes
Supported modes => cbc cfb ctr ecb ncfb nofb ofb stream
Directive => Local Value => Master Value
mcrypt.algorithms_dir => no value => no value
mcrypt.modes_dir => no value => no value
mhash
MHASH support => Enabled
MHASH API Version => 20020524
openssl
OpenSSL support => enabled
OpenSSL Version => OpenSSL 0.9.7a Feb 19 2003
pcre
PCRE (Perl Compatible Regular Expressions) Support => enabled
PCRE Library Version => 7.2 2007-06-19
Directive => Local Value => Master Value
pcre.backtrack_limit => 100000 => 100000
pcre.recursion_limit => 100000 => 100000
pgsql
PostgreSQL Support => enabled
PostgreSQL(libpq) Version => 8.2.4
Multibyte character support => enabled
SSL support => enabled
Active Persistent Links => 0
Active Links => 0
Directive => Local Value => Master Value
pgsql.allow_persistent => On => On
pgsql.auto_reset_persistent => On => On
pgsql.ignore_notice => Off => Off
pgsql.log_notice => Off => Off
pgsql.max_links => 2 => 2
pgsql.max_persistent => 2 => 2
Reflection
Reflection => enabled
Version => $Id: php_reflection.c,v 1.164.2.33.2.45 2007/08/20 17:01:22 sebastian Exp $
session
Session Support => enabled
Registered save handlers => files user
Registered serializer handlers => php php_binary wddx
Directive => Local Value => Master Value
session.auto_start => Off => Off
session.bug_compat_42 => Off => Off
session.bug_compat_warn => On => On
session.cache_expire => 180 => 180
session.cache_limiter => nocache => nocache
session.cookie_domain => no value => no value
session.cookie_httponly => Off => Off
session.cookie_lifetime => 0 => 0
session.cookie_path => / => /
session.cookie_secure => Off => Off
session.entropy_file => no value => no value
session.entropy_length => 0 => 0
session.gc_divisor => 1000 => 1000
session.gc_maxlifetime => 1440 => 1440
session.gc_probability => 1 => 1
session.hash_bits_per_character => 5 => 5
session.hash_function => 0 => 0
session.name => PHPSESSID => PHPSESSID
session.referer_check => no value => no value
session.save_handler => files => files
session.save_path => /tmp => /tmp
session.serialize_handler => php => php
session.use_cookies => On => On
session.use_only_cookies => Off => Off
session.use_trans_sid => 0 => 0
snmp
NET-SNMP Support => enabled
NET-SNMP Version => 5.1.2
soap
Soap Client => enabled
Soap Server => enabled
Directive => Local Value => Master Value
soap.wsdl_cache => 1 => 1
soap.wsdl_cache_dir => /tmp => /tmp
soap.wsdl_cache_enabled => 1 => 1
soap.wsdl_cache_limit => 5 => 5
soap.wsdl_cache_ttl => 86400 => 86400
sockets
Sockets Support => enabled
standard
Regex Library => Bundled library enabled
Dynamic Library Support => enabled
Path to sendmail => /usr/sbin/sendmail -t -i
Directive => Local Value => Master Value
assert.active => 1 => 1
assert.bail => 0 => 0
assert.callback => no value => no value
assert.quiet_eval => 0 => 0
assert.warning => 1 => 1
auto_detect_line_endings => 0 => 0
default_socket_timeout => 60 => 60
safe_mode_allowed_env_vars => PHP_ => PHP_
safe_mode_protected_env_vars => LD_LIBRARY_PATH => LD_LIBRARY_PATH
url_rewriter.tags => a=href,area=href,frame=src,input=src,form=fakeentry =>
a=href,area=href,frame=src,input=src,form=fakeentry
user_agent => no value => no value
wddx
WDDX Support => enabled
WDDX Session Serializer => enabled
xml
XML Support => active
XML Namespace Support => active
libxml2 Version => 2.6.16
zlib
ZLib Support => enabled
Stream Wrapper support => compress.zlib://
Stream Filter support => zlib.inflate, zlib.deflate
Compiled Version => 1.2.1.2
Linked Version => 1.2.1.2
Directive => Local Value => Master Value
zlib.output_compression => On => On
zlib.output_compression_level => -1 => -1
zlib.output_handler => no value => no value
Additional Modules
Module Name
sysvsem
sysvshm
Environment
Variable => Value
HOSTNAME => fire
TEST_PHP_SRCDIR => /usr/local/src/php-5.2.4
SHELL => /bin/sh
TERM => xterm-color
MAKEFLAGS =>
HISTSIZE => 1000
CPPFLAGS => -O3 -march=pentium4 -finline-functions -funroll-loops -pipe -msse -msse2 -pipe
-mfpmath=sse,387 -mmmx -fomit-frame-pointer
SSH_CLIENT => deleted
CVSROOT => :ext:geotrax@cvs:/home/cvsrepos
SSH_TTY => deleted
USER => tep
LS_COLORS =>
no=00:fi=00:di=01;34:ln=01;36:pi=40;33:so=01;35:bd=40;33;01:cd=40;33;01:or=01;05;37;41:mi=01;05;37;41:ex=01;32:*.cmd=01;32:*.exe=01;32:*.com=01;32:*.btm=01;32:*.bat=01;32:*.sh=01;32:*.csh=01;32:*.tar=01;31:*.tgz=01;31:*.arj=01;31:*.taz=01;31:*.lzh=01;31:*.zip=01;31:*.z=01;31:*.Z=01;31:*.gz=01;31:*.bz2=01;31:*.bz=01;31:*.tz=01;31:*.rpm=01;31:*.cpio=01;31:*.jpg=01;35:*.gif=01;35:*.bmp=01;35:*.xbm=01;35:*.xpm=01;35:*.png=01;35:*.tif=01;35:
SSH_AUTH_SOCK => deleted
CXXFLAGS => -O3 -march=pentium4 -finline-functions -funroll-loops -pipe -msse -msse2 -pipe
-mfpmath=sse,387 -mmmx -fomit-frame-pointer -prefer-non-pic
MAKELEVEL => 1
MFLAGS =>
PATH =>
/usr/kerberos/bin:/usr/local/pgsql/bin:/usr/local/java/bin:/usr/local/bin:/bin:/usr/bin:/usr/X11R6/bin:/usr/local/sbin:/usr/sbin:/sbin:/home/tep/bin
MAIL => /var/spool/mail/tep
_ => /usr/local/src/php-5.2.4/sapi/cli/php
PWD => /usr/local/src/php-5.2.4
INPUTRC => /etc/inputrc
EDITOR => /usr/local/bin/edit
LANG => en_US.UTF-8
TEST_PHP_EXECUTABLE => /usr/local/src/php-5.2.4/sapi/cli/php
HOME => /home/tep
SHLVL => 3
CFLAGS => -O3 -march=pentium4 -finline-functions -funroll-loops -pipe -msse -msse2 -pipe
-mfpmath=sse,387 -mmmx -fomit-frame-pointer -prefer-non-pic
LOGNAME => tep
VISUAL => /usr/local/bin/edit
CVS_RSH => ssh
SSH_CONNECTION => deleted
LESSOPEN => |/usr/bin/lesspipe.sh %s
DISPLAY => localhost:10.0
CC => gcc
G_BROKEN_FILENAMES => 1
PHP Variables
Variable => Value
_SERVER["HOSTNAME"] => fire
_SERVER["TEST_PHP_SRCDIR"] => /usr/local/src/php-5.2.4
_SERVER["SHELL"] => /bin/sh
_SERVER["TERM"] => xterm-color
_SERVER["MAKEFLAGS"] =>
_SERVER["HISTSIZE"] => 1000
_SERVER["CPPFLAGS"] => -O3 -march=pentium4 -finline-functions -funroll-loops -pipe
-msse -msse2 -pipe -mfpmath=sse,387 -mmmx -fomit-frame-pointer
_SERVER["SSH_CLIENT"] => deleted
_SERVER["CVSROOT"] => :ext:geotrax@cvs:/home/cvsrepos
_SERVER["SSH_TTY"] => deleted
_SERVER["USER"] => tep
_SERVER["LS_COLORS"] =>
no=00:fi=00:di=01;34:ln=01;36:pi=40;33:so=01;35:bd=40;33;01:cd=40;33;01:or=01;05;37;41:mi=01;05;37;41:ex=01;32:*.cmd=01;32:*.exe=01;32:*.com=01;32:*.btm=01;32:*.bat=01;32:*.sh=01;32:*.csh=01;32:*.tar=01;31:*.tgz=01;31:*.arj=01;31:*.taz=01;31:*.lzh=01;31:*.zip=01;31:*.z=01;31:*.Z=01;31:*.gz=01;31:*.bz2=01;31:*.bz=01;31:*.tz=01;31:*.rpm=01;31:*.cpio=01;31:*.jpg=01;35:*.gif=01;35:*.bmp=01;35:*.xbm=01;35:*.xpm=01;35:*.png=01;35:*.tif=01;35:
_SERVER["SSH_AUTH_SOCK"] => deleted
_SERVER["CXXFLAGS"] => -O3 -march=pentium4 -finline-functions -funroll-loops -pipe
-msse -msse2 -pipe -mfpmath=sse,387 -mmmx -fomit-frame-pointer -prefer-non-pic
_SERVER["MAKELEVEL"] => 1
_SERVER["MFLAGS"] =>
_SERVER["PATH"] =>
/usr/kerberos/bin:/usr/local/pgsql/bin:/usr/local/java/bin:/usr/local/bin:/bin:/usr/bin:/usr/X11R6/bin:/usr/local/sbin:/usr/sbin:/sbin:/home/tep/bin
_SERVER["MAIL"] => /var/spool/mail/tep
_SERVER["_"] => /usr/local/src/php-5.2.4/sapi/cli/php
_SERVER["PWD"] => /usr/local/src/php-5.2.4
_SERVER["INPUTRC"] => /etc/inputrc
_SERVER["EDITOR"] => /usr/local/bin/edit
_SERVER["LANG"] => en_US.UTF-8
_SERVER["TEST_PHP_EXECUTABLE"] => /usr/local/src/php-5.2.4/sapi/cli/php
_SERVER["HOME"] => /home/tep
_SERVER["SHLVL"] => 3
_SERVER["CFLAGS"] => -O3 -march=pentium4 -finline-functions -funroll-loops -pipe -msse
-msse2 -pipe -mfpmath=sse,387 -mmmx -fomit-frame-pointer -prefer-non-pic
_SERVER["LOGNAME"] => tep
_SERVER["VISUAL"] => /usr/local/bin/edit
_SERVER["CVS_RSH"] => ssh
_SERVER["SSH_CONNECTION"] => deleted
_SERVER["LESSOPEN"] => |/usr/bin/lesspipe.sh %s
_SERVER["DISPLAY"] => localhost:10.0
_SERVER["CC"] => gcc
_SERVER["G_BROKEN_FILENAMES"] => 1
_SERVER["PHP_SELF"] =>
_SERVER["SCRIPT_NAME"] =>
_SERVER["SCRIPT_FILENAME"] =>
_SERVER["PATH_TRANSLATED"] =>
_SERVER["DOCUMENT_ROOT"] =>
_SERVER["REQUEST_TIME"] => 1188581144
_SERVER["argv"] => Array
(
)
_SERVER["argc"] => 0
PHP License
This program is free software; you can redistribute it and/or modify
it under the terms of the PHP License as published by the PHP Group
and included in the distribution in the file: LICENSE
This program is distributed in the hope that it will be useful,
but WITHOUT ANY WARRANTY; without even the implied warranty of
MERCHANTABILITY or FITNESS FOR A PARTICULAR PURPOSE.
If you did not receive a copy of the PHP license, or have any
questions about PHP licensing, please contact license@php.net.