PHP Test results
| From: | noreply@php.net | Date: | Fri, 22 Mar 2002 21:47:01 +0000 |
| Subject: | PHP Test results | ||
| Groups: | php.qa | ||
| Request: | Send a blank email to php-qa+get-4612@lists.php.net to get a copy of this message | ||
array (
'user_name' => 'Marcello Di Pietro',
'email' => 'marcellodipietro@t-online.de',
'package' => '4.2.0-RC1',
'testcase' => '0',
'status' => 'Fail',
'os' => 'Linux i386',
'sapi' => 'Apache 1.3.x Static',
'automake' => '14',
'autoconf' => '213',
'libtool' => '134',
'bison' => '128',
'pgsql' => 'on',
'session' => 'on',
'zlib' => 'on',
'test' => './configure --with-zlib --with-pgsql --with-session
--with-apache=../apache_1.3.23 --enable-track-vars --disable-debug
make',
'problems' => '/bin/sh /home/root/php-4.2.0RC1/libtool --silent --mode=link gcc
-I. -I/home/root/php-4.2.0RC1/sapi/cli -I/home/root/php-4.2.0RC1/main -I/home/root/php-4.2.0RC1
-I/home/root/apache_1.3.23/src/include -I/home/root/apache_1.3.23/src/os/unix
-I/home/root/php-4.2.0RC1/Zend -I/home/root/php-4.2.0RC1/ext/mysql/libmysql -I/usr/include/pgsql
-I/home/root/php-4.2.0RC1/ext/xml/expat -I/home/root/php-4.2.0RC1/TSRM -g -O2 -o php
-export-dynamic libphp4cli.la
./.libs/libphp4cli.a(pgsql.o): In function `_rollback_transactions\':
/home/root/php-4.2.0RC1/ext/pgsql/pgsql.c:257: undefined reference to `PQsetnonblocking\'
./.libs/libphp4cli.a(pgsql.o): In function `zif_pg_query\':
/home/root/php-4.2.0RC1/ext/pgsql/pgsql.c:846: undefined reference to `PQsetnonblocking\'
./.libs/libphp4cli.a(pgsql.o): In function `php_pgsql_do_async\':
/home/root/php-4.2.0RC1/ext/pgsql/pgsql.c:2468: undefined reference to `PQsetnonblocking\'
/home/root/php-4.2.0RC1/ext/pgsql/pgsql.c:2490: undefined reference to `PQsetnonblocking\'
./.libs/libphp4cli.a(pgsql.o): In function `zif_pg_send_query\':
/home/root/php-4.2.0RC1/ext/pgsql/pgsql.c:2533: undefined reference to `PQsetnonblocking\'
./.libs/libphp4cli.a(pgsql.o):/home/root/php-4.2.0RC1/ext/pgsql/pgsql.c:2549: more undefined
references to `PQsetnonblocking\' follow
collect2: ld returned 1 exit status
make[2]: *** [php] Error 1
make[2]: Leaving directory `/home/root/php-4.2.0RC1/sapi/cli\'
make[1]: *** [all-recursive] Error 1
make[1]: Leaving directory `/home/root/php-4.2.0RC1/sapi/cli\'
make: *** [all-recursive] Error 1',
'bugids' => '',
'remarks' => 'Exactly the same works for php-4.1.2
',
)