PHP Test results

From: Date: Sun, 24 Mar 2002 13:41:55 +0000
Subject: PHP Test results
Groups: php.qa 
Request: Send a blank email to php-qa+get-4685@lists.php.net to get a copy of this message
array ( 'user_name' => 'Andreas Hjordt', 'email' => 'admin@prog.dk', 'package' => '4.2.0-RC1', 'testcase' => '0', 'status' => 'Fail', 'os' => 'Linux i386', 'sapi' => 'Apache 2.x DSO', 'automake' => '14', 'autoconf' => '213', 'libtool' => '140', 'bison' => '128', 'ctype' => 'on', 'ftp' => 'on', 'gd' => 'on', 'gettext' => 'on', 'imap' => 'on', 'mysql' => 'on', 'test' => './configure --libexecdir=/usr/local/libexec/ --sysconfdir=/usr/local/apache2/ --with-config-file-path=/usr/local/apache2/conf/ --with-apxs2=/usr/local/apache2/bin/apxs --with-gettext --with-imap-ssl --with-openssl --with-kerberos --with-gd --with-zlib --with-jpeg-dir=/usr --with-png-dir=/usr --with-tiff-dir=/usr --with-pgsql-dir=/usr --enable-shared-pdflib --enable-ftp make clean && make', 'problems' => 'make[3]: Entering directory `/root/soft/php-4.2.0RC1/sapi/apache2filter\' /bin/sh /root/soft/php-4.2.0RC1/libtool --silent --mode=compile gcc -I. -I/root/soft/php-4.2.0RC1/sapi/apache2filter -I/root/soft/php-4.2.0RC1/main -I/root/soft/php-4.2.0RC1 -I/usr/local/apache2/include -I/root/soft/php-4.2.0RC1/Zend -I/root/soft/php-4.2.0RC1/ext/mysql/libmysql -I/root/soft/php-4.2.0RC1/ext/xml/expat -D_REENTRANT -I/root/soft/php-4.2.0RC1/TSRM -DTHREAD=1 -g -O2 -pthread -DZTS -prefer-pic -c sapi_apache2.c sapi_apache2.c: In function `php_register_hook\': sapi_apache2.c:474: `AP_FTYPE_RESOURCE\' undeclared (first use in this function) sapi_apache2.c:474: (Each undeclared identifier is reported only once sapi_apache2.c:474: for each function it appears in.) make[3]: *** [sapi_apache2.lo] Error 1 make[3]: Leaving directory `/root/soft/php-4.2.0RC1/sapi/apache2filter\' make[2]: *** [all-recursive] Error 1 make[2]: Leaving directory `/root/soft/php-4.2.0RC1/sapi/apache2filter\' make[1]: *** [all-recursive] Error 1 make[1]: Leaving directory `/root/soft/php-4.2.0RC1/sapi\' make: *** [all-recursive] Error 1 ', 'bugids' => '', 'remarks' => 'I fixed the problem by changing AP_FTYPE_RESOURCE to AP_FTYPE_CONTENT on line 473 and 474 in sapi/apache2filter/sapi_apache2.c . ', )

« previous php.qa (#4685) next »