PHP Test results
| From: | noreply@php.net | Date: | Fri, 29 Mar 2002 12:40:43 +0000 |
| Subject: | PHP Test results | ||
| Groups: | php.qa | ||
| Request: | Send a blank email to php-qa+get-4819@lists.php.net to get a copy of this message | ||
array (
'user_name' => 'Ruud van den Brink',
'email' => 'ruudb@stress.utwente.nl',
'package' => '4.2.0-RC1',
'testcase' => '0',
'status' => 'Fail',
'os' => 'Linux i386',
'sapi' => 'Apache 2.x DSO',
'automake' => '14',
'autoconf' => '213',
'libtool' => 'other',
'bison' => '128',
'test' => '',
'problems' => 'Making all in apache2filter
make[2]: Entering directory `/usr/local/src/php-4.2.0RC1/sapi/apache2filter\'
make[3]: Entering directory `/usr/local/src/php-4.2.0RC1/sapi/apache2filter\'
/bin/sh /usr/local/src/php-4.2.0RC1/libtool --silent --mode=compile gcc -I.
-I/usr/local/src/php-4.2.0RC1/sapi/apache2filter -I/usr/local/src/php-4.2.0RC1/main
-I/usr/local/src/php-4.2.0RC1 -I/usr/local/apache2/include -I/usr/local/src/php-4.2.0RC1/Zend
-I/usr/include/c-client -I/usr/local/src/php-4.2.0RC1/ext/mysql/libmysql
-I/usr/local/src/php-4.2.0RC1/ext/xml/expat -D_REENTRANT -I/usr/local/src/php-4.2.0RC1/TSRM
-DTHREAD=1 -g -O2 -pthread -DZTS -prefer-pic -c sapi_apache2.c
sapi_apache2.c: In function `php_register_hook\':
sapi_apache2.c:473: `AP_FTYPE_RESOURCE\' undeclared (first use in this function)
sapi_apache2.c:473: (Each undeclared identifier is reported only once
sapi_apache2.c:473: for each function it appears in.)
make[3]: *** [sapi_apache2.lo] Error 1
make[3]: Leaving directory `/usr/local/src/php-4.2.0RC1/sapi/apache2filter\'
make[2]: *** [all-recursive] Error 1
make[2]: Leaving directory `/usr/local/src/php-4.2.0RC1/sapi/apache2filter\'
make[1]: *** [all-recursive] Error 1
make[1]: Leaving directory `/usr/local/src/php-4.2.0RC1/sapi\'
make: *** [all-recursive] Error 1
',
'bugids' => '',
'remarks' => 'Sorry, the previous report mentioned incorrect build tool
versions.
Libtool version is 1.3.3',
)