PHP Test results

From: Date: Thu, 04 Apr 2002 01:26:05 +0000
Subject: PHP Test results
Groups: php.qa 
Request: Send a blank email to php-qa+get-4869@lists.php.net to get a copy of this message
array ( 'user_name' => 'Mike Dransfield', 'email' => 'mike@blueroot.net', 'package' => '4.2.0-RC2', 'testcase' => '0', 'status' => 'Fail', 'os' => 'Linux i386', 'sapi' => 'Apache 1.3.x Static', 'automake' => '14', 'autoconf' => '213', 'libtool' => '140', 'bison' => '128', 'bz2' => 'on', 'curl' => 'on', 'domxml' => 'on', 'exif' => 'on', 'ftp' => 'on', 'gd' => 'on', 'mailparse' => 'on', 'mbstring' => 'on', 'mysql' => 'on', 'ncurses' => 'on', 'openssl' => 'on', 'qtdom' => 'on', 'shmop' => 'on', 'sockets' => 'on', 'wddx' => 'on', 'xmlrpc' => 'on', 'zlib' => 'on', 'test' => '', 'problems' => 'Build error /bin/sh /usr/src/php-4.2.0RC2/libtool --silent --mode=link gcc -I. -I/usr/src/php-4.2.0RC2/sapi/cli -I/usr/src/php-4.2.0RC2/main -I/usr/src/php-4.2.0RC2 -I/usr/src/apache_1.3.24/src/include -I/usr/src/apache_1.3.24/src/os/unix -I/usr/src/php-4.2.0RC2/Zend -I/usr/src/php-4.2.0RC2/ext/mysql/libmysql -I/usr/src/php-4.2.0RC2/ext/xml/expat -I/usr/src/php-4.2.0RC2/ext/xmlrpc/libxmlrpc -I/usr/src/php-4.2.0RC2/TSRM -g -O2 -o php -export-dynamic libphp4cli.la ./.libs/libphp4cli.a(internal_functions_cli.o): In function `php_startup_internal_extensions\': /usr/src/php-4.2.0RC2/main/internal_functions_cli.c:95: undefined reference to `php_session_mm_module\' ./.libs/libphp4cli.a(mailparse.o): In function `zif_mailparse_determine_best_xfer_encoding\': /usr/src/php-4.2.0RC2/ext/mailparse/mailparse.c:340: undefined reference to `php_stream_seek\' /usr/src/php-4.2.0RC2/ext/mailparse/mailparse.c:356: undefined reference to `php_stream_eof\' /usr/src/php-4.2.0RC2/ext/mailparse/mailparse.c:342: undefined reference to `php_stream_getc\' /usr/src/php-4.2.0RC2/ext/mailparse/mailparse.c:359: undefined reference to `php_stream_seek\' collect2: ld returned 1 exit status make[2]: *** [php] Error 1 make[2]: Leaving directory `/usr/src/php-4.2.0RC2/sapi/cli\' make[1]: *** [all-recursive] Error 1 make[1]: Leaving directory `/usr/src/php-4.2.0RC2/sapi/cli\' make: *** [all-recursive] Error 1 ', 'bugids' => '', 'remarks' => 'full configure command ./configure --with-apache=../apache_1.3.24 --with-mysql --with-gd --with-openssl --enable-php-streams --with-zlib --with-bz2 --enable-calendar --enable-ctype --with-curl --with-exif --enable-ftp --with-hyperwave --with-iconv --with-ircq --enable-mailparse --enable-mbstring --enable-mbstr-enc-trans --with-qtdom --with-mm --enable-trans-sid --enable-shmop --enable-sockets --with-dom --with-ncurses --enable-wddx --with-xmlrpc --with-xslt some warnings during configure hg_comm.c: In function `fnInsAnchorsIntoText\': hg_comm.c:656: warning: assignment from incompatible pointer type hg_comm.c:686: warning: passing arg 2 of `zend_llist_sort\' from incompatible pointer type hg_comm.c: In function `send_pipedocument\': hg_comm.c:5041: warning: assignment makes pointer from integer without a cast hg_comm.c: In function `send_pipecgi\': hg_comm.c:5228: warning: assignment makes pointer from integer without a cast hg_comm.c: In function `send_putdocument\': hg_comm.c:5410: warning: assignment makes pointer from integer without a cast ', )

« previous php.qa (#4869) next »