Test results for 5.2.4 [failed]

From: Date: Thu, 04 Oct 2007 07:46:16 +0000
Subject: Test results for 5.2.4 [failed]
Groups: php.qa 
Request: Send a blank email to php-qa+get-48980@lists.php.net to get a copy of this message
===================================================================== FAILED TEST SUMMARY --------------------------------------------------------------------- Error message handling (with ZendOptimizer) [tests/run-test/test008.phpt] Convert warnings to exceptions [tests/lang/038.phpt] Bug #32828 (Throwing exception in output_callback function with ob_start and ob_end_clean leads to segfault) [tests/lang/bug32828.phpt] Bug #36268 (Object destructors called even after fatal errors) [Zend/tests/bug36268.phpt] Bug #41421 (Uncaught exception from a stream wrapper segfaults) [Zend/tests/bug41421.phpt] Bug #22544 (TrueColor transparency in PNG images). [ext/gd/tests/bug22544.phpt] Bug #27582 (ImageFillToBorder() on alphablending image looses alpha on fill color) [ext/gd/tests/bug27582_1.phpt] Bug #39780 (PNG image with CRC/data error raises a fatal error) [ext/gd/tests/bug39780_extern.phpt] libgd #86 (Possible infinite loop in imagecreatefrompng) [ext/gd/tests/libgd00086_extern.phpt] libgd #106 (imagerectangle 1x1 draws 1x3) [ext/gd/tests/libgd00106.phpt] EUC-JP to ISO-2022-JP [ext/iconv/tests/eucjp2iso2022jp.phpt] EUC-JP to SJIS [ext/iconv/tests/eucjp2sjis.phpt] EUC-JP to UTF8 [ext/iconv/tests/eucjp2utf8.phpt] iconv() test 1 [ext/iconv/tests/iconv001.phpt] iconv_mime_encode() sanity cheeck. [ext/iconv/tests/iconv004.phpt] iconv_mime_decode() [ext/iconv/tests/iconv_mime_decode.phpt] iconv_mime_decode_headers() [ext/iconv/tests/iconv_mime_decode_headers.phpt] iconv_mime_encode() [ext/iconv/tests/iconv_mime_encode.phpt] iconv stream filter [ext/iconv/tests/iconv_stream_filter.phpt] iconv_strlen() [ext/iconv/tests/iconv_strlen.phpt] iconv_strpos() [ext/iconv/tests/iconv_strpos.phpt] iconv_strrpos() [ext/iconv/tests/iconv_strrpos.phpt] iconv_substr() [ext/iconv/tests/iconv_substr.phpt] ob_iconv_handler() [ext/iconv/tests/ob_iconv_handler.phpt] SPL: spl_autoload() with methods [ext/spl/tests/spl_autoload_005.phpt] SPL: spl_autoload() with inaccessible methods [ext/spl/tests/spl_autoload_007.phpt] SPL: spl_autoload() with exceptions [ext/spl/tests/spl_autoload_008.phpt] Bug #35821 (array_map() segfaults when exception is throwed from the callback) [ext/standard/tests/array/bug35821.phpt] Bug #38450 (constructor is not called for classes used in userspace stream wrappers) [ext/standard/tests/file/bug38450_2.phpt] proc_open() regression test 1 (proc_open() leak) [ext/standard/tests/file/proc_open01.phpt] Test is_callable() function [ext/standard/tests/general_functions/is_callable.phpt] Bug #32001 (xml_parse*() goes into infinite loop when autodetection in effect), using UTF-* [ext/xml/tests/bug32001.phpt] CLI long options [sapi/cli/tests/015.phpt] ===================================================================== ===================================================================== TEST RESULT SUMMARY --------------------------------------------------------------------- Exts skipped : 53 Exts tested : 27 --------------------------------------------------------------------- Number of tests : 3973 2565 Tests skipped : 1408 ( 35.4%) -------- Tests warned : 0 ( 0.0%) ( 0.0%) Tests failed : 33 ( 0.8%) ( 1.3%) Tests passed : 2532 ( 63.7%) ( 98.7%) --------------------------------------------------------------------- Time taken : 389 seconds ===================================================================== ===================================================================== FAILED TEST SUMMARY --------------------------------------------------------------------- Error message handling (with ZendOptimizer) [tests/run-test/test008.phpt] Convert warnings to exceptions [tests/lang/038.phpt] Bug #32828 (Throwing exception in output_callback function with ob_start and ob_end_clean leads to segfault) [tests/lang/bug32828.phpt] Bug #36268 (Object destructors called even after fatal errors) [Zend/tests/bug36268.phpt] Bug #41421 (Uncaught exception from a stream wrapper segfaults) [Zend/tests/bug41421.phpt] Bug #22544 (TrueColor transparency in PNG images). [ext/gd/tests/bug22544.phpt] Bug #27582 (ImageFillToBorder() on alphablending image looses alpha on fill color) [ext/gd/tests/bug27582_1.phpt] Bug #39780 (PNG image with CRC/data error raises a fatal error) [ext/gd/tests/bug39780_extern.phpt] libgd #86 (Possible infinite loop in imagecreatefrompng) [ext/gd/tests/libgd00086_extern.phpt] libgd #106 (imagerectangle 1x1 draws 1x3) [ext/gd/tests/libgd00106.phpt] EUC-JP to ISO-2022-JP [ext/iconv/tests/eucjp2iso2022jp.phpt] EUC-JP to SJIS [ext/iconv/tests/eucjp2sjis.phpt] EUC-JP to UTF8 [ext/iconv/tests/eucjp2utf8.phpt] iconv() test 1 [ext/iconv/tests/iconv001.phpt] iconv_mime_encode() sanity cheeck. [ext/iconv/tests/iconv004.phpt] iconv_mime_decode() [ext/iconv/tests/iconv_mime_decode.phpt] iconv_mime_decode_headers() [ext/iconv/tests/iconv_mime_decode_headers.phpt] iconv_mime_encode() [ext/iconv/tests/iconv_mime_encode.phpt] iconv stream filter [ext/iconv/tests/iconv_stream_filter.phpt] iconv_strlen() [ext/iconv/tests/iconv_strlen.phpt] iconv_strpos() [ext/iconv/tests/iconv_strpos.phpt] iconv_strrpos() [ext/iconv/tests/iconv_strrpos.phpt] iconv_substr() [ext/iconv/tests/iconv_substr.phpt] ob_iconv_handler() [ext/iconv/tests/ob_iconv_handler.phpt] SPL: spl_autoload() with methods [ext/spl/tests/spl_autoload_005.phpt] SPL: spl_autoload() with inaccessible methods [ext/spl/tests/spl_autoload_007.phpt] SPL: spl_autoload() with exceptions [ext/spl/tests/spl_autoload_008.phpt] Bug #35821 (array_map() segfaults when exception is throwed from the callback) [ext/standard/tests/array/bug35821.phpt] Bug #38450 (constructor is not called for classes used in userspace stream wrappers) [ext/standard/tests/file/bug38450_2.phpt] proc_open() regression test 1 (proc_open() leak) [ext/standard/tests/file/proc_open01.phpt] Test is_callable() function [ext/standard/tests/general_functions/is_callable.phpt] Bug #32001 (xml_parse*() goes into infinite loop when autodetection in effect), using UTF-* [ext/xml/tests/bug32001.phpt] CLI long options [sapi/cli/tests/015.phpt] ===================================================================== ================================================================================ /root/distr/php-5.2.4/tests/run-test/test008.phpt ================================================================================ string(1) "1" string(4) "8191" string(1) "0" string(1) "1" string(1) "0" NULL string(16) "Division by zero" ================================================================================ 001- %s: %sivision by zero in %s on line %d 006+ NULL 008- string(%d) "%sivision by zer%s" ================================================================================ ================================================================================ /root/distr/php-5.2.4/tests/lang/038.phpt ================================================================================ string(15) "Error2Exception" Fatal error: Uncaught exception 'MyException' with message 'Undefined offset: 1' in :0 Stack trace: #0 /root/distr/php-5.2.4/tests/lang/038.php(29): Error2Exception(8, 'Undefined offse...', '/root/distr/php...', 29, Array) #1 {main} thrown in on line -1208615752 ================================================================================ 002+ 003+ Fatal error: Uncaught exception 'MyException' with message 'Undefined offset: 1' in :0 002- string(5) "fopen" 003- ===DONE=== 004+ Stack trace: 005+ #0 /root/distr/php-5.2.4/tests/lang/038.php(29): Error2Exception(8, 'Undefined offse...', '/root/distr/php...', 29, Array) 006+ #1 {main} 007+ thrown in on line -1208615752 ================================================================================ ================================================================================ /root/distr/php-5.2.4/tests/lang/bug32828.phpt ================================================================================ Fatal error: Uncaught exception 'Exception' in /root/distr/php-5.2.4/tests/lang/bug32828.php:5 Stack trace: #0 /root/distr/php-5.2.4/tests/lang/bug32828.php(10): output_handler('', 5) #1 {main} thrown in /root/distr/php-5.2.4/tests/lang/bug32828.php on line 5 ================================================================================ 003+ #0 /root/distr/php-5.2.4/tests/lang/bug32828.php(10): output_handler('', 5) 004+ #1 {main} 003- #0 [internal function]: output_handler('', %d) 004- #1 %s(%d): ob_end_clean() 005- #2 {main} ================================================================================ ================================================================================ /root/distr/php-5.2.4/Zend/tests/bug36268.phpt ================================================================================ Fatal error: Call to undefined function bar() in /root/distr/php-5.2.4/Zend/tests/bug36268.php on line 8 ================================================================================ 001+ Fatal error: Call to undefined function bar() in /root/distr/php-5.2.4/Zend/tests/bug36268.php on line 8 001- Fatal error: Call to undefined function bar() in %sbug36268.php on line 8 ================================================================================ ================================================================================ /root/distr/php-5.2.4/Zend/tests/bug41421.phpt ================================================================================ Warning: feof(): wrapper::stream_eof is not implemented! Assuming EOF in /root/distr/php-5.2.4/Zend/tests/bug41421.php on line 18 Fatal error: Uncaught exception 'Exception' in /root/distr/php-5.2.4/Zend/tests/bug41421.php:8 Stack trace: #0 /root/distr/php-5.2.4/Zend/tests/bug41421.php(14): wrapper->stream_eof() #1 {main} thrown in /root/distr/php-5.2.4/Zend/tests/bug41421.php on line 8 ================================================================================ 005+ #0 /root/distr/php-5.2.4/Zend/tests/bug41421.php(14): wrapper->stream_eof() 006+ #1 {main} 005- #0 [internal function]: wrapper->stream_eof() 006- #1 %s(%d): feof(Resource id #6) 007- #2 {main} ================================================================================ ================================================================================ /root/distr/php-5.2.4/ext/gd/tests/bug22544.phpt ================================================================================ Fatal error: Call to undefined function imagepng() in /root/distr/php-5.2.4/ext/gd/tests/bug22544.php on line 9 ================================================================================ 001+ Fatal error: Call to undefined function imagepng() in /root/distr/php-5.2.4/ext/gd/tests/bug22544.php on line 9 001- 10a57d09a2c63fad87b85b38d6b258d6 ================================================================================ ================================================================================ /root/distr/php-5.2.4/ext/gd/tests/bug27582_1.phpt ================================================================================ Fatal error: Call to undefined function imagepng() in /root/distr/php-5.2.4/ext/gd/tests/bug27582_1.php on line 11 ================================================================================ 001+ Fatal error: Call to undefined function imagepng() in /root/distr/php-5.2.4/ext/gd/tests/bug27582_1.php on line 11 001- 1 ================================================================================ ================================================================================ /root/distr/php-5.2.4/ext/gd/tests/bug39780_extern.phpt ================================================================================ Fatal error: Call to undefined function imagecreatefrompng() in /root/distr/php-5.2.4/ext/gd/tests/bug39780_extern.php on line 3 ================================================================================ 001+ Fatal error: Call to undefined function imagecreatefrompng() in /root/distr/php-5.2.4/ext/gd/tests/bug39780_extern.php on line 3 001- gd-png: fatal libpng error: Read Error: truncated data 002- gd-png error: setjmp returns error condition 2 003- Warning: imagecreatefrompng(): '%sbug39780.png' is not a valid PNG file in /%s on line %d 004- bool(false) ================================================================================ ================================================================================ /root/distr/php-5.2.4/ext/gd/tests/libgd00086_extern.phpt ================================================================================ Fatal error: Call to undefined function imagecreatefrompng() in /root/distr/php-5.2.4/ext/gd/tests/libgd00086_extern.php on line 3 ================================================================================ 001+ Fatal error: Call to undefined function imagecreatefrompng() in /root/distr/php-5.2.4/ext/gd/tests/libgd00086_extern.php on line 3 001- gd-png: fatal libpng error: Read Error: truncated data 002- gd-png error: setjmp returns error condition 1 003- 004- Warning: imagecreatefrompng(): '%slibgd00086.png' is not a valid PNG file in %s on line %d 005- bool(false) ================================================================================ ================================================================================ /root/distr/php-5.2.4/ext/gd/tests/libgd00106.phpt ================================================================================ failed ================================================================================ 001+ failed 001- Ok ================================================================================ ================================================================================ /root/distr/php-5.2.4/ext/iconv/tests/eucjp2iso2022jp.phpt ================================================================================ ================================================================================ 001+ 001- 1b2442467c4b5c386c2546252d2539254824481b284220456e676c69736820746578741b2442467c4b5c386c2546252d2539254824481b284220456e676c69736820746578741b2442467c4b5c386c2546252d2539254824481b284220456e676c69736820746578741b2442467c4b5c386c2546252d2539254824481b284220456e676c69736820746578741b2442467c4b5c386c2546252d2539254824481b284220456e676c69736820746578741b2442467c4b5c386c2546252d2539254824481b284220456e676c69736820746578741b2442467c4b5c386c2546252d2539254824481b284220456e676c69736820746578741b2442467c4b5c386c2546252d2539254824481b284220456e676c69736820746578741b2442467c4b5c386c2546252d2539254824481b284220456e676c69736820746578741b2442467c4b5c386c2546252d2539254824481b284220456e676c69736820746578741b2442467c4b5c386c2546252d2539254824481b284220456e676c69736820746578741b2442467c4b5c386c2546252d2539254824481b284220456e676c69736820746578741b2442467c4b5c386c2546252d2539254824481b284220456e676c69736820746578741b2442467c4b5c386c2546252d2539254824481b284220456e676c69736820746578741b24! 42467c4b5c386c2546252d2539254824481b284220456e676c69736820746578741b2442467c4b5c386c2546252d2539254824481b284220456e676c69736820746578741b2442467c4b5c386c2546252d2539254824481b284220456e676c69736820746578741b2442467c4b5c386c2546252d2539254824481b284220456e676c69736820746578741b2442467c4b5c386c2546252d2539254824481b284220456e676c69736820746578741b2442467c4b5c386c2546252d2539254824481b284220456e676c69736820746578741b2442467c4b5c386c2546252d2539254824481b284220456e676c69736820746578741b2442467c4b5c386c2546252d2539254824481b284220456e676c69736820746578741b2442467c4b5c386c2546252d2539254824481b284220456e676c69736820746578741b2442467c4b5c386c2546252d2539254824481b284220456e676c69736820746578741b2442467c4b5c386c2546252d2539254824481b284220456e676c69736820746578741b2442467c4b5c386c2546252d2539254824481b284220456e676c69736820746578741b2442467c4b5c386c2546252d2539254824481b284220456e676c69736820746578741b2442467c4b5c386c2546252d2539254824481b284220456e676c69736820746578741b2442467c4b! 5c386c2546252d2539254824481b284220456e676c69736820746578741b2442467c4b 5c386c2546252d2539254824481b284220456e676c69736820746578741b2442467c4b5c386c1b2842 ================================================================================ ================================================================================ /root/distr/php-5.2.4/ext/iconv/tests/eucjp2sjis.phpt ================================================================================ ================================================================================ 001+ 001- CpP6lnuM6oNlg0yDWINngsZFbmdsaXNoIFRleHQKk/qWe4zqg2WDTINYg2eCxkVuZ2xpc2ggVGV4dAqT+pZ7jOqDZYNMg1iDZ4LGRW5nbGlzaCBUZXh0CpP6lnuM6oNlg0yDWINngsZFbmdsaXNoIFRleHQKk/qWe4zqg2WDTINYg2eCxkVuZ2xpc2ggVGV4dAqT+pZ7jOqDZYNMg1iDZ4LGRW5nbGlzaCBUZXh0CpP6lnuM6oNlg0yDWINngsZFbmdsaXNoIFRleHQKk/qWe4zqg2WDTINYg2eCxkVuZ2xpc2ggVGV4dAqT+pZ7jOqDZYNMg1iDZ4LGRW5nbGlzaCBUZXh0CpP6lnuM6oNlg0yDWINngsZFbmdsaXNoIFRleHQKk/qWe4zqg2WDTINYg2eCxkVuZ2xpc2ggVGV4dAqT+pZ7jOqDZYNMg1iDZ4LGRW5nbGlzaCBUZXh0CpP6lnuM6oNlg0yDWINngsZFbmdsaXNoIFRleHQKk/qWe4zqg2WDTINYg2eCxkVuZ2xpc2ggVGV4dAqT+pZ7jOqDZYNMg1iDZ4LGRW5nbGlzaCBUZXh0CpP6lnuM6oNlg0yDWINngsZFbmdsaXNoIFRleHQKk/qWe4zqg2WDTINYg2eCxkVuZ2xpc2ggVGV4dAqT+pZ7jOqDZYNMg1iDZ4LGRW5nbGlzaCBUZXh0CpP6lnuM6oNlg0yDWINngsZFbmdsaXNoIFRleHQKk/qWe4zqg2WDTINYg2eCxkVuZ2xpc2ggVGV4dAqT+pZ7jOqDZYNMg1iDZ4LGRW5nbGlzaCBUZXh0CpP6lnuM6oNlg0yDWINngsZFbmdsaXNoIFRleHQKk/qWe4zqg2WDTINYg2eCxkVuZ2xpc2ggVGV4dAqT+pZ7jOqDZYNMg1iDZ4LGRW5nbGlzaCBUZXh0CpP6lnuM6oNlg0yDWINngsZFbmdsaXNoIFRleHQKk/qWe4zqg2WDTINY! g2eCxkVuZ2xpc2ggVGV4dAqT+pZ7jOqDZYNMg1iDZ4LGRW5nbGlzaCBUZXh0CpP6lnuM6oNlg0yDWINngsZFbmdsaXNoIFRleHQKk/qWe4zqg2WDTINYg2eCxkVuZ2xpc2ggVGV4dAqT+pZ7jOqDZYNMg1iDZ4LGRW5nbGlzaCBUZXh0CpP6lnuM6oNlg0yDWINngsZFbmdsaXNoIFRleHQKk/qWe4zqg2WDTINYg2eCxkVuZ2xpc2ggVGV4dAqT+pZ7jOqDZYNMg1iDZ4LGRW5nbGlzaCBUZXh0CpP6lnuM6oNlg0yDWINngsZFbmdsaXNoIFRleHQKk/qWe4zqg2WDTINYg2eCxkVuZ2xpc2ggVGV4dAqT+pZ7jOqDZYNMg1iDZ4LGRW5nbGlzaCBUZXh0Cg== ================================================================================ ================================================================================ /root/distr/php-5.2.4/ext/iconv/tests/eucjp2utf8.phpt ================================================================================ ================================================================================ 001+ 001- CuaXpeacrOiqnuODhuOCreOCueODiOOBqEVuZ2xpc2ggVGV4dArml6XmnKzoqp7jg4bjgq3jgrnjg4jjgahFbmdsaXNoIFRleHQK5pel5pys6Kqe44OG44Kt44K544OI44GoRW5nbGlzaCBUZXh0CuaXpeacrOiqnuODhuOCreOCueODiOOBqEVuZ2xpc2ggVGV4dArml6XmnKzoqp7jg4bjgq3jgrnjg4jjgahFbmdsaXNoIFRleHQK5pel5pys6Kqe44OG44Kt44K544OI44GoRW5nbGlzaCBUZXh0CuaXpeacrOiqnuODhuOCreOCueODiOOBqEVuZ2xpc2ggVGV4dArml6XmnKzoqp7jg4bjgq3jgrnjg4jjgahFbmdsaXNoIFRleHQK5pel5pys6Kqe44OG44Kt44K544OI44GoRW5nbGlzaCBUZXh0CuaXpeacrOiqnuODhuOCreOCueODiOOBqEVuZ2xpc2ggVGV4dArml6XmnKzoqp7jg4bjgq3jgrnjg4jjgahFbmdsaXNoIFRleHQK5pel5pys6Kqe44OG44Kt44K544OI44GoRW5nbGlzaCBUZXh0CuaXpeacrOiqnuODhuOCreOCueODiOOBqEVuZ2xpc2ggVGV4dArml6XmnKzoqp7jg4bjgq3jgrnjg4jjgahFbmdsaXNoIFRleHQK5pel5pys6Kqe44OG44Kt44K544OI44GoRW5nbGlzaCBUZXh0CuaXpeacrOiqnuODhuOCreOCueODiOOBqEVuZ2xpc2ggVGV4dArml6XmnKzoqp7jg4bjgq3jgrnjg4jjgahFbmdsaXNoIFRleHQK5pel5pys6Kqe44OG44Kt44K544OI44GoRW5nbGlzaCBUZXh0CuaXpeacrOiqnuODhuOCreOCueODiOOBqEVuZ2xpc2ggVGV4dArml6XmnKzoqp7jg4bjgq3jgrnjg4jjgahFbmdsaXNoIFRl! eHQK5pel5pys6Kqe44OG44Kt44K544OI44GoRW5nbGlzaCBUZXh0CuaXpeacrOiqnuODhuOCreOCueODiOOBqEVuZ2xpc2ggVGV4dArml6XmnKzoqp7jg4bjgq3jgrnjg4jjgahFbmdsaXNoIFRleHQK5pel5pys6Kqe44OG44Kt44K544OI44GoRW5nbGlzaCBUZXh0CuaXpeacrOiqnuODhuOCreOCueODiOOBqEVuZ2xpc2ggVGV4dArml6XmnKzoqp7jg4bjgq3jgrnjg4jjgahFbmdsaXNoIFRleHQK5pel5pys6Kqe44OG44Kt44K544OI44GoRW5nbGlzaCBUZXh0CuaXpeacrOiqnuODhuOCreOCueODiOOBqEVuZ2xpc2ggVGV4dArml6XmnKzoqp7jg4bjgq3jgrnjg4jjgahFbmdsaXNoIFRleHQK5pel5pys6Kqe44OG44Kt44K544OI44GoRW5nbGlzaCBUZXh0CuaXpeacrOiqnuODhuOCreOCueODiOOBqEVuZ2xpc2ggVGV4dArml6XmnKzoqp7jg4bjgq3jgrnjg4jjgahFbmdsaXNoIFRleHQK5pel5pys6Kqe44OG44Kt44K544OI44GoRW5nbGlzaCBUZXh0CuaXpeacrOiqnuODhuOCreOCueODiOOBqEVuZ2xpc2ggVGV4dArml6XmnKzoqp7jg4bjgq3jgrnjg4jjgahFbmdsaXNoIFRleHQK5pel5pys6Kqe44OG44Kt44K544OI44GoRW5nbGlzaCBUZXh0Cg== ================================================================================ ================================================================================ /root/distr/php-5.2.4/ext/iconv/tests/iconv001.phpt ================================================================================ iconv extension is available string(15) "ISO-8859-1: æøå" string(7) "UTF-8: " ================================================================================ 003+ string(7) "UTF-8: " 003- string(13) "UTF-8: æøå" ================================================================================ ================================================================================ /root/distr/php-5.2.4/ext/iconv/tests/iconv004.phpt ================================================================================ Notice: iconv_mime_encode(): Unknown error (25) in /root/distr/php-5.2.4/ext/iconv/tests/iconv004.php on line 2 bool(false) Notice: iconv_mime_encode(): Unknown error (25) in /root/distr/php-5.2.4/ext/iconv/tests/iconv004.php on line 3 bool(false) ================================================================================ 001+ Notice: iconv_mime_encode(): Unknown error (25) in /root/distr/php-5.2.4/ext/iconv/tests/iconv004.php on line 2 002+ bool(false) 001- string(19) ": =?ISO-8859-1?B??=" 002- string(19) ": =?ISO-8859-1?B??=" 003+ 004+ Notice: iconv_mime_encode(): Unknown error (25) in /root/distr/php-5.2.4/ext/iconv/tests/iconv004.php on line 3 005+ bool(false) ================================================================================ ================================================================================ /root/distr/php-5.2.4/ext/iconv/tests/iconv_mime_decode.phpt ================================================================================ 8: iconv_mime_decode(): Unknown error (25) 8: iconv_strlen(): Unknown error (25) (0) "" 8: iconv_mime_decode(): Unknown error (25) 8: iconv_strlen(): Unknown error (25) (0) "" 8: iconv_mime_decode(): Unknown error (25) 8: iconv_strlen(): Unknown error (25) (0) "" 8: iconv_mime_decode(): Unknown error (25) 8: iconv_strlen(): Unknown error (25) (0) "" 8: iconv_mime_decode(): Unknown error (25) 8: iconv_strlen(): Unknown error (25) (0) "" 8: iconv_mime_decode(): Unknown error (25) 8: iconv_strlen(): Unknown error (25) (0) "" 8: iconv_mime_decode(): Unknown error (25) 8: iconv_strlen(): Unknown error (25) (0) "" 8: iconv_mime_decode(): Unknown error (25) 8: iconv_strlen(): Unknown error (25) (0) "" 8: iconv_mime_decode(): Unknown error (25) 8: iconv_strlen(): Unknown error (25) (0) "" 8: iconv_mime_decode(): Unknown error (25) 8: iconv_strlen(): Unknown error (25) (0) "" 8: iconv_mime_decode(): Unknown error (25) 8: iconv_strlen(): Unknown error (25) (0) "" 8: iconv_mime_decode(): Unknown error (25) 8: iconv_strlen(): Unknown error (25) (0) "" 8: iconv_mime_decode(): Unknown error (25) 8: iconv_strlen(): Unknown error (25) (0) "" 8: iconv_mime_decode(): Unknown error (25) 8: iconv_strlen(): Unknown error (25) (0) "" 8: iconv_mime_decode(): Unknown error (25) 8: iconv_strlen(): Unknown error (25) (0) "" 8: iconv_mime_decode(): Unknown error (25) 8: iconv_strlen(): Unknown error (25) (0) "" 8: iconv_mime_decode(): Unknown error (25) 8: iconv_strlen(): Unknown error (25) (0) "" 8: iconv_mime_decode(): Unknown error (25) 8: iconv_strlen(): Unknown error (25) (0) "" 8: iconv_mime_decode(): Unknown error (25) 8: iconv_strlen(): Unknown error (25) (0) "" 8: iconv_mime_decode(): Unknown error (25) 8: iconv_strlen(): Unknown error (25) (0) "" ================================================================================ 001+ 8: iconv_mime_decode(): Unknown error (25) 002+ 8: iconv_strlen(): Unknown error (25) 003+ (0) "" 004+ 8: iconv_mime_decode(): Unknown error (25) 005+ 8: iconv_strlen(): Unknown error (25) 006+ (0) "" 007+ 8: iconv_mime_decode(): Unknown error (25) 008+ 8: iconv_strlen(): Unknown error (25) 009+ (0) "" 010+ 8: iconv_mime_decode(): Unknown error (25) 011+ 8: iconv_strlen(): Unknown error (25) 012+ (0) "" 013+ 8: iconv_mime_decode(): Unknown error (25) 014+ 8: iconv_strlen(): Unknown error (25) 015+ (0) "" 016+ 8: iconv_mime_decode(): Unknown error (25) 017+ 8: iconv_strlen(): Unknown error (25) 018+ (0) "" 019+ 8: iconv_mime_decode(): Unknown error (25) 020+ 8: iconv_strlen(): Unknown error (25) 021+ (0) "" 022+ 8: iconv_mime_decode(): Unknown error (25) 023+ 8: iconv_strlen(): Unknown error (25) 024+ (0) "" 025+ 8: iconv_mime_decode(): Unknown error (25) 026+ 8: iconv_strlen(): Unknown error (25) 027+ (0) "" 028+ 8: iconv_mime_decode(): Unknown error (25) 029+ 8: iconv_strlen(): Unknown error (25) 030+ (0) "" 031+ 8: iconv_mime_decode(): Unknown error (25) 032+ 8: iconv_strlen(): Unknown error (25) 033+ (0) "" 034+ 8: iconv_mime_decode(): Unknown error (25) 035+ 8: iconv_strlen(): Unknown error (25) 036+ (0) "" 037+ 8: iconv_mime_decode(): Unknown error (25) 038+ 8: iconv_strlen(): Unknown error (25) 039+ (0) "" 040+ 8: iconv_mime_decode(): Unknown error (25) 041+ 8: iconv_strlen(): Unknown error (25) 042+ (0) "" 043+ 8: iconv_mime_decode(): Unknown error (25) 044+ 8: iconv_strlen(): Unknown error (25) 045+ (0) "" 046+ 8: iconv_mime_decode(): Unknown error (25) 047+ 8: iconv_strlen(): Unknown error (25) 048+ (0) "" 049+ 8: iconv_mime_decode(): Unknown error (25) 050+ 8: iconv_strlen(): Unknown error (25) 051+ (0) "" 052+ 8: iconv_mime_decode(): Unknown error (25) 053+ 8: iconv_strlen(): Unknown error (25) 054+ (0) "" 055+ 8: iconv_mime_decode(): Unknown error (25) 056+ 8: iconv_strlen(): Unknown error (25) 057+ (0) "" 058+ 8: iconv_mime_decode(): Unknown error (25) 059+ 8: iconv_strlen(): Unknown error (25) 001- (31) "Subject: PrüfungPrüfungkůÔńÓlet" 002- (32) "Subject: Prüfung PrüfungkůÔńÓlet" 003- (31) "Subject: PrüfungPrüfungkůÔńÓlet" 004- 2: iconv_mime_decode(): Malformed string 006- (27) "From: サンプル文字列サンプル文字列日本語テキスト" 007- (31) "Subject: PrüfungPrüfungkůÔńÓlet" 008- (32) "Subject: Prüfung PrüfungkůÔńÓlet" 009- (100) "Subject: =?ISO-8859-1?Q?Pr=FCfung?==?ISO-8859-1*de_DE?Q?Pr=FCfung?==?ISO-8859-2?Q?k=F9=D4=F1=D3let?=" 010- 2: iconv_mime_decode(): Malformed string 011- (0) "" 012- (27) "From: サンプル文字列サンプル文字列日本語テキスト" 013- (31) "Subject: PrüfungPrüfungkůÔńÓlet" 014- (32) "Subject: Prüfung PrüfungkůÔńÓlet" 015- (31) "Subject: PrüfungPrüfungkůÔńÓlet" 016- (84) "Subject: Prüfung=?ISO-8859-1*de_DE?Q?Pr=FCfung?? =?ISO-8859-2?X?k=F9=D4=F1=D3let?=" 017- (27) "From: サンプル文字列サンプル文字列日本語テキスト" 018- (31) "Subject: PrüfungPrüfungkůÔńÓlet" 019- (32) "Subject: Prüfung PrüfungkůÔńÓlet" 020- (100) "Subject: =?ISO-8859-1?Q?Pr=FCfung?==?ISO-8859-1*de_DE?Q?Pr=FCfung?==?ISO-8859-2?Q?k=F9=D4=F1=D3let?=" 021- (84) "Subject: Prüfung=?ISO-8859-1*de_DE?Q?Pr=FCfung?? =?ISO-8859-2?X?k=F9=D4=F1=D3let?=" 022- (27) "From: サンプル文字列サンプル文字列日本語テキスト" ================================================================================ ================================================================================ /root/distr/php-5.2.4/ext/iconv/tests/iconv_mime_decode_headers.phpt ================================================================================ Notice: iconv_mime_decode_headers(): Unknown error (25) in /root/distr/php-5.2.4/ext/iconv/tests/iconv_mime_decode_headers.php on line 29 bool(false) ================================================================================ 001+ Notice: iconv_mime_decode_headers(): Unknown error (25) in /root/distr/php-5.2.4/ext/iconv/tests/iconv_mime_decode_headers.php on line 29 002+ bool(false) 001- array(17) { 002- ["Return-Path"]=> 003- string(57) "<internals-return-5651-***=***.example.com@lists.php.net>" 004- ["Received"]=> 005- array(3) { 006- [0]=> 007- string(259) "from pb1.pair.com (pb1.pair.com [16.92.131.4]) by ***.example.com (8.12.10/8.12.10/1970-09-30) with SMTP id hALLmpea023899 for <***@***.example.com>; Sat, 22 Jan 1970 06:48:51 +0900 (JST) (envelope-from internals-return-5651-***=***.example.com@lists.php.net)" 008- [1]=> 009- string(59) "(qmail 63472 invoked by uid 1010); 1 Jan 1970 0:00:00 -0000" 010- [2]=> 011- string(59) "(qmail 63459 invoked by uid 1010); 1 Jan 1970 0:00:00 -0000" 012- } 013- ["Mailing-List"]=> 014- string(50) "contact internals-help@lists.php.net; run by ezmlm" 015- ["Precedence"]=> 016- string(4) "bulk" 017- ["List-Help"]=> 018- string(37) "<mailto:internals-help@lists.php.net>" 019- ["List-Unsubscribe"]=> 020- string(44) "<mailto:internals-unsubscribe@lists.php.net>" 021- ["List-Post"]=> 022- string(32) "<mailto:internals@lists.php.net>" 023- ["Delivered-To"]=> 024- array(3) { 025- [0]=> 026- string(36) "mailing list internals@lists.php.net" 027- [1]=> 028- string(34) "ezmlm-scan-internals@lists.php.net" 029- [2]=> 030- string(29) "ezmlm-internals@lists.php.net" 031- } 032- ["Date"]=> 033- string(36) "Thu, 1 Jan 1970 00:00:00 -0000 (GMT)" 034- ["From"]=> 035- string(33) "*** *** *** <***@***.example.com>" 036- ["X-X-Sender"]=> 037- string(19) "***@***.example.com" 038- ["To"]=> 039- string(23) "internals@lists.php.net" 040- ["Message-Id"]=> 041- string(44) "<Pine.LNX.4.58.************@***.example.com>" 042- ["MIME-Version"]=> 043- string(3) "1.0" 044- ["Content-Type"]=> 045- string(28) "TEXT/PLAIN; charset=US-ASCII" 046- ["Subject"]=> 047- string(54) "[PHP-DEV] [ICONV] test for iconv mime decode headers()" 048- ["X-UIDL"]=> 049- string(20) "@eH!!h2:!!EOS!!A_c"!" 050- } ================================================================================ ================================================================================ /root/distr/php-5.2.4/ext/iconv/tests/iconv_mime_encode.phpt ================================================================================ -------- line length=0 2: iconv_mime_encode(): Buffer length exceeded bool(false) -------- -------- line length=1 2: iconv_mime_encode(): Buffer length exceeded bool(false) -------- -------- line length=2 2: iconv_mime_encode(): Buffer length exceeded bool(false) -------- -------- line length=3 2: iconv_mime_encode(): Buffer length exceeded bool(false) -------- -------- line length=4 2: iconv_mime_encode(): Buffer length exceeded bool(false) -------- -------- line length=5 2: iconv_mime_encode(): Buffer length exceeded bool(false) -------- -------- line length=6 2: iconv_mime_encode(): Buffer length exceeded bool(false) -------- -------- line length=7 2: iconv_mime_encode(): Buffer length exceeded bool(false) -------- -------- line length=8 2: iconv_mime_encode(): Buffer length exceeded bool(false) -------- -------- line length=9 2: iconv_mime_encode(): Buffer length exceeded bool(false) -------- -------- line length=10 2: iconv_mime_encode(): Buffer length exceeded bool(false) -------- -------- line length=11 2: iconv_mime_encode(): Buffer length exceeded bool(false) -------- -------- line length=12 2: iconv_mime_encode(): Buffer length exceeded bool(false) -------- -------- line length=13 2: iconv_mime_encode(): Buffer length exceeded bool(false) -------- -------- line length=14 2: iconv_mime_encode(): Buffer length exceeded bool(false) -------- -------- line length=15 2: iconv_mime_encode(): Buffer length exceeded bool(false) -------- -------- line length=16 2: iconv_mime_encode(): Buffer length exceeded bool(false) -------- -------- line length=17 2: iconv_mime_encode(): Buffer length exceeded bool(false) -------- -------- line length=18 2: iconv_mime_encode(): Buffer length exceeded bool(false) -------- -------- line length=19 2: iconv_mime_encode(): Buffer length exceeded bool(false) -------- -------- line length=20 2: iconv_mime_encode(): Buffer length exceeded bool(false) -------- -------- line length=21 2: iconv_mime_encode(): Buffer length exceeded bool(false) -------- -------- line length=22 2: iconv_mime_encode(): Buffer length exceeded bool(false) -------- -------- line length=23 2: iconv_mime_encode(): Buffer length exceeded bool(false) -------- -------- line length=24 8: iconv_mime_encode(): Unknown error (25) bool(false) -------- -------- line length=25 8: iconv_mime_encode(): Unknown error (25) bool(false) -------- -------- line length=26 8: iconv_mime_encode(): Unknown error (25) bool(false) -------- -------- line length=27 8: iconv_mime_encode(): Unknown error (25) bool(false) -------- -------- line length=28 8: iconv_mime_encode(): Unknown error (25) bool(false) -------- -------- line length=29 8: iconv_mime_encode(): Unknown error (25) bool(false) -------- -------- line length=30 8: iconv_mime_encode(): Unknown error (25) bool(false) -------- -------- line length=31 8: iconv_mime_encode(): Unknown error (25) bool(false) -------- -------- line length=32 8: iconv_mime_encode(): Unknown error (25) bool(false) -------- -------- line length=33 8: iconv_mime_encode(): Unknown error (25) bool(false) -------- -------- line length=34 8: iconv_mime_encode(): Unknown error (25) bool(false) -------- -------- line length=35 8: iconv_mime_encode(): Unknown error (25) bool(false) -------- -------- line length=36 8: iconv_mime_encode(): Unknown error (25) bool(false) -------- -------- line length=37 8: iconv_mime_encode(): Unknown error (25) bool(false) -------- -------- line length=38 8: iconv_mime_encode(): Unknown error (25) bool(false) -------- -------- line length=39 8: iconv_mime_encode(): Unknown error (25) bool(false) -------- -------- line length=40 8: iconv_mime_encode(): Unknown error (25) bool(false) -------- -------- line length=41 8: iconv_mime_encode(): Unknown error (25) bool(false) -------- -------- line length=42 8: iconv_mime_encode(): Unknown error (25) bool(false) -------- -------- line length=43 8: iconv_mime_encode(): Unknown error (25) bool(false) -------- -------- line length=44 8: iconv_mime_encode(): Unknown error (25) bool(false) -------- -------- line length=45 8: iconv_mime_encode(): Unknown error (25) bool(false) -------- -------- line length=46 8: iconv_mime_encode(): Unknown error (25) bool(false) -------- -------- line length=47 8: iconv_mime_encode(): Unknown error (25) bool(false) -------- -------- line length=48 8: iconv_mime_encode(): Unknown error (25) bool(false) -------- -------- line length=49 8: iconv_mime_encode(): Unknown error (25) bool(false) -------- -------- line length=50 8: iconv_mime_encode(): Unknown error (25) bool(false) -------- -------- line length=51 8: iconv_mime_encode(): Unknown error (25) bool(false) -------- -------- line length=52 8: iconv_mime_encode(): Unknown error (25) bool(false) -------- -------- line length=53 8: iconv_mime_encode(): Unknown error (25) bool(false) -------- -------- line length=54 8: iconv_mime_encode(): Unknown error (25) bool(false) -------- -------- line length=55 8: iconv_mime_encode(): Unknown error (25) bool(false) -------- -------- line length=56 8: iconv_mime_encode(): Unknown error (25) bool(false) -------- -------- line length=57 8: iconv_mime_encode(): Unknown error (25) bool(false) -------- -------- line length=58 8: iconv_mime_encode(): Unknown error (25) bool(false) -------- -------- line length=59 8: iconv_mime_encode(): Unknown error (25) bool(false) -------- -------- line length=60 8: iconv_mime_encode(): Unknown error (25) bool(false) -------- -------- line length=61 8: iconv_mime_encode(): Unknown error (25) bool(false) -------- -------- line length=62 8: iconv_mime_encode(): Unknown error (25) bool(false) -------- -------- line length=63 8: iconv_mime_encode(): Unknown error (25) bool(false) -------- -------- line length=64 8: iconv_mime_encode(): Unknown error (25) bool(false) -------- -------- line length=65 8: iconv_mime_encode(): Unknown error (25) bool(false) -------- -------- line length=66 8: iconv_mime_encode(): Unknown error (25) bool(false) -------- -------- line length=67 8: iconv_mime_encode(): Unknown error (25) bool(false) -------- -------- line length=68 8: iconv_mime_encode(): Unknown error (25) bool(false) -------- -------- line length=69 8: iconv_mime_encode(): Unknown error (25) bool(false) -------- -------- line length=70 8: iconv_mime_encode(): Unknown error (25) bool(false) -------- -------- line length=71 8: iconv_mime_encode(): Unknown error (25) bool(false) -------- -------- line length=72 8: iconv_mime_encode(): Unknown error (25) bool(false) -------- -------- line length=73 8: iconv_mime_encode(): Unknown error (25) bool(false) -------- -------- line length=74 8: iconv_mime_encode(): Unknown error (25) bool(false) -------- -------- line length=75 8: iconv_mime_encode(): Unknown error (25) bool(false) -------- -------- line length=76 8: iconv_mime_encode(): Unknown error (25) bool(false) -------- -------- line length=77 8: iconv_mime_encode(): Unknown error (25) bool(false) -------- -------- line length=78 8: iconv_mime_encode(): Unknown error (25) bool(false) -------- -------- line length=79 8: iconv_mime_encode(): Unknown error (25) bool(false) -------- ================================================================================ 098+ 8: iconv_mime_encode(): Unknown error (25) 098- 2: %s 102+ 8: iconv_mime_encode(): Unknown error (25) 102- 2: %s 106+ 8: iconv_mime_encode(): Unknown error (25) 106- 2: %s 110+ 8: iconv_mime_encode(): Unknown error (25) 110- 2: %s 114+ 8: iconv_mime_encode(): Unknown error (25) 114- 2: %s 118+ 8: iconv_mime_encode(): Unknown error (25) 118- 2: %s 122+ 8: iconv_mime_encode(): Unknown error (25) 122- 2: %s 126+ 8: iconv_mime_encode(): Unknown error (25) 126- 2: %s 130+ 8: iconv_mime_encode(): Unknown error (25) 130- 2: %s 134+ 8: iconv_mime_encode(): Unknown error (25) 134- 2: %s 138+ 8: iconv_mime_encode(): Unknown error (25) 138- 2: %s 142+ 8: iconv_mime_encode(): Unknown error (25) 142- 2: %s 146+ 8: iconv_mime_encode(): Unknown error (25) 147+ bool(false) 148+ -------- 149+ -------- line length=37 150+ 8: iconv_mime_encode(): Unknown error (25) 151+ bool(false) 152+ -------- 153+ -------- line length=38 154+ 8: iconv_mime_encode(): Unknown error (25) 155+ bool(false) 156+ -------- 157+ -------- line length=39 158+ 8: iconv_mime_encode(): Unknown error (25) 159+ bool(false) 160+ -------- 161+ -------- line length=40 162+ 8: iconv_mime_encode(): Unknown error (25) 163+ bool(false) 164+ -------- 165+ -------- line length=41 166+ 8: iconv_mime_encode(): Unknown error (25) 167+ bool(false) 168+ -------- 169+ -------- line length=42 170+ 8: iconv_mime_encode(): Unknown error (25) 171+ bool(false) 172+ -------- 173+ -------- line length=43 174+ 8: iconv_mime_encode(): Unknown error (25) 175+ bool(false) 176+ -------- 177+ -------- line length=44 178+ 8: iconv_mime_encode(): Unknown error (25) 179+ bool(false) 180+ -------- 181+ -------- line length=45 182+ 8: iconv_mime_encode(): Unknown error (25) 183+ bool(false) 184+ -------- 185+ -------- line length=46 186+ 8: iconv_mime_encode(): Unknown error (25) 187+ bool(false) 188+ -------- 189+ -------- line length=47 190+ 8: iconv_mime_encode(): Unknown error (25) 191+ bool(false) 192+ -------- 193+ -------- line length=48 194+ 8: iconv_mime_encode(): Unknown error (25) 195+ bool(false) 196+ -------- 197+ -------- line length=49 198+ 8: iconv_mime_encode(): Unknown error (25) 199+ bool(false) 200+ -------- 201+ -------- line length=50 202+ 8: iconv_mime_encode(): Unknown error (25) 203+ bool(false) 204+ -------- 205+ -------- line length=51 206+ 8: iconv_mime_encode(): Unknown error (25) 207+ bool(false) 208+ -------- 209+ -------- line length=52 210+ 8: iconv_mime_encode(): Unknown error (25) 211+ bool(false) 212+ -------- 213+ -------- line length=53 214+ 8: iconv_mime_encode(): Unknown error (25) 215+ bool(false) 216+ -------- 217+ -------- line length=54 218+ 8: iconv_mime_encode(): Unknown error (25) 219+ bool(false) 220+ -------- 221+ -------- line length=55 222+ 8: iconv_mime_encode(): Unknown error (25) 223+ bool(false) 224+ -------- 225+ -------- line length=56 226+ 8: iconv_mime_encode(): Unknown error (25) 227+ bool(false) 228+ -------- 229+ -------- line length=57 230+ 8: iconv_mime_encode(): Unknown error (25) 231+ bool(false) 232+ -------- 233+ -------- line length=58 234+ 8: iconv_mime_encode(): Unknown error (25) 235+ bool(false) 236+ -------- 237+ -------- line length=59 238+ 8: iconv_mime_encode(): Unknown error (25) 239+ bool(false) 240+ -------- 241+ -------- line length=60 242+ 8: iconv_mime_encode(): Unknown error (25) 243+ bool(false) 244+ -------- 245+ -------- line length=61 246+ 8: iconv_mime_encode(): Unknown error (25) 247+ bool(false) 248+ -------- 249+ -------- line length=62 250+ 8: iconv_mime_encode(): Unknown error (25) 251+ bool(false) 252+ -------- 253+ -------- line length=63 254+ 8: iconv_mime_encode(): Unknown error (25) 255+ bool(false) 256+ -------- 257+ -------- line length=64 258+ 8: iconv_mime_encode(): Unknown error (25) 259+ bool(false) 260+ -------- 261+ -------- line length=65 262+ 8: iconv_mime_encode(): Unknown error (25) 263+ bool(false) 264+ -------- 265+ -------- line length=66 266+ 8: iconv_mime_encode(): Unknown error (25) 267+ bool(false) 268+ -------- 269+ -------- line length=67 270+ 8: iconv_mime_encode(): Unknown error (25) 271+ bool(false) 272+ -------- 273+ -------- line length=68 274+ 8: iconv_mime_encode(): Unknown error (25) 275+ bool(false) 276+ -------- 277+ -------- line length=69 278+ 8: iconv_mime_encode(): Unknown error (25) 279+ bool(false) 280+ -------- 281+ -------- line length=70 282+ 8: iconv_mime_encode(): Unknown error (25) 283+ bool(false) 284+ -------- 285+ -------- line length=71 286+ 8: iconv_mime_encode(): Unknown error (25) 287+ bool(false) 288+ -------- 289+ -------- line length=72 290+ 8: iconv_mime_encode(): Unknown error (25) 291+ bool(false) 292+ -------- 293+ -------- line length=73 294+ 8: iconv_mime_encode(): Unknown error (25) 295+ bool(false) 296+ -------- 297+ -------- line length=74 298+ 8: iconv_mime_encode(): Unknown error (25) 299+ bool(false) 300+ -------- 301+ -------- line length=75 302+ 8: iconv_mime_encode(): Unknown error (25) 303+ bool(false) 304+ -------- 305+ -------- line length=76 306+ 8: iconv_mime_encode(): Unknown error (25) 307+ bool(false) 308+ -------- 309+ -------- line length=77 310+ 8: iconv_mime_encode(): Unknown error (25) 311+ bool(false) 312+ -------- 313+ -------- line length=78 314+ 8: iconv_mime_encode(): Unknown error (25) 315+ bool(false) 316+ -------- 317+ -------- line length=79 318+ 8: iconv_mime_encode(): Unknown error (25) 319+ bool(false) 320+ -------- 146- string(396) "From: =?ISO-2022-JP?B?GyRCJTUbKEI=?= 147- =?ISO-2022-JP?B?GyRCJXMlVxsoQg==?= 148- =?ISO-2022-JP?B?GyRCJWtKOBsoQg==?= 149- =?ISO-2022-JP?B?GyRCO3pOcxsoQg==?= 150- =?ISO-2022-JP?B?GyRCJTUlcxsoQg==?= 151- =?ISO-2022-JP?B?GyRCJVclaxsoQg==?= 152- =?ISO-2022-JP?B?GyRCSjg7ehsoQg==?= 153- =?ISO-2022-JP?B?GyRCTnNGfBsoQg==?= 154- =?ISO-2022-JP?B?GyRCS1w4bBsoQg==?= 155- =?ISO-2022-JP?B?GyRCJUYlLRsoQg==?= 156- =?ISO-2022-JP?B?GyRCJTklSBsoQg==?=" 157- -------- bool(true) 158- -------- line length=37 159- string(396) "From: =?ISO-2022-JP?B?GyRCJTUbKEI=?= 160- =?ISO-2022-JP?B?GyRCJXMlVxsoQg==?= 161- =?ISO-2022-JP?B?GyRCJWtKOBsoQg==?= 162- =?ISO-2022-JP?B?GyRCO3pOcxsoQg==?= 163- =?ISO-2022-JP?B?GyRCJTUlcxsoQg==?= 164- =?ISO-2022-JP?B?GyRCJVclaxsoQg==?= 165- =?ISO-2022-JP?B?GyRCSjg7ehsoQg==?= 166- =?ISO-2022-JP?B?GyRCTnNGfBsoQg==?= 167- =?ISO-2022-JP?B?GyRCS1w4bBsoQg==?= 168- =?ISO-2022-JP?B?GyRCJUYlLRsoQg==?= 169- =?ISO-2022-JP?B?GyRCJTklSBsoQg==?=" 170- -------- bool(true) 171- -------- line length=38 172- string(396) "From: =?ISO-2022-JP?B?GyRCJTUbKEI=?= 173- =?ISO-2022-JP?B?GyRCJXMlVxsoQg==?= 174- =?ISO-2022-JP?B?GyRCJWtKOBsoQg==?= 175- =?ISO-2022-JP?B?GyRCO3pOcxsoQg==?= 176- =?ISO-2022-JP?B?GyRCJTUlcxsoQg==?= 177- =?ISO-2022-JP?B?GyRCJVclaxsoQg==?= 178- =?ISO-2022-JP?B?GyRCSjg7ehsoQg==?= 179- =?ISO-2022-JP?B?GyRCTnNGfBsoQg==?= 180- =?ISO-2022-JP?B?GyRCS1w4bBsoQg==?= 181- =?ISO-2022-JP?B?GyRCJUYlLRsoQg==?= 182- =?ISO-2022-JP?B?GyRCJTklSBsoQg==?=" 183- -------- bool(true) 184- -------- line length=39 185- string(236) "From: =?ISO-2022-JP?B?GyRCJTUbKEI=?= 186- =?ISO-2022-JP?B?GyRCJXMlVyVrSjgbKEI=?= 187- =?ISO-2022-JP?B?GyRCO3pOcyU1JXMbKEI=?= 188- =?ISO-2022-JP?B?GyRCJVcla0o4O3obKEI=?= 189- =?ISO-2022-JP?B?GyRCTnNGfEtcOGwbKEI=?= 190- =?ISO-2022-JP?B?GyRCJUYlLSU5JUgbKEI=?=" 191- -------- bool(true) 192- -------- line length=40 193- string(236) "From: =?ISO-2022-JP?B?GyRCJTUlcxsoQg==?= 194- =?ISO-2022-JP?B?GyRCJVcla0o4O3obKEI=?= 195- =?ISO-2022-JP?B?GyRCTnMlNSVzJVcbKEI=?= 196- =?ISO-2022-JP?B?GyRCJWtKODt6TnMbKEI=?= 197- =?ISO-2022-JP?B?GyRCRnxLXDhsJUYbKEI=?= 198- =?ISO-2022-JP?B?GyRCJS0lOSVIGyhC?=" 199- -------- bool(true) 200- -------- line length=41 201- string(236) "From: =?ISO-2022-JP?B?GyRCJTUlcxsoQg==?= 202- =?ISO-2022-JP?B?GyRCJVcla0o4O3obKEI=?= 203- =?ISO-2022-JP?B?GyRCTnMlNSVzJVcbKEI=?= 204- =?ISO-2022-JP?B?GyRCJWtKODt6TnMbKEI=?= 205- =?ISO-2022-JP?B?GyRCRnxLXDhsJUYbKEI=?= 206- =?ISO-2022-JP?B?GyRCJS0lOSVIGyhC?=" 207- -------- bool(true) 208- -------- line length=42 209- string(236) "From: =?ISO-2022-JP?B?GyRCJTUlcxsoQg==?= 210- =?ISO-2022-JP?B?GyRCJVcla0o4O3obKEI=?= 211- =?ISO-2022-JP?B?GyRCTnMlNSVzJVcbKEI=?= 212- =?ISO-2022-JP?B?GyRCJWtKODt6TnMbKEI=?= 213- =?ISO-2022-JP?B?GyRCRnxLXDhsJUYbKEI=?= 214- =?ISO-2022-JP?B?GyRCJS0lOSVIGyhC?=" 215- -------- bool(true) 216- -------- line length=43 217- string(212) "From: =?ISO-2022-JP?B?GyRCJTUlcxsoQg==?= 218- =?ISO-2022-JP?B?GyRCJVcla0o4O3pOcxsoQg==?= 219- =?ISO-2022-JP?B?GyRCJTUlcyVXJWtKOBsoQg==?= 220- =?ISO-2022-JP?B?GyRCO3pOc0Z8S1w4bBsoQg==?= 221- =?ISO-2022-JP?B?GyRCJUYlLSU5JUgbKEI=?=" 222- -------- bool(true) 223- -------- line length=44 224- string(212) "From: =?ISO-2022-JP?B?GyRCJTUlcyVXJWsbKEI=?= 225- =?ISO-2022-JP?B?GyRCSjg7ek5zJTUlcxsoQg==?= 226- =?ISO-2022-JP?B?GyRCJVcla0o4O3pOcxsoQg==?= 227- =?ISO-2022-JP?B?GyRCRnxLXDhsJUYlLRsoQg==?= 228- =?ISO-2022-JP?B?GyRCJTklSBsoQg==?=" 229- -------- bool(true) 230- -------- line length=45 231- string(212) "From: =?ISO-2022-JP?B?GyRCJTUlcyVXJWsbKEI=?= 232- =?ISO-2022-JP?B?GyRCSjg7ek5zJTUlcxsoQg==?= 233- =?ISO-2022-JP?B?GyRCJVcla0o4O3pOcxsoQg==?= 234- =?ISO-2022-JP?B?GyRCRnxLXDhsJUYlLRsoQg==?= 235- =?ISO-2022-JP?B?GyRCJTklSBsoQg==?=" 236- -------- bool(true) 237- -------- line length=46 238- string(212) "From: =?ISO-2022-JP?B?GyRCJTUlcyVXJWsbKEI=?= 239- =?ISO-2022-JP?B?GyRCSjg7ek5zJTUlcxsoQg==?= 240- =?ISO-2022-JP?B?GyRCJVcla0o4O3pOcxsoQg==?= 241- =?ISO-2022-JP?B?GyRCRnxLXDhsJUYlLRsoQg==?= 242- =?ISO-2022-JP?B?GyRCJTklSBsoQg==?=" 243- -------- bool(true) 244- -------- line length=47 245- string(176) "From: =?ISO-2022-JP?B?GyRCJTUlcyVXJWsbKEI=?= 246- =?ISO-2022-JP?B?GyRCSjg7ek5zJTUlcyVXJWsbKEI=?= 247- =?ISO-2022-JP?B?GyRCSjg7ek5zRnxLXDhsJUYbKEI=?= 248- =?ISO-2022-JP?B?GyRCJS0lOSVIGyhC?=" 249- -------- bool(true) 250- -------- line length=48 251- string(180) "From: =?ISO-2022-JP?B?GyRCJTUlcyVXJWtKOBsoQg==?= 252- =?ISO-2022-JP?B?GyRCO3pOcyU1JXMlVyVrSjgbKEI=?= 253- =?ISO-2022-JP?B?GyRCO3pOc0Z8S1w4bCVGJS0bKEI=?= 254- =?ISO-2022-JP?B?GyRCJTklSBsoQg==?=" 255- -------- bool(true) 256- -------- line length=49 257- string(180) "From: =?ISO-2022-JP?B?GyRCJTUlcyVXJWtKOBsoQg==?= 258- =?ISO-2022-JP?B?GyRCO3pOcyU1JXMlVyVrSjgbKEI=?= 259- =?ISO-2022-JP?B?GyRCO3pOc0Z8S1w4bCVGJS0bKEI=?= 260- =?ISO-2022-JP?B?GyRCJTklSBsoQg==?=" 261- -------- bool(true) 262- -------- line length=50 263- string(180) "From: =?ISO-2022-JP?B?GyRCJTUlcyVXJWtKOBsoQg==?= 264- =?ISO-2022-JP?B?GyRCO3pOcyU1JXMlVyVrSjgbKEI=?= 265- =?ISO-2022-JP?B?GyRCO3pOc0Z8S1w4bCVGJS0bKEI=?= 266- =?ISO-2022-JP?B?GyRCJTklSBsoQg==?=" 267- -------- bool(true) 268- -------- line length=51 269- string(152) "From: =?ISO-2022-JP?B?GyRCJTUlcyVXJWtKOBsoQg==?= 270- =?ISO-2022-JP?B?GyRCO3pOcyU1JXMlVyVrSjg7ehsoQg==?= 271- =?ISO-2022-JP?B?GyRCTnNGfEtcOGwlRiUtJTklSBsoQg==?=" 272- -------- bool(true) 273- -------- line length=52 274- string(148) "From: =?ISO-2022-JP?B?GyRCJTUlcyVXJWtKODt6TnMbKEI=?= 275- =?ISO-2022-JP?B?GyRCJTUlcyVXJWtKODt6TnNGfBsoQg==?= 276- =?ISO-2022-JP?B?GyRCS1w4bCVGJS0lOSVIGyhC?=" 277- -------- bool(true) 278- -------- line length=53 279- string(148) "From: =?ISO-2022-JP?B?GyRCJTUlcyVXJWtKODt6TnMbKEI=?= 280- =?ISO-2022-JP?B?GyRCJTUlcyVXJWtKODt6TnNGfBsoQg==?= 281- =?ISO-2022-JP?B?GyRCS1w4bCVGJS0lOSVIGyhC?=" 282- -------- bool(true) 283- -------- line length=54 284- string(148) "From: =?ISO-2022-JP?B?GyRCJTUlcyVXJWtKODt6TnMbKEI=?= 285- =?ISO-2022-JP?B?GyRCJTUlcyVXJWtKODt6TnNGfBsoQg==?= 286- =?ISO-2022-JP?B?GyRCS1w4bCVGJS0lOSVIGyhC?=" 287- -------- bool(true) 288- -------- line length=55 289- string(148) "From: =?ISO-2022-JP?B?GyRCJTUlcyVXJWtKODt6TnMbKEI=?= 290- =?ISO-2022-JP?B?GyRCJTUlcyVXJWtKODt6TnNGfEtcOGwbKEI=?= 291- =?ISO-2022-JP?B?GyRCJUYlLSU5JUgbKEI=?=" 292- -------- bool(true) 293- -------- line length=56 294- string(148) "From: =?ISO-2022-JP?B?GyRCJTUlcyVXJWtKODt6TnMlNRsoQg==?= 295- =?ISO-2022-JP?B?GyRCJXMlVyVrSjg7ek5zRnxLXDhsJUYbKEI=?= 296- =?ISO-2022-JP?B?GyRCJS0lOSVIGyhC?=" 297- -------- bool(true) 298- -------- line length=57 299- string(148) "From: =?ISO-2022-JP?B?GyRCJTUlcyVXJWtKODt6TnMlNRsoQg==?= 300- =?ISO-2022-JP?B?GyRCJXMlVyVrSjg7ek5zRnxLXDhsJUYbKEI=?= 301- =?ISO-2022-JP?B?GyRCJS0lOSVIGyhC?=" 302- -------- bool(true) 303- -------- line length=58 304- string(148) "From: =?ISO-2022-JP?B?GyRCJTUlcyVXJWtKODt6TnMlNRsoQg==?= 305- =?ISO-2022-JP?B?GyRCJXMlVyVrSjg7ek5zRnxLXDhsJUYbKEI=?= 306- =?ISO-2022-JP?B?GyRCJS0lOSVIGyhC?=" 307- -------- bool(true) 308- -------- line length=59 309- string(152) "From: =?ISO-2022-JP?B?GyRCJTUlcyVXJWtKODt6TnMlNRsoQg==?= 310- =?ISO-2022-JP?B?GyRCJXMlVyVrSjg7ek5zRnxLXDhsJUYlLRsoQg==?= 311- =?ISO-2022-JP?B?GyRCJTklSBsoQg==?=" 312- -------- bool(true) 313- -------- line length=60 314- string(120) "From: =?ISO-2022-JP?B?GyRCJTUlcyVXJWtKODt6TnMlNSVzJVcbKEI=?= 315- =?ISO-2022-JP?B?GyRCJWtKODt6TnNGfEtcOGwlRiUtJTklSBsoQg==?=" 316- -------- bool(true) 317- -------- line length=61 318- string(120) "From: =?ISO-2022-JP?B?GyRCJTUlcyVXJWtKODt6TnMlNSVzJVcbKEI=?= 319- =?ISO-2022-JP?B?GyRCJWtKODt6TnNGfEtcOGwlRiUtJTklSBsoQg==?=" 320- -------- bool(true) 321- -------- line length=62 322- string(120) "From: =?ISO-2022-JP?B?GyRCJTUlcyVXJWtKODt6TnMlNSVzJVcbKEI=?= 323- =?ISO-2022-JP?B?GyRCJWtKODt6TnNGfEtcOGwlRiUtJTklSBsoQg==?=" 324- -------- bool(true) 325- -------- line length=63 326- string(120) "From: =?ISO-2022-JP?B?GyRCJTUlcyVXJWtKODt6TnMlNSVzJVcbKEI=?= 327- =?ISO-2022-JP?B?GyRCJWtKODt6TnNGfEtcOGwlRiUtJTklSBsoQg==?=" 328- -------- bool(true) 329- -------- line length=64 330- string(120) "From: =?ISO-2022-JP?B?GyRCJTUlcyVXJWtKODt6TnMlNSVzJVclaxsoQg==?= 331- =?ISO-2022-JP?B?GyRCSjg7ek5zRnxLXDhsJUYlLSU5JUgbKEI=?=" 332- -------- bool(true) 333- -------- line length=65 334- string(120) "From: =?ISO-2022-JP?B?GyRCJTUlcyVXJWtKODt6TnMlNSVzJVclaxsoQg==?= 335- =?ISO-2022-JP?B?GyRCSjg7ek5zRnxLXDhsJUYlLSU5JUgbKEI=?=" 336- -------- bool(true) 337- -------- line length=66 338- string(120) "From: =?ISO-2022-JP?B?GyRCJTUlcyVXJWtKODt6TnMlNSVzJVclaxsoQg==?= 339- =?ISO-2022-JP?B?GyRCSjg7ek5zRnxLXDhsJUYlLSU5JUgbKEI=?=" 340- -------- bool(true) 341- -------- line length=67 342- string(120) "From: =?ISO-2022-JP?B?GyRCJTUlcyVXJWtKODt6TnMlNSVzJVclaxsoQg==?= 343- =?ISO-2022-JP?B?GyRCSjg7ek5zRnxLXDhsJUYlLSU5JUgbKEI=?=" 344- -------- bool(true) 345- -------- line length=68 346- string(120) "From: =?ISO-2022-JP?B?GyRCJTUlcyVXJWtKODt6TnMlNSVzJVcla0o4O3obKEI=?= 347- =?ISO-2022-JP?B?GyRCTnNGfEtcOGwlRiUtJTklSBsoQg==?=" 348- -------- bool(true) 349- -------- line length=69 350- string(120) "From: =?ISO-2022-JP?B?GyRCJTUlcyVXJWtKODt6TnMlNSVzJVcla0o4O3obKEI=?= 351- =?ISO-2022-JP?B?GyRCTnNGfEtcOGwlRiUtJTklSBsoQg==?=" 352- -------- bool(true) 353- -------- line length=70 354- string(120) "From: =?ISO-2022-JP?B?GyRCJTUlcyVXJWtKODt6TnMlNSVzJVcla0o4O3obKEI=?= 355- =?ISO-2022-JP?B?GyRCTnNGfEtcOGwlRiUtJTklSBsoQg==?=" 356- -------- bool(true) 357- -------- line length=71 358- string(120) "From: =?ISO-2022-JP?B?GyRCJTUlcyVXJWtKODt6TnMlNSVzJVcla0o4O3obKEI=?= 359- =?ISO-2022-JP?B?GyRCTnNGfEtcOGwlRiUtJTklSBsoQg==?=" 360- -------- bool(true) 361- -------- line length=72 362- string(120) "From: =?ISO-2022-JP?B?GyRCJTUlcyVXJWtKODt6TnMlNSVzJVcla0o4O3pOcxsoQg==?= 363- =?ISO-2022-JP?B?GyRCRnxLXDhsJUYlLSU5JUgbKEI=?=" 364- -------- bool(true) 365- -------- line length=73 366- string(120) "From: =?ISO-2022-JP?B?GyRCJTUlcyVXJWtKODt6TnMlNSVzJVcla0o4O3pOcxsoQg==?= 367- =?ISO-2022-JP?B?GyRCRnxLXDhsJUYlLSU5JUgbKEI=?=" 368- -------- bool(true) 369- -------- line length=74 370- string(120) "From: =?ISO-2022-JP?B?GyRCJTUlcyVXJWtKODt6TnMlNSVzJVcla0o4O3pOcxsoQg==?= 371- =?ISO-2022-JP?B?GyRCRnxLXDhsJUYlLSU5JUgbKEI=?=" 372- -------- bool(true) 373- -------- line length=75 374- string(120) "From: =?ISO-2022-JP?B?GyRCJTUlcyVXJWtKODt6TnMlNSVzJVcla0o4O3pOcxsoQg==?= 375- =?ISO-2022-JP?B?GyRCRnxLXDhsJUYlLSU5JUgbKEI=?=" 376- -------- bool(true) 377- -------- line length=76 378- string(120) "From: =?ISO-2022-JP?B?GyRCJTUlcyVXJWtKODt6TnMlNSVzJVcla0o4O3pOc0Z8S1wbKEI=?= 379- =?ISO-2022-JP?B?GyRCOGwlRiUtJTklSBsoQg==?=" 380- -------- bool(true) 381- -------- line length=77 382- string(120) "From: =?ISO-2022-JP?B?GyRCJTUlcyVXJWtKODt6TnMlNSVzJVcla0o4O3pOc0Z8S1wbKEI=?= 383- =?ISO-2022-JP?B?GyRCOGwlRiUtJTklSBsoQg==?=" 384- -------- bool(true) 385- -------- line length=78 386- string(120) "From: =?ISO-2022-JP?B?GyRCJTUlcyVXJWtKODt6TnMlNSVzJVcla0o4O3pOc0Z8S1wbKEI=?= 387- =?ISO-2022-JP?B?GyRCOGwlRiUtJTklSBsoQg==?=" 388- -------- bool(true) 389- -------- line length=79 390- string(120) "From: =?ISO-2022-JP?B?GyRCJTUlcyVXJWtKODt6TnMlNSVzJVcla0o4O3pOc0Z8S1wbKEI=?= 391- =?ISO-2022-JP?B?GyRCOGwlRiUtJTklSBsoQg==?=" 392- -------- bool(true) ================================================================================ ================================================================================ /root/distr/php-5.2.4/ext/iconv/tests/iconv_stream_filter.phpt ================================================================================ string(20) "1b244224332473244b24" string(10) "41244f1b28" string(2) "42" Warning: stream_filter_append(): unable to create or locate filter "convert.iconv.ISO-2022-JP/EUC-JP" in /root/distr/php-5.2.4/ext/iconv/tests/iconv_stream_filter.php on line 9 string(20) "1b244224332473244b24" string(10) "41244f1b28" string(2) "42" Warning: stream_filter_append(): unable to create or locate filter "convert.iconv.ISO-2022-JP/EUC-JP" in /root/distr/php-5.2.4/ext/iconv/tests/iconv_stream_filter.php on line 17 string(20) "1b244f24332466245824" string(10) "4e24421b28" string(2) "4f" ================================================================================ 004+ 005+ Warning: stream_filter_append(): unable to create or locate filter "convert.iconv.ISO-2022-JP/EUC-JP" in /root/distr/php-5.2.4/ext/iconv/tests/iconv_stream_filter.php on line 9 006+ string(20) "1b244224332473244b24" 007+ string(10) "41244f1b28" 008+ string(2) "42" 004- string(20) "a4b3a4f3a4cba4c1a4cf" 005- string(10) "69636f6e76" 006- string(2) "0a" 008- Warning: fread(): iconv stream filter ("ISO-2022-JP"=>"EUC-JP"): invalid multibyte sequence in %s on line %d 009- string(0) "" 010- string(0) "" 011- string(0) "" 010+ Warning: stream_filter_append(): unable to create or locate filter "convert.iconv.ISO-2022-JP/EUC-JP" in /root/distr/php-5.2.4/ext/iconv/tests/iconv_stream_filter.php on line 17 011+ string(20) "1b244f24332466245824" 012+ string(10) "4e24421b28" 013+ string(2) "4f" ================================================================================ ================================================================================ /root/distr/php-5.2.4/ext/iconv/tests/iconv_strlen.phpt ================================================================================ int(3) Notice: iconv_strlen(): Unknown error (25) in /root/distr/php-5.2.4/ext/iconv/tests/iconv_strlen.php on line 4 bool(false) int(13) Notice: iconv_strlen(): Unknown error (25) in /root/distr/php-5.2.4/ext/iconv/tests/iconv_strlen.php on line 4 bool(false) ================================================================================ 002+ 003+ Notice: iconv_strlen(): Unknown error (25) in /root/distr/php-5.2.4/ext/iconv/tests/iconv_strlen.php on line 4 004+ bool(false) 002- int(3) 004- int(10) 006+ 007+ Notice: iconv_strlen(): Unknown error (25) in /root/distr/php-5.2.4/ext/iconv/tests/iconv_strlen.php on line 4 008+ bool(false) ================================================================================ ================================================================================ /root/distr/php-5.2.4/ext/iconv/tests/iconv_strpos.phpt ================================================================================ 2: strpos(): Offset not contained in string. bool(false) 2: iconv_strpos(): Offset not contained in string. bool(false) 2: strpos(): Offset not contained in string. bool(false) 8: iconv_strpos(): Unknown error (25) bool(false) int(7) 8: iconv_strpos(): Unknown error (25) bool(false) int(16) 8: iconv_strpos(): Unknown error (25) bool(false) int(300) 8: iconv_strpos(): Unknown error (25) bool(false) int(302) 8: iconv_strpos(): Unknown error (25) bool(false) 8: iconv(): Unknown error (25) bool(false) 8: iconv_strpos(): Unknown error (25) bool(false) bool(false) 8: iconv_strpos(): Unknown error (25) bool(false) ================================================================================ 007+ 8: iconv_strpos(): Unknown error (25) 009- int(7) 010+ 8: iconv_strpos(): Unknown error (25) 011+ bool(false) 011- int(16) 013+ 8: iconv_strpos(): Unknown error (25) 014+ bool(false) 013- int(300) 015- int(151) 016- int(1) 017- int(300) 016+ 8: iconv_strpos(): Unknown error (25) 017+ bool(false) 019+ 8: iconv_strpos(): Unknown error (25) 020+ bool(false) 021+ 8: iconv(): Unknown error (25) 022+ bool(false) 023+ 8: iconv_strpos(): Unknown error (25) 024+ bool(false) 026+ 8: iconv_strpos(): Unknown error (25) ================================================================================ ================================================================================ /root/distr/php-5.2.4/ext/iconv/tests/iconv_strrpos.phpt ================================================================================ 8: iconv_strlen(): Unknown error (25) bool(false) 8: iconv_strrpos(): Unknown error (25) bool(false) 8: iconv_strlen(): Unknown error (25) bool(false) 8: iconv_strrpos(): Unknown error (25) bool(false) 8: iconv_strlen(): Unknown error (25) bool(false) 8: iconv_strrpos(): Unknown error (25) bool(false) 8: iconv(): Unknown error (25) 8: iconv_strlen(): Unknown error (25) bool(false) 8: iconv_strrpos(): Unknown error (25) bool(false) 8: iconv(): Unknown error (25) 8: iconv_strlen(): Unknown error (25) bool(false) 8: iconv_strrpos(): Unknown error (25) bool(false) 8: iconv(): Unknown error (25) 8: iconv_strlen(): Unknown error (25) bool(false) 8: iconv_strrpos(): Unknown error (25) bool(false) 8: iconv(): Unknown error (25) 8: iconv_strlen(): Unknown error (25) bool(false) 8: iconv_strrpos(): Unknown error (25) bool(false) 8: iconv(): Unknown error (25) 8: iconv_strlen(): Unknown error (25) bool(false) 8: iconv_strrpos(): Unknown error (25) bool(false) 8: iconv(): Unknown error (25) 8: iconv_strlen(): Unknown error (25) bool(false) 8: iconv_strrpos(): Unknown error (25) bool(false) 8: iconv(): Unknown error (25) 8: iconv_strlen(): Unknown error (25) bool(false) 8: iconv_strrpos(): Unknown error (25) bool(false) bool(false) 8: iconv_strrpos(): Unknown error (25) bool(false) ================================================================================ 001+ 8: iconv_strlen(): Unknown error (25) 002+ bool(false) 003+ 8: iconv_strrpos(): Unknown error (25) 004+ bool(false) 005+ 8: iconv_strlen(): Unknown error (25) 006+ bool(false) 007+ 8: iconv_strrpos(): Unknown error (25) 008+ bool(false) 009+ 8: iconv_strlen(): Unknown error (25) 010+ bool(false) 011+ 8: iconv_strrpos(): Unknown error (25) 012+ bool(false) 013+ 8: iconv(): Unknown error (25) 014+ 8: iconv_strlen(): Unknown error (25) 015+ bool(false) 016+ 8: iconv_strrpos(): Unknown error (25) 017+ bool(false) 018+ 8: iconv(): Unknown error (25) 019+ 8: iconv_strlen(): Unknown error (25) 020+ bool(false) 021+ 8: iconv_strrpos(): Unknown error (25) 022+ bool(false) 023+ 8: iconv(): Unknown error (25) 024+ 8: iconv_strlen(): Unknown error (25) 025+ bool(false) 026+ 8: iconv_strrpos(): Unknown error (25) 027+ bool(false) 028+ 8: iconv(): Unknown error (25) 029+ 8: iconv_strlen(): Unknown error (25) 030+ bool(false) 031+ 8: iconv_strrpos(): Unknown error (25) 032+ bool(false) 033+ 8: iconv(): Unknown error (25) 034+ 8: iconv_strlen(): Unknown error (25) 035+ bool(false) 036+ 8: iconv_strrpos(): Unknown error (25) 037+ bool(false) 038+ 8: iconv(): Unknown error (25) 039+ 8: iconv_strlen(): Unknown error (25) 040+ bool(false) 041+ 8: iconv_strrpos(): Unknown error (25) 042+ bool(false) 043+ 8: iconv(): Unknown error (25) 044+ 8: iconv_strlen(): Unknown error (25) 045+ bool(false) 046+ 8: iconv_strrpos(): Unknown error (25) 047+ bool(false) 048+ bool(false) 049+ 8: iconv_strrpos(): Unknown error (25) 001- int(14) 002- int(9) 003- int(605) 004- int(300) 005- int(305) 006- int(151) 007- int(600) 009- int(601) 010- int(300) 011- int(602) 012- int(301) 013- int(603) 014- int(302) 015- int(604) 016- int(303) 017- int(605) 018- int(304) 019- int(606) 020- int(305) 021- bool(false) 022- bool(false) ================================================================================ ================================================================================ /root/distr/php-5.2.4/ext/iconv/tests/iconv_substr.phpt ================================================================================ 666768696a6b6c Notice: iconv_substr(): Unknown error (25) in /root/distr/php-5.2.4/ext/iconv/tests/iconv_substr.php on line 12 a6a4a8a4aaa4ab Notice: iconv_substr(): Unknown error (25) in /root/distr/php-5.2.4/ext/iconv/tests/iconv_substr.php on line 12 bool(false) Notice: iconv_substr(): Unknown error (25) in /root/distr/php-5.2.4/ext/iconv/tests/iconv_substr.php on line 18 bool(false) string(14) "This is a test" Notice: iconv_substr(): Unknown error (25) in /root/distr/php-5.2.4/ext/iconv/tests/iconv_substr.php on line 21 bool(false) string(3) "est" Notice: iconv_substr(): Unknown error (25) in /root/distr/php-5.2.4/ext/iconv/tests/iconv_substr.php on line 18 bool(false) string(5) "This " Notice: iconv_substr(): Unknown error (25) in /root/distr/php-5.2.4/ext/iconv/tests/iconv_substr.php on line 21 bool(false) bool(false) Notice: iconv_substr(): Unknown error (25) in /root/distr/php-5.2.4/ext/iconv/tests/iconv_substr.php on line 21 bool(false) bool(false) Notice: iconv_substr(): Unknown error (25) in /root/distr/php-5.2.4/ext/iconv/tests/iconv_substr.php on line 21 bool(false) Notice: iconv(): Unknown error (25) in /root/distr/php-5.2.4/ext/iconv/tests/iconv_substr.php on line 33 Notice: iconv_substr(): Unknown error (25) in /root/distr/php-5.2.4/ext/iconv/tests/iconv_substr.php on line 33 Notice: iconv(): Unknown error (25) in /root/distr/php-5.2.4/ext/iconv/tests/iconv_substr.php on line 33 bool(false) ================================================================================ 002+ 003+ Notice: iconv_substr(): Unknown error (25) in /root/distr/php-5.2.4/ext/iconv/tests/iconv_substr.php on line 12 004+ 002- 666768696a6b6c 004- a4aba4ada4afa4b1a4b3a4b5a4b7 006+ 007+ Notice: iconv_substr(): Unknown error (25) in /root/distr/php-5.2.4/ext/iconv/tests/iconv_substr.php on line 12 008+ 008- string(14) "This is a test" 010+ 011+ Notice: iconv_substr(): Unknown error (25) in /root/distr/php-5.2.4/ext/iconv/tests/iconv_substr.php on line 18 010- string(3) "est" 012- string(5) "This " 014+ 015+ Notice: iconv_substr(): Unknown error (25) in /root/distr/php-5.2.4/ext/iconv/tests/iconv_substr.php on line 21 016+ bool(false) 017- string(10) "¤Á¤Ï ISO-2" 018+ 019+ Notice: iconv_substr(): Unknown error (25) in /root/distr/php-5.2.4/ext/iconv/tests/iconv_substr.php on line 18 020+ bool(false) 022+ 023+ Notice: iconv_substr(): Unknown error (25) in /root/distr/php-5.2.4/ext/iconv/tests/iconv_substr.php on line 21 026+ 027+ Notice: iconv_substr(): Unknown error (25) in /root/distr/php-5.2.4/ext/iconv/tests/iconv_substr.php on line 21 030+ 031+ Notice: iconv_substr(): Unknown error (25) in /root/distr/php-5.2.4/ext/iconv/tests/iconv_substr.php on line 21 032+ bool(false) 033+ 034+ Notice: iconv(): Unknown error (25) in /root/distr/php-5.2.4/ext/iconv/tests/iconv_substr.php on line 33 035+ 036+ Notice: iconv_substr(): Unknown error (25) in /root/distr/php-5.2.4/ext/iconv/tests/iconv_substr.php on line 33 037+ 038+ Notice: iconv(): Unknown error (25) in /root/distr/php-5.2.4/ext/iconv/tests/iconv_substr.php on line 33 039+ bool(false) ================================================================================ ================================================================================ /root/distr/php-5.2.4/ext/iconv/tests/ob_iconv_handler.phpt ================================================================================ ¤¢¤¤¤¦¤¨¤ª ================================================================================ 001+ ¤¢¤¤¤¦¤¨¤ª 001- ‚ ‚¢‚¤‚¦‚¨ ================================================================================ ================================================================================ /root/distr/php-5.2.4/ext/spl/tests/spl_autoload_005.phpt ================================================================================ Strict Standards: Non-static method MyAutoLoader::autoLoad() cannot be called statically in /root/distr/php-5.2.4/ext/spl/tests/spl_autoload_005.php on line 19 Exception: Passed array specifies a non static method but no object MyAutoLoader::autoLoad(TestClass) MyAutoLoader::autoThrow(TestClass) Exception: Unavailable ===DONE=== ================================================================================ 001+ Strict Standards: Non-static method MyAutoLoader::autoLoad() cannot be called statically in /root/distr/php-5.2.4/ext/spl/tests/spl_autoload_005.php on line 19 ================================================================================ ================================================================================ /root/distr/php-5.2.4/ext/spl/tests/spl_autoload_007.phpt ================================================================================ string(22) "MyAutoLoader::notExist" Function 'MyAutoLoader::notExist' not found string(22) "MyAutoLoader::noAccess" Function 'MyAutoLoader::noAccess' not callable string(22) "MyAutoLoader::autoLoad" ok string(22) "MyAutoLoader::dynaLoad" Function 'MyAutoLoader::dynaLoad' not callable array(2) { [0]=> string(12) "MyAutoLoader" [1]=> string(8) "notExist" } MyAutoLoader::autoLoad(321o67vfigy0) MyAutoLoader::autoLoad(321o67vfigy0) Passed array does not specify an existing static method array(2) { [0]=> string(12) "MyAutoLoader" [1]=> string(8) "noAccess" } Passed array does not specify a callable static method array(2) { [0]=> string(12) "MyAutoLoader" [1]=> string(8) "autoLoad" } ok array(2) { [0]=> string(12) "MyAutoLoader" [1]=> string(8) "dynaLoad" } Strict Standards: Non-static method MyAutoLoader::dynaLoad() cannot be called statically in /root/distr/php-5.2.4/ext/spl/tests/spl_autoload_007.php on line 41 Passed array specifies a non static method but no object array(2) { [0]=> object(MyAutoLoader)#1 (0) { } [1]=> string(8) "notExist" } Passed array does not specify an existing method array(2) { [0]=> object(MyAutoLoader)#1 (0) { } [1]=> string(8) "noAccess" } Passed array does not specify a callable method array(2) { [0]=> object(MyAutoLoader)#1 (0) { } [1]=> string(8) "autoLoad" } ok array(2) { [0]=> object(MyAutoLoader)#1 (0) { } [1]=> string(8) "dynaLoad" } ok ===DONE=== ================================================================================ 019+ MyAutoLoader::autoLoad(321o67vfigy0) 020+ MyAutoLoader::autoLoad(321o67vfigy0) 045+ 046+ Strict Standards: Non-static method MyAutoLoader::dynaLoad() cannot be called statically in /root/distr/php-5.2.4/ext/spl/tests/spl_autoload_007.php on line 41 ================================================================================ ================================================================================ /root/distr/php-5.2.4/ext/spl/tests/spl_autoload_008.phpt ================================================================================ ====0==== string(10) "MyAutoLoad" registered MyAutoLoad(NoExistingTestClass) Exception: Bla int(0) ====1==== string(22) "MyAutoLoader::autoLoad" registered MyAutoLoader::autoLoad(NoExistingTestClass) Exception: Bla int(0) ====2==== string(22) "MyAutoLoader::dynaLoad" LogicException: Function 'MyAutoLoader::dynaLoad' not callable int(0) ====3==== array(2) { [0]=> string(12) "MyAutoLoader" [1]=> string(8) "autoLoad" } registered MyAutoLoader::autoLoad(NoExistingTestClass) Exception: Bla int(0) ====4==== array(2) { [0]=> string(12) "MyAutoLoader" [1]=> string(8) "dynaLoad" } Strict Standards: Non-static method MyAutoLoader::dynaLoad() cannot be called statically in /root/distr/php-5.2.4/ext/spl/tests/spl_autoload_008.php on line 43 LogicException: Passed array specifies a non static method but no object int(0) ====5==== array(2) { [0]=> object(MyAutoLoader)#1 (0) { } [1]=> string(8) "autoLoad" } registered MyAutoLoader::autoLoad(NoExistingTestClass) Exception: Bla int(0) ====6==== array(2) { [0]=> object(MyAutoLoader)#1 (0) { } [1]=> string(8) "dynaLoad" } registered MyAutoLoader::dynaLoad(NoExistingTestClass) Exception: Bla int(0) ===DONE=== ================================================================================ 035+ 036+ Strict Standards: Non-static method MyAutoLoader::dynaLoad() cannot be called statically in /root/distr/php-5.2.4/ext/spl/tests/spl_autoload_008.php on line 43 ================================================================================ ================================================================================ /root/distr/php-5.2.4/ext/standard/tests/array/bug35821.phpt ================================================================================ Warning: array_map(): An error occurred while invoking the map callback in /root/distr/php-5.2.4/ext/standard/tests/array/bug35821.php on line 21 Fatal error: Uncaught exception 'Exception' in /root/distr/php-5.2.4/ext/standard/tests/array/bug35821.php:7 Stack trace: #0 /root/distr/php-5.2.4/ext/standard/tests/array/bug35821.php(12): Element->ThrowException() #1 /root/distr/php-5.2.4/ext/standard/tests/array/bug35821.php(17): Element::CallBack(Object(Element)) #2 {main} thrown in /root/distr/php-5.2.4/ext/standard/tests/array/bug35821.php on line 7 ================================================================================ 006+ #1 /root/distr/php-5.2.4/ext/standard/tests/array/bug35821.php(17): Element::CallBack(Object(Element)) 007+ #2 {main} 006- #1 [internal function]: Element::CallBack(Object(Element)) 007- #2 %s(%d): array_map(Array, Array) 008- #3 {main} ================================================================================ ================================================================================ /root/distr/php-5.2.4/ext/standard/tests/file/bug38450_2.phpt ================================================================================ Warning: Missing argument 1 for VariableStream::__construct() in /root/distr/php-5.2.4/ext/standard/tests/file/bug38450_2.php on line 7 Warning: fopen(var://myvar): failed to open stream: "VariableStream::stream_open" call failed in /root/distr/php-5.2.4/ext/standard/tests/file/bug38450_2.php on line 101 Fatal error: Uncaught exception 'Exception' with message 'constructor' in /root/distr/php-5.2.4/ext/standard/tests/file/bug38450_2.php:8 Stack trace: #0 /root/distr/php-5.2.4/ext/standard/tests/file/bug38450_2.php(86): VariableStream->__construct() #1 {main} thrown in /root/distr/php-5.2.4/ext/standard/tests/file/bug38450_2.php on line 8 ================================================================================ 007+ #0 /root/distr/php-5.2.4/ext/standard/tests/file/bug38450_2.php(86): VariableStream->__construct() 008+ #1 {main} 007- #0 [internal function]: VariableStream->__construct() 008- #1 %s(%d): fopen('var://myvar', 'r+') 009- #2 {main} ================================================================================ ================================================================================ /root/distr/php-5.2.4/ext/standard/tests/file/proc_open01.phpt ================================================================================ array(2) { [0]=> resource(4) of type (stream) [1]=> resource(5) of type (stream) } terminated after 1000 iterations string(0) "" array(3) { [0]=> int(1) [1]=> int(2) [2]=> int(3) } ================================================================================ 007+ terminated after 1000 iterations 008+ string(0) "" 007- string(5) "yay! 008- " ================================================================================ ================================================================================ /root/distr/php-5.2.4/ext/standard/tests/general_functions/is_callable.phpt ================================================================================ *** Testing is_callable() on defined functions *** -- Iteration 1 -- bool(true) bool(true) bool(true) bool(true) bool(true) someFunction -- Iteration 2 -- bool(true) bool(true) bool(true) bool(true) bool(true) x123 -- Iteration 3 -- bool(true) bool(true) bool(true) bool(true) bool(true) NULL -- Iteration 4 -- bool(true) bool(true) bool(true) bool(true) bool(true) false -- Iteration 5 -- bool(true) bool(true) bool(true) bool(true) bool(true) Hello_World *** Testing is_callable() on undefined functions *** -- Iteration 1 -- bool(false) bool(true) bool(true) bool(false) bool(false) -- Iteration 2 -- bool(false) bool(true) bool(true) bool(false) bool(false) -- Iteration 3 -- bool(false) bool(true) bool(true) bool(false) bool(false) -- Iteration 4 -- bool(false) bool(true) bool(true) bool(false) bool(false) -- Iteration 5 -- bool(false) bool(true) bool(true) bool(false) bool(false) 12356 -- Iteration 6 -- bool(false) bool(true) bool(true) bool(false) bool(false) -- Iteration 7 -- bool(false) bool(true) bool(true) bool(false) bool(false) \0 -- Iteration 8 -- bool(false) bool(true) bool(true) bool(false) bool(false) hello world -- Iteration 9 -- bool(false) bool(true) bool(true) bool(false) bool(false) hello world -- Iteration 10 -- bool(false) bool(true) bool(true) bool(false) bool(false) welcome -- Iteration 11 -- bool(false) bool(true) bool(true) bool(false) bool(false) welcome\0 -- Iteration 12 -- bool(false) bool(true) bool(true) bool(false) bool(false) ==%%%***$$$@@@!! -- Iteration 13 -- bool(true) bool(true) bool(true) bool(true) bool(true) false -- Iteration 14 -- bool(false) bool(true) bool(true) bool(false) bool(false) 8 -- Iteration 15 -- bool(false) bool(true) bool(true) bool(false) bool(false) \t -- Iteration 16 -- bool(false) bool(true) bool(true) bool(false) bool(false) \007 -- Iteration 17 -- bool(false) bool(true) bool(true) bool(false) bool(false) 123 -- Iteration 18 -- bool(false) bool(true) bool(true) bool(false) bool(false) echo() *** Testing is_callable() on objects *** ** Testing behavior of is_callable() on static methods ** bool(true) bool(false) ** Testing normal operations of is_callable() on objects ** --- Outerloop iteration 1 --- -- Innerloop iteration 1 of Outerloop iteration 1 -- bool(true) bool(true) bool(true) bool(true) bool(true) object_class::foo1 -- Innerloop iteration 2 of Outerloop iteration 1 -- bool(false) bool(true) bool(false) bool(true) bool(false) object_class::foo2 -- Innerloop iteration 3 of Outerloop iteration 1 -- bool(false) bool(true) bool(false) bool(true) bool(false) object_class::foo3 -- Innerloop iteration 4 of Outerloop iteration 1 -- bool(true) bool(true) bool(true) bool(true) bool(true) object_class::x123 -- Innerloop iteration 5 of Outerloop iteration 1 -- bool(true) bool(true) bool(true) bool(true) bool(true) object_class::null -- Innerloop iteration 6 of Outerloop iteration 1 -- bool(true) bool(true) bool(true) bool(true) bool(true) object_class::TRUE -- Innerloop iteration 7 of Outerloop iteration 1 -- bool(false) bool(true) bool(false) bool(true) bool(false) object_class::123 -- Innerloop iteration 8 of Outerloop iteration 1 -- bool(false) bool(false) bool(false) bool(false) bool(false) Array -- Innerloop iteration 9 of Outerloop iteration 1 -- bool(false) bool(true) bool(false) bool(true) bool(false) object_class::func -- Innerloop iteration 10 of Outerloop iteration 1 -- Strict Standards: Non-static method object_class::foo1() cannot be called statically in /root/distr/php-5.2.4/ext/standard/tests/general_functions/is_callable.php on line 35 Strict Standards: Non-static method object_class::foo1() cannot be called statically in /root/distr/php-5.2.4/ext/standard/tests/general_functions/is_callable.php on line 35 bool(true) Strict Standards: Non-static method object_class::foo1() cannot be called statically in /root/distr/php-5.2.4/ext/standard/tests/general_functions/is_callable.php on line 36 bool(true) Strict Standards: Non-static method object_class::foo1() cannot be called statically in /root/distr/php-5.2.4/ext/standard/tests/general_functions/is_callable.php on line 37 Strict Standards: Non-static method object_class::foo1() cannot be called statically in /root/distr/php-5.2.4/ext/standard/tests/general_functions/is_callable.php on line 37 bool(true) Strict Standards: Non-static method object_class::foo1() cannot be called statically in /root/distr/php-5.2.4/ext/standard/tests/general_functions/is_callable.php on line 38 bool(true) Strict Standards: Non-static method object_class::foo1() cannot be called statically in /root/distr/php-5.2.4/ext/standard/tests/general_functions/is_callable.php on line 39 Strict Standards: Non-static method object_class::foo1() cannot be called statically in /root/distr/php-5.2.4/ext/standard/tests/general_functions/is_callable.php on line 39 bool(true) object_class::foo1 --- Outerloop iteration 2 --- -- Innerloop iteration 1 of Outerloop iteration 2 -- bool(false) bool(true) bool(false) bool(true) bool(false) no_member_class::foo1 -- Innerloop iteration 2 of Outerloop iteration 2 -- bool(false) bool(true) bool(false) bool(true) bool(false) no_member_class::foo2 -- Innerloop iteration 3 of Outerloop iteration 2 -- bool(false) bool(true) bool(false) bool(true) bool(false) no_member_class::foo3 -- Innerloop iteration 4 of Outerloop iteration 2 -- bool(false) bool(true) bool(false) bool(true) bool(false) no_member_class::x123 -- Innerloop iteration 5 of Outerloop iteration 2 -- bool(false) bool(true) bool(false) bool(true) bool(false) no_member_class::null -- Innerloop iteration 6 of Outerloop iteration 2 -- bool(false) bool(true) bool(false) bool(true) bool(false) no_member_class::TRUE -- Innerloop iteration 7 of Outerloop iteration 2 -- bool(false) bool(true) bool(false) bool(true) bool(false) no_member_class::123 -- Innerloop iteration 8 of Outerloop iteration 2 -- bool(false) bool(false) bool(false) bool(false) bool(false) Array -- Innerloop iteration 9 of Outerloop iteration 2 -- bool(false) bool(true) bool(false) bool(true) bool(false) no_member_class::func -- Innerloop iteration 10 of Outerloop iteration 2 -- Strict Standards: Non-static method object_class::foo1() cannot be called statically in /root/distr/php-5.2.4/ext/standard/tests/general_functions/is_callable.php on line 35 Strict Standards: Non-static method object_class::foo1() cannot be called statically in /root/distr/php-5.2.4/ext/standard/tests/general_functions/is_callable.php on line 35 bool(true) Strict Standards: Non-static method object_class::foo1() cannot be called statically in /root/distr/php-5.2.4/ext/standard/tests/general_functions/is_callable.php on line 36 bool(true) Strict Standards: Non-static method object_class::foo1() cannot be called statically in /root/distr/php-5.2.4/ext/standard/tests/general_functions/is_callable.php on line 37 Strict Standards: Non-static method object_class::foo1() cannot be called statically in /root/distr/php-5.2.4/ext/standard/tests/general_functions/is_callable.php on line 37 bool(true) Strict Standards: Non-static method object_class::foo1() cannot be called statically in /root/distr/php-5.2.4/ext/standard/tests/general_functions/is_callable.php on line 38 bool(true) Strict Standards: Non-static method object_class::foo1() cannot be called statically in /root/distr/php-5.2.4/ext/standard/tests/general_functions/is_callable.php on line 39 Strict Standards: Non-static method object_class::foo1() cannot be called statically in /root/distr/php-5.2.4/ext/standard/tests/general_functions/is_callable.php on line 39 bool(true) object_class::foo1 --- Outerloop iteration 3 --- -- Innerloop iteration 1 of Outerloop iteration 3 -- bool(false) bool(true) bool(false) bool(true) bool(false) contains_object_class::foo1 -- Innerloop iteration 2 of Outerloop iteration 3 -- bool(false) bool(true) bool(false) bool(true) bool(false) contains_object_class::foo2 -- Innerloop iteration 3 of Outerloop iteration 3 -- bool(false) bool(true) bool(false) bool(true) bool(false) contains_object_class::foo3 -- Innerloop iteration 4 of Outerloop iteration 3 -- bool(false) bool(true) bool(false) bool(true) bool(false) contains_object_class::x123 -- Innerloop iteration 5 of Outerloop iteration 3 -- bool(false) bool(true) bool(false) bool(true) bool(false) contains_object_class::null -- Innerloop iteration 6 of Outerloop iteration 3 -- bool(false) bool(true) bool(false) bool(true) bool(false) contains_object_class::TRUE -- Innerloop iteration 7 of Outerloop iteration 3 -- bool(false) bool(true) bool(false) bool(true) bool(false) contains_object_class::123 -- Innerloop iteration 8 of Outerloop iteration 3 -- bool(false) bool(false) bool(false) bool(false) bool(false) Array -- Innerloop iteration 9 of Outerloop iteration 3 -- bool(true) bool(true) bool(true) bool(true) bool(true) contains_object_class::func -- Innerloop iteration 10 of Outerloop iteration 3 -- Strict Standards: Non-static method object_class::foo1() cannot be called statically in /root/distr/php-5.2.4/ext/standard/tests/general_functions/is_callable.php on line 35 Strict Standards: Non-static method object_class::foo1() cannot be called statically in /root/distr/php-5.2.4/ext/standard/tests/general_functions/is_callable.php on line 35 bool(true) Strict Standards: Non-static method object_class::foo1() cannot be called statically in /root/distr/php-5.2.4/ext/standard/tests/general_functions/is_callable.php on line 36 bool(true) Strict Standards: Non-static method object_class::foo1() cannot be called statically in /root/distr/php-5.2.4/ext/standard/tests/general_functions/is_callable.php on line 37 Strict Standards: Non-static method object_class::foo1() cannot be called statically in /root/distr/php-5.2.4/ext/standard/tests/general_functions/is_callable.php on line 37 bool(true) Strict Standards: Non-static method object_class::foo1() cannot be called statically in /root/distr/php-5.2.4/ext/standard/tests/general_functions/is_callable.php on line 38 bool(true) Strict Standards: Non-static method object_class::foo1() cannot be called statically in /root/distr/php-5.2.4/ext/standard/tests/general_functions/is_callable.php on line 39 Strict Standards: Non-static method object_class::foo1() cannot be called statically in /root/distr/php-5.2.4/ext/standard/tests/general_functions/is_callable.php on line 39 bool(true) object_class::foo1 --- Outerloop iteration 4 --- -- Innerloop iteration 1 of Outerloop iteration 4 -- bool(false) bool(true) bool(false) bool(true) bool(false) contains_object_class::foo1 -- Innerloop iteration 2 of Outerloop iteration 4 -- bool(false) bool(true) bool(false) bool(true) bool(false) contains_object_class::foo2 -- Innerloop iteration 3 of Outerloop iteration 4 -- bool(false) bool(true) bool(false) bool(true) bool(false) contains_object_class::foo3 -- Innerloop iteration 4 of Outerloop iteration 4 -- bool(false) bool(true) bool(false) bool(true) bool(false) contains_object_class::x123 -- Innerloop iteration 5 of Outerloop iteration 4 -- bool(false) bool(true) bool(false) bool(true) bool(false) contains_object_class::null -- Innerloop iteration 6 of Outerloop iteration 4 -- bool(false) bool(true) bool(false) bool(true) bool(false) contains_object_class::TRUE -- Innerloop iteration 7 of Outerloop iteration 4 -- bool(false) bool(true) bool(false) bool(true) bool(false) contains_object_class::123 -- Innerloop iteration 8 of Outerloop iteration 4 -- bool(false) bool(false) bool(false) bool(false) bool(false) Array -- Innerloop iteration 9 of Outerloop iteration 4 -- bool(true) bool(true) bool(true) bool(true) bool(true) contains_object_class::func -- Innerloop iteration 10 of Outerloop iteration 4 -- Strict Standards: Non-static method object_class::foo1() cannot be called statically in /root/distr/php-5.2.4/ext/standard/tests/general_functions/is_callable.php on line 35 Strict Standards: Non-static method object_class::foo1() cannot be called statically in /root/distr/php-5.2.4/ext/standard/tests/general_functions/is_callable.php on line 35 bool(true) Strict Standards: Non-static method object_class::foo1() cannot be called statically in /root/distr/php-5.2.4/ext/standard/tests/general_functions/is_callable.php on line 36 bool(true) Strict Standards: Non-static method object_class::foo1() cannot be called statically in /root/distr/php-5.2.4/ext/standard/tests/general_functions/is_callable.php on line 37 Strict Standards: Non-static method object_class::foo1() cannot be called statically in /root/distr/php-5.2.4/ext/standard/tests/general_functions/is_callable.php on line 37 bool(true) Strict Standards: Non-static method object_class::foo1() cannot be called statically in /root/distr/php-5.2.4/ext/standard/tests/general_functions/is_callable.php on line 38 bool(true) Strict Standards: Non-static method object_class::foo1() cannot be called statically in /root/distr/php-5.2.4/ext/standard/tests/general_functions/is_callable.php on line 39 Strict Standards: Non-static method object_class::foo1() cannot be called statically in /root/distr/php-5.2.4/ext/standard/tests/general_functions/is_callable.php on line 39 bool(true) object_class::foo1 --- Outerloop iteration 5 --- -- Innerloop iteration 1 of Outerloop iteration 5 -- bool(true) bool(true) bool(true) bool(true) bool(true) object_class::foo1 -- Innerloop iteration 2 of Outerloop iteration 5 -- bool(false) bool(true) bool(false) bool(true) bool(false) object_class::foo2 -- Innerloop iteration 3 of Outerloop iteration 5 -- bool(false) bool(true) bool(false) bool(true) bool(false) object_class::foo3 -- Innerloop iteration 4 of Outerloop iteration 5 -- bool(true) bool(true) bool(true) bool(true) bool(true) object_class::x123 -- Innerloop iteration 5 of Outerloop iteration 5 -- bool(true) bool(true) bool(true) bool(true) bool(true) object_class::null -- Innerloop iteration 6 of Outerloop iteration 5 -- bool(true) bool(true) bool(true) bool(true) bool(true) object_class::TRUE -- Innerloop iteration 7 of Outerloop iteration 5 -- bool(false) bool(true) bool(false) bool(true) bool(false) object_class::123 -- Innerloop iteration 8 of Outerloop iteration 5 -- bool(false) bool(false) bool(false) bool(false) bool(false) Array -- Innerloop iteration 9 of Outerloop iteration 5 -- bool(false) bool(true) bool(false) bool(true) bool(false) object_class::func -- Innerloop iteration 10 of Outerloop iteration 5 -- Strict Standards: Non-static method object_class::foo1() cannot be called statically in /root/distr/php-5.2.4/ext/standard/tests/general_functions/is_callable.php on line 35 Strict Standards: Non-static method object_class::foo1() cannot be called statically in /root/distr/php-5.2.4/ext/standard/tests/general_functions/is_callable.php on line 35 bool(true) Strict Standards: Non-static method object_class::foo1() cannot be called statically in /root/distr/php-5.2.4/ext/standard/tests/general_functions/is_callable.php on line 36 bool(true) Strict Standards: Non-static method object_class::foo1() cannot be called statically in /root/distr/php-5.2.4/ext/standard/tests/general_functions/is_callable.php on line 37 Strict Standards: Non-static method object_class::foo1() cannot be called statically in /root/distr/php-5.2.4/ext/standard/tests/general_functions/is_callable.php on line 37 bool(true) Strict Standards: Non-static method object_class::foo1() cannot be called statically in /root/distr/php-5.2.4/ext/standard/tests/general_functions/is_callable.php on line 38 bool(true) Strict Standards: Non-static method object_class::foo1() cannot be called statically in /root/distr/php-5.2.4/ext/standard/tests/general_functions/is_callable.php on line 39 Strict Standards: Non-static method object_class::foo1() cannot be called statically in /root/distr/php-5.2.4/ext/standard/tests/general_functions/is_callable.php on line 39 bool(true) object_class::foo1 --- Outerloop iteration 6 --- -- Innerloop iteration 1 of Outerloop iteration 6 -- bool(false) bool(true) bool(false) bool(true) bool(false) no_member_class::foo1 -- Innerloop iteration 2 of Outerloop iteration 6 -- bool(false) bool(true) bool(false) bool(true) bool(false) no_member_class::foo2 -- Innerloop iteration 3 of Outerloop iteration 6 -- bool(false) bool(true) bool(false) bool(true) bool(false) no_member_class::foo3 -- Innerloop iteration 4 of Outerloop iteration 6 -- bool(false) bool(true) bool(false) bool(true) bool(false) no_member_class::x123 -- Innerloop iteration 5 of Outerloop iteration 6 -- bool(false) bool(true) bool(false) bool(true) bool(false) no_member_class::null -- Innerloop iteration 6 of Outerloop iteration 6 -- bool(false) bool(true) bool(false) bool(true) bool(false) no_member_class::TRUE -- Innerloop iteration 7 of Outerloop iteration 6 -- bool(false) bool(true) bool(false) bool(true) bool(false) no_member_class::123 -- Innerloop iteration 8 of Outerloop iteration 6 -- bool(false) bool(false) bool(false) bool(false) bool(false) Array -- Innerloop iteration 9 of Outerloop iteration 6 -- bool(false) bool(true) bool(false) bool(true) bool(false) no_member_class::func -- Innerloop iteration 10 of Outerloop iteration 6 -- Strict Standards: Non-static method object_class::foo1() cannot be called statically in /root/distr/php-5.2.4/ext/standard/tests/general_functions/is_callable.php on line 35 Strict Standards: Non-static method object_class::foo1() cannot be called statically in /root/distr/php-5.2.4/ext/standard/tests/general_functions/is_callable.php on line 35 bool(true) Strict Standards: Non-static method object_class::foo1() cannot be called statically in /root/distr/php-5.2.4/ext/standard/tests/general_functions/is_callable.php on line 36 bool(true) Strict Standards: Non-static method object_class::foo1() cannot be called statically in /root/distr/php-5.2.4/ext/standard/tests/general_functions/is_callable.php on line 37 Strict Standards: Non-static method object_class::foo1() cannot be called statically in /root/distr/php-5.2.4/ext/standard/tests/general_functions/is_callable.php on line 37 bool(true) Strict Standards: Non-static method object_class::foo1() cannot be called statically in /root/distr/php-5.2.4/ext/standard/tests/general_functions/is_callable.php on line 38 bool(true) Strict Standards: Non-static method object_class::foo1() cannot be called statically in /root/distr/php-5.2.4/ext/standard/tests/general_functions/is_callable.php on line 39 Strict Standards: Non-static method object_class::foo1() cannot be called statically in /root/distr/php-5.2.4/ext/standard/tests/general_functions/is_callable.php on line 39 bool(true) object_class::foo1 --- Outerloop iteration 7 --- -- Innerloop iteration 1 of Outerloop iteration 7 -- bool(true) bool(true) bool(true) bool(true) bool(true) object_class::foo1 -- Innerloop iteration 2 of Outerloop iteration 7 -- bool(false) bool(true) bool(false) bool(true) bool(false) object_class::foo2 -- Innerloop iteration 3 of Outerloop iteration 7 -- bool(false) bool(true) bool(false) bool(true) bool(false) object_class::foo3 -- Innerloop iteration 4 of Outerloop iteration 7 -- bool(true) bool(true) bool(true) bool(true) bool(true) object_class::x123 -- Innerloop iteration 5 of Outerloop iteration 7 -- bool(true) bool(true) bool(true) bool(true) bool(true) object_class::null -- Innerloop iteration 6 of Outerloop iteration 7 -- bool(true) bool(true) bool(true) bool(true) bool(true) object_class::TRUE -- Innerloop iteration 7 of Outerloop iteration 7 -- bool(false) bool(true) bool(false) bool(true) bool(false) object_class::123 -- Innerloop iteration 8 of Outerloop iteration 7 -- bool(false) bool(false) bool(false) bool(false) bool(false) Array -- Innerloop iteration 9 of Outerloop iteration 7 -- bool(false) bool(true) bool(false) bool(true) bool(false) object_class::func -- Innerloop iteration 10 of Outerloop iteration 7 -- Strict Standards: Non-static method object_class::foo1() cannot be called statically in /root/distr/php-5.2.4/ext/standard/tests/general_functions/is_callable.php on line 35 Strict Standards: Non-static method object_class::foo1() cannot be called statically in /root/distr/php-5.2.4/ext/standard/tests/general_functions/is_callable.php on line 35 bool(true) Strict Standards: Non-static method object_class::foo1() cannot be called statically in /root/distr/php-5.2.4/ext/standard/tests/general_functions/is_callable.php on line 36 bool(true) Strict Standards: Non-static method object_class::foo1() cannot be called statically in /root/distr/php-5.2.4/ext/standard/tests/general_functions/is_callable.php on line 37 Strict Standards: Non-static method object_class::foo1() cannot be called statically in /root/distr/php-5.2.4/ext/standard/tests/general_functions/is_callable.php on line 37 bool(true) Strict Standards: Non-static method object_class::foo1() cannot be called statically in /root/distr/php-5.2.4/ext/standard/tests/general_functions/is_callable.php on line 38 bool(true) Strict Standards: Non-static method object_class::foo1() cannot be called statically in /root/distr/php-5.2.4/ext/standard/tests/general_functions/is_callable.php on line 39 Strict Standards: Non-static method object_class::foo1() cannot be called statically in /root/distr/php-5.2.4/ext/standard/tests/general_functions/is_callable.php on line 39 bool(true) object_class::foo1 --- Outerloop iteration 8 --- -- Innerloop iteration 1 of Outerloop iteration 8 -- bool(false) bool(false) bool(false) bool(false) bool(false) Array -- Innerloop iteration 2 of Outerloop iteration 8 -- bool(false) bool(false) bool(false) bool(false) bool(false) Array -- Innerloop iteration 3 of Outerloop iteration 8 -- bool(false) bool(false) bool(false) bool(false) bool(false) Array -- Innerloop iteration 4 of Outerloop iteration 8 -- bool(false) bool(false) bool(false) bool(false) bool(false) Array -- Innerloop iteration 5 of Outerloop iteration 8 -- bool(false) bool(false) bool(false) bool(false) bool(false) Array -- Innerloop iteration 6 of Outerloop iteration 8 -- bool(false) bool(false) bool(false) bool(false) bool(false) Array -- Innerloop iteration 7 of Outerloop iteration 8 -- bool(false) bool(false) bool(false) bool(false) bool(false) Array -- Innerloop iteration 8 of Outerloop iteration 8 -- bool(false) bool(false) bool(false) bool(false) bool(false) Array -- Innerloop iteration 9 of Outerloop iteration 8 -- bool(false) bool(false) bool(false) bool(false) bool(false) Array -- Innerloop iteration 10 of Outerloop iteration 8 -- Strict Standards: Non-static method object_class::foo1() cannot be called statically in /root/distr/php-5.2.4/ext/standard/tests/general_functions/is_callable.php on line 35 Strict Standards: Non-static method object_class::foo1() cannot be called statically in /root/distr/php-5.2.4/ext/standard/tests/general_functions/is_callable.php on line 35 bool(true) Strict Standards: Non-static method object_class::foo1() cannot be called statically in /root/distr/php-5.2.4/ext/standard/tests/general_functions/is_callable.php on line 36 bool(true) Strict Standards: Non-static method object_class::foo1() cannot be called statically in /root/distr/php-5.2.4/ext/standard/tests/general_functions/is_callable.php on line 37 Strict Standards: Non-static method object_class::foo1() cannot be called statically in /root/distr/php-5.2.4/ext/standard/tests/general_functions/is_callable.php on line 37 bool(true) Strict Standards: Non-static method object_class::foo1() cannot be called statically in /root/distr/php-5.2.4/ext/standard/tests/general_functions/is_callable.php on line 38 bool(true) Strict Standards: Non-static method object_class::foo1() cannot be called statically in /root/distr/php-5.2.4/ext/standard/tests/general_functions/is_callable.php on line 39 Strict Standards: Non-static method object_class::foo1() cannot be called statically in /root/distr/php-5.2.4/ext/standard/tests/general_functions/is_callable.php on line 39 bool(true) object_class::foo1 *** Testing is_callable() on invalid function names *** -- Iteration 1 -- bool(false) bool(false) bool(false) bool(false) bool(false) -- Iteration 2 -- bool(false) bool(false) bool(false) bool(false) bool(false) 0 -- Iteration 3 -- bool(false) bool(false) bool(false) bool(false) bool(false) 1234567890 -- Iteration 4 -- bool(false) bool(false) bool(false) bool(false) bool(false) -100123456782 -- Iteration 5 -- bool(false) bool(false) bool(false) bool(false) bool(false) -2 -- Iteration 6 -- bool(false) bool(false) bool(false) bool(false) bool(false) 0.567 -- Iteration 7 -- bool(false) bool(false) bool(false) bool(false) bool(false) -- Iteration 8 -- bool(false) bool(false) bool(false) bool(false) bool(false) Array -- Iteration 9 -- bool(false) bool(false) bool(false) bool(false) bool(false) -- Iteration 10 -- bool(false) bool(false) bool(false) bool(false) bool(false) -- Iteration 11 -- bool(false) bool(false) bool(false) bool(false) bool(false) Resource id #5 *** Testing error conditions *** Warning: Wrong parameter count for is_callable() in /root/distr/php-5.2.4/ext/standard/tests/general_functions/is_callable.php on line 228 NULL Warning: Wrong parameter count for is_callable() in /root/distr/php-5.2.4/ext/standard/tests/general_functions/is_callable.php on line 230 NULL Done ================================================================================ 240+ 241+ Strict Standards: Non-static method object_class::foo1() cannot be called statically in /root/distr/php-5.2.4/ext/standard/tests/general_functions/is_callable.php on line 35 240- bool(true) 245- bool(true) 246+ 247+ Strict Standards: Non-static method object_class::foo1() cannot be called statically in /root/distr/php-5.2.4/ext/standard/tests/general_functions/is_callable.php on line 37 251+ 252+ Strict Standards: Non-static method object_class::foo1() cannot be called statically in /root/distr/php-5.2.4/ext/standard/tests/general_functions/is_callable.php on line 38 253+ bool(true) 254+ 255+ Strict Standards: Non-static method object_class::foo1() cannot be called statically in /root/distr/php-5.2.4/ext/standard/tests/general_functions/is_callable.php on line 39 256+ 257+ Strict Standards: Non-static method object_class::foo1() cannot be called statically in /root/distr/php-5.2.4/ext/standard/tests/general_functions/is_callable.php on line 39 258+ bool(true) 317- bool(true) 322- bool(true) 327+ 328+ Strict Standards: Non-static method object_class::foo1() cannot be called statically in /root/distr/php-5.2.4/ext/standard/tests/general_functions/is_callable.php on line 35 333+ 334+ Strict Standards: Non-static method object_class::foo1() cannot be called statically in /root/distr/php-5.2.4/ext/standard/tests/general_functions/is_callable.php on line 37 338+ 339+ Strict Standards: Non-static method object_class::foo1() cannot be called statically in /root/distr/php-5.2.4/ext/standard/tests/general_functions/is_callable.php on line 38 340+ bool(true) 341+ 342+ Strict Standards: Non-static method object_class::foo1() cannot be called statically in /root/distr/php-5.2.4/ext/standard/tests/general_functions/is_callable.php on line 39 343+ 344+ Strict Standards: Non-static method object_class::foo1() cannot be called statically in /root/distr/php-5.2.4/ext/standard/tests/general_functions/is_callable.php on line 39 345+ bool(true) 394- bool(true) 399- bool(true) 414+ 415+ Strict Standards: Non-static method object_class::foo1() cannot be called statically in /root/distr/php-5.2.4/ext/standard/tests/general_functions/is_callable.php on line 35 420+ 421+ Strict Standards: Non-static method object_class::foo1() cannot be called statically in /root/distr/php-5.2.4/ext/standard/tests/general_functions/is_callable.php on line 37 425+ 426+ Strict Standards: Non-static method object_class::foo1() cannot be called statically in /root/distr/php-5.2.4/ext/standard/tests/general_functions/is_callable.php on line 38 427+ bool(true) 428+ 429+ Strict Standards: Non-static method object_class::foo1() cannot be called statically in /root/distr/php-5.2.4/ext/standard/tests/general_functions/is_callable.php on line 39 430+ 431+ Strict Standards: Non-static method object_class::foo1() cannot be called statically in /root/distr/php-5.2.4/ext/standard/tests/general_functions/is_callable.php on line 39 432+ bool(true) 471- bool(true) 476- bool(true) 501+ 502+ Strict Standards: Non-static method object_class::foo1() cannot be called statically in /root/distr/php-5.2.4/ext/standard/tests/general_functions/is_callable.php on line 35 507+ 508+ Strict Standards: Non-static method object_class::foo1() cannot be called statically in /root/distr/php-5.2.4/ext/standard/tests/general_functions/is_callable.php on line 37 512+ 513+ Strict Standards: Non-static method object_class::foo1() cannot be called statically in /root/distr/php-5.2.4/ext/standard/tests/general_functions/is_callable.php on line 38 514+ bool(true) 515+ 516+ Strict Standards: Non-static method object_class::foo1() cannot be called statically in /root/distr/php-5.2.4/ext/standard/tests/general_functions/is_callable.php on line 39 517+ 518+ Strict Standards: Non-static method object_class::foo1() cannot be called statically in /root/distr/php-5.2.4/ext/standard/tests/general_functions/is_callable.php on line 39 519+ bool(true) 548- bool(true) 553- bool(true) 588+ 589+ Strict Standards: Non-static method object_class::foo1() cannot be called statically in /root/distr/php-5.2.4/ext/standard/tests/general_functions/is_callable.php on line 35 594+ 595+ Strict Standards: Non-static method object_class::foo1() cannot be called statically in /root/distr/php-5.2.4/ext/standard/tests/general_functions/is_callable.php on line 37 599+ 600+ Strict Standards: Non-static method object_class::foo1() cannot be called statically in /root/distr/php-5.2.4/ext/standard/tests/general_functions/is_callable.php on line 38 601+ bool(true) 602+ 603+ Strict Standards: Non-static method object_class::foo1() cannot be called statically in /root/distr/php-5.2.4/ext/standard/tests/general_functions/is_callable.php on line 39 604+ 605+ Strict Standards: Non-static method object_class::foo1() cannot be called statically in /root/distr/php-5.2.4/ext/standard/tests/general_functions/is_callable.php on line 39 606+ bool(true) 625- bool(true) 630- bool(true) 675+ 676+ Strict Standards: Non-static method object_class::foo1() cannot be called statically in /root/distr/php-5.2.4/ext/standard/tests/general_functions/is_callable.php on line 35 681+ 682+ Strict Standards: Non-static method object_class::foo1() cannot be called statically in /root/distr/php-5.2.4/ext/standard/tests/general_functions/is_callable.php on line 37 686+ 687+ Strict Standards: Non-static method object_class::foo1() cannot be called statically in /root/distr/php-5.2.4/ext/standard/tests/general_functions/is_callable.php on line 38 688+ bool(true) 689+ 690+ Strict Standards: Non-static method object_class::foo1() cannot be called statically in /root/distr/php-5.2.4/ext/standard/tests/general_functions/is_callable.php on line 39 691+ 692+ Strict Standards: Non-static method object_class::foo1() cannot be called statically in /root/distr/php-5.2.4/ext/standard/tests/general_functions/is_callable.php on line 39 693+ bool(true) 702- bool(true) 707- bool(true) 762+ 763+ Strict Standards: Non-static method object_class::foo1() cannot be called statically in /root/distr/php-5.2.4/ext/standard/tests/general_functions/is_callable.php on line 35 768+ 769+ Strict Standards: Non-static method object_class::foo1() cannot be called statically in /root/distr/php-5.2.4/ext/standard/tests/general_functions/is_callable.php on line 37 773+ 774+ Strict Standards: Non-static method object_class::foo1() cannot be called statically in /root/distr/php-5.2.4/ext/standard/tests/general_functions/is_callable.php on line 38 775+ bool(true) 776+ 777+ Strict Standards: Non-static method object_class::foo1() cannot be called statically in /root/distr/php-5.2.4/ext/standard/tests/general_functions/is_callable.php on line 39 778+ 779+ Strict Standards: Non-static method object_class::foo1() cannot be called statically in /root/distr/php-5.2.4/ext/standard/tests/general_functions/is_callable.php on line 39 780+ bool(true) 779- bool(true) 784- bool(true) 849+ 850+ Strict Standards: Non-static method object_class::foo1() cannot be called statically in /root/distr/php-5.2.4/ext/standard/tests/general_functions/is_callable.php on line 35 855+ 856+ Strict Standards: Non-static method object_class::foo1() cannot be called statically in /root/distr/php-5.2.4/ext/standard/tests/general_functions/is_callable.php on line 37 860+ 861+ Strict Standards: Non-static method object_class::foo1() cannot be called statically in /root/distr/php-5.2.4/ext/standard/tests/general_functions/is_callable.php on line 38 862+ bool(true) 863+ 864+ Strict Standards: Non-static method object_class::foo1() cannot be called statically in /root/distr/php-5.2.4/ext/standard/tests/general_functions/is_callable.php on line 39 865+ 866+ Strict Standards: Non-static method object_class::foo1() cannot be called statically in /root/distr/php-5.2.4/ext/standard/tests/general_functions/is_callable.php on line 39 867+ bool(true) ================================================================================ ================================================================================ /root/distr/php-5.2.4/ext/xml/tests/bug32001.phpt ================================================================================ libxml2 Version => 2.6.30 Notice: iconv(): Unknown error (25) in /root/distr/php-5.2.4/ext/xml/tests/bug32001.php on line 43 Encoding: UTF-8 XML Prologue: present Chunk size: all data at once BOM: not prepended [Error] Invalid document end Notice: iconv(): Unknown error (25) in /root/distr/php-5.2.4/ext/xml/tests/bug32001.php on line 43 Encoding: UTF-8 XML Prologue: not present Chunk size: all data at once BOM: not prepended [Error] Invalid document end Notice: iconv(): Unknown error (25) in /root/distr/php-5.2.4/ext/xml/tests/bug32001.php on line 43 Encoding: UTF-8 XML Prologue: present Chunk size: all data at once BOM: prepended [Error] Invalid document end Notice: iconv(): Unknown error (25) in /root/distr/php-5.2.4/ext/xml/tests/bug32001.php on line 43 Encoding: UTF-8 XML Prologue: not present Chunk size: all data at once BOM: prepended [Error] Invalid document end Notice: iconv(): Unknown error (25) in /root/distr/php-5.2.4/ext/xml/tests/bug32001.php on line 43 Encoding: UTF-16BE XML Prologue: present Chunk size: all data at once BOM: not prepended [Error] Invalid document end Notice: iconv(): Unknown error (25) in /root/distr/php-5.2.4/ext/xml/tests/bug32001.php on line 43 Encoding: UTF-16BE XML Prologue: present Chunk size: all data at once BOM: prepended [Error] Invalid document end Notice: iconv(): Unknown error (25) in /root/distr/php-5.2.4/ext/xml/tests/bug32001.php on line 43 Encoding: UTF-16BE XML Prologue: not present Chunk size: all data at once BOM: prepended [Error] Invalid document end Notice: iconv(): Unknown error (25) in /root/distr/php-5.2.4/ext/xml/tests/bug32001.php on line 43 Encoding: UTF-16LE XML Prologue: present Chunk size: all data at once BOM: not prepended [Error] Invalid document end Notice: iconv(): Unknown error (25) in /root/distr/php-5.2.4/ext/xml/tests/bug32001.php on line 43 Encoding: UTF-16LE XML Prologue: present Chunk size: all data at once BOM: prepended [Error] Invalid document end Notice: iconv(): Unknown error (25) in /root/distr/php-5.2.4/ext/xml/tests/bug32001.php on line 43 Encoding: UTF-16LE XML Prologue: not present Chunk size: all data at once BOM: prepended [Error] Invalid document end Notice: iconv(): Unknown error (25) in /root/distr/php-5.2.4/ext/xml/tests/bug32001.php on line 43 Notice: Undefined variable: success in /root/distr/php-5.2.4/ext/xml/tests/bug32001.php on line 105 Encoding: UTF-8 XML Prologue: present Chunk size: 1 byte(s) BOM: not prepended Notice: Undefined variable: success in /root/distr/php-5.2.4/ext/xml/tests/bug32001.php on line 115 [Error] No error Notice: iconv(): Unknown error (25) in /root/distr/php-5.2.4/ext/xml/tests/bug32001.php on line 43 Notice: Undefined variable: success in /root/distr/php-5.2.4/ext/xml/tests/bug32001.php on line 105 Encoding: UTF-8 XML Prologue: not present Chunk size: 1 byte(s) BOM: not prepended Notice: Undefined variable: success in /root/distr/php-5.2.4/ext/xml/tests/bug32001.php on line 115 [Error] No error Notice: iconv(): Unknown error (25) in /root/distr/php-5.2.4/ext/xml/tests/bug32001.php on line 43 Encoding: UTF-8 XML Prologue: present Chunk size: 1 byte(s) BOM: prepended [Error] Invalid document end Notice: iconv(): Unknown error (25) in /root/distr/php-5.2.4/ext/xml/tests/bug32001.php on line 43 ================================================================================ 002+ 003+ Notice: iconv(): Unknown error (25) in /root/distr/php-5.2.4/ext/xml/tests/bug32001.php on line 43 006- array(3) { 007- [0]=> 008- string(128) "e38386e382b9e383883ae38386e382b9e3838831: 687474703a2f2f7777772e6578616d706c652e636f6d2fe38386e382b9e383882f, e38386e382b9e38388" 009- [1]=> 010- string(60) "e38386e382b9e383883ae38386e382b9e3838832: e38386e382b9e38388" 011- [2]=> 012- string(42) "e38386e382b9e383883ae38386e382b9e3838833: " 013- } 008+ [Error] Invalid document end 009+ 010+ Notice: iconv(): Unknown error (25) in /root/distr/php-5.2.4/ext/xml/tests/bug32001.php on line 43 015+ [Error] Invalid document end 016+ 017+ Notice: iconv(): Unknown error (25) in /root/distr/php-5.2.4/ext/xml/tests/bug32001.php on line 43 018- array(3) { 019- [0]=> 020- string(128) "e38386e382b9e383883ae38386e382b9e3838831: 687474703a2f2f7777772e6578616d706c652e636f6d2fe38386e382b9e383882f, e38386e382b9e38388" 021- [1]=> 022- string(60) "e38386e382b9e383883ae38386e382b9e3838832: e38386e382b9e38388" 023- [2]=> 024- string(42) "e38386e382b9e383883ae38386e382b9e3838833: " 025- } 022+ [Error] Invalid document end 023+ 024+ Notice: iconv(): Unknown error (25) in /root/distr/php-5.2.4/ext/xml/tests/bug32001.php on line 43 029+ [Error] Invalid document end 030+ 031+ Notice: iconv(): Unknown error (25) in /root/distr/php-5.2.4/ext/xml/tests/bug32001.php on line 43 030- array(3) { 031- [0]=> 032- string(128) "e38386e382b9e383883ae38386e382b9e3838831: 687474703a2f2f7777772e6578616d706c652e636f6d2fe38386e382b9e383882f, e38386e382b9e38388" 033- [1]=> 034- string(60) "e38386e382b9e383883ae38386e382b9e3838832: e38386e382b9e38388" 035- [2]=> 036- string(42) "e38386e382b9e383883ae38386e382b9e3838833: " 037- } 036+ [Error] Invalid document end 037+ 038+ Notice: iconv(): Unknown error (25) in /root/distr/php-5.2.4/ext/xml/tests/bug32001.php on line 43 042- array(3) { 043- [0]=> 044- string(128) "e38386e382b9e383883ae38386e382b9e3838831: 687474703a2f2f7777772e6578616d706c652e636f6d2fe38386e382b9e383882f, e38386e382b9e38388" 045- [1]=> 046- string(60) "e38386e382b9e383883ae38386e382b9e3838832: e38386e382b9e38388" 047- [2]=> 048- string(42) "e38386e382b9e383883ae38386e382b9e3838833: " 049- } 043+ [Error] Invalid document end 044+ 045+ Notice: iconv(): Unknown error (25) in /root/distr/php-5.2.4/ext/xml/tests/bug32001.php on line 43 050+ [Error] Invalid document end 051+ 052+ Notice: iconv(): Unknown error (25) in /root/distr/php-5.2.4/ext/xml/tests/bug32001.php on line 43 054- array(3) { 055- [0]=> 056- string(128) "e38386e382b9e383883ae38386e382b9e3838831: 687474703a2f2f7777772e6578616d706c652e636f6d2fe38386e382b9e383882f, e38386e382b9e38388" 057- [1]=> 058- string(60) "e38386e382b9e383883ae38386e382b9e3838832: e38386e382b9e38388" 059- [2]=> 060- string(42) "e38386e382b9e383883ae38386e382b9e3838833: " 061- } 057+ [Error] Invalid document end 058+ 059+ Notice: iconv(): Unknown error (25) in /root/distr/php-5.2.4/ext/xml/tests/bug32001.php on line 43 064+ [Error] Invalid document end 065+ 066+ Notice: iconv(): Unknown error (25) in /root/distr/php-5.2.4/ext/xml/tests/bug32001.php on line 43 066- array(3) { 067- [0]=> 068- string(128) "e38386e382b9e383883ae38386e382b9e3838831: 687474703a2f2f7777772e6578616d706c652e636f6d2fe38386e382b9e383882f, e38386e382b9e38388" 069- [1]=> 070- string(60) "e38386e382b9e383883ae38386e382b9e3838832: e38386e382b9e38388" 071- [2]=> 072- string(42) "e38386e382b9e383883ae38386e382b9e3838833: " 073- } 071+ [Error] Invalid document end 072+ 073+ Notice: iconv(): Unknown error (25) in /root/distr/php-5.2.4/ext/xml/tests/bug32001.php on line 43 074+ 075+ Notice: Undefined variable: success in /root/distr/php-5.2.4/ext/xml/tests/bug32001.php on line 105 078- array(3) { 079- [0]=> 080- string(128) "e38386e382b9e383883ae38386e382b9e3838831: 687474703a2f2f7777772e6578616d706c652e636f6d2fe38386e382b9e383882f, e38386e382b9e38388" 081- [1]=> 082- string(60) "e38386e382b9e383883ae38386e382b9e3838832: e38386e382b9e38388" 083- [2]=> 084- string(42) "e38386e382b9e383883ae38386e382b9e3838833: " 085- } 080+ 081+ Notice: Undefined variable: success in /root/distr/php-5.2.4/ext/xml/tests/bug32001.php on line 115 082+ [Error] No error 083+ 084+ Notice: iconv(): Unknown error (25) in /root/distr/php-5.2.4/ext/xml/tests/bug32001.php on line 43 085+ 086+ Notice: Undefined variable: success in /root/distr/php-5.2.4/ext/xml/tests/bug32001.php on line 105 090- array(3) { 091- [0]=> 092- string(128) "e38386e382b9e383883ae38386e382b9e3838831: 687474703a2f2f7777772e6578616d706c652e636f6d2fe38386e382b9e383882f, e38386e382b9e38388" 093- [1]=> 094- string(60) "e38386e382b9e383883ae38386e382b9e3838832: e38386e382b9e38388" 095- [2]=> 096- string(42) "e38386e382b9e383883ae38386e382b9e3838833: " 097- } 091+ 092+ Notice: Undefined variable: success in /root/distr/php-5.2.4/ext/xml/tests/bug32001.php on line 115 093+ [Error] No error 094+ 095+ Notice: iconv(): Unknown error (25) in /root/distr/php-5.2.4/ext/xml/tests/bug32001.php on line 43 100+ [Error] Invalid document end 101+ 102+ Notice: iconv(): Unknown error (25) in /root/distr/php-5.2.4/ext/xml/tests/bug32001.php on line 43 102- array(3) { 103- [0]=> 104- string(128) "e38386e382b9e383883ae38386e382b9e3838831: 687474703a2f2f7777772e6578616d706c652e636f6d2fe38386e382b9e383882f, e38386e382b9e38388" 105- [1]=> 106- string(60) "e38386e382b9e383883ae38386e382b9e3838832: e38386e382b9e38388" 107- [2]=> 108- string(42) "e38386e382b9e383883ae38386e382b9e3838833: " 109- } 114- array(3) { 115- [0]=> 116- string(128) "e38386e382b9e383883ae38386e382b9e3838831: 687474703a2f2f7777772e6578616d706c652e636f6d2fe38386e382b9e383882f, e38386e382b9e38388" 117- [1]=> 118- string(60) "e38386e382b9e383883ae38386e382b9e3838832: e38386e382b9e38388" 119- [2]=> 120- string(42) "e38386e382b9e383883ae38386e382b9e3838833: " 121- } 126- array(3) { 127- [0]=> 128- string(128) "e38386e382b9e383883ae38386e382b9e3838831: 687474703a2f2f7777772e6578616d706c652e636f6d2fe38386e382b9e383882f, e38386e382b9e38388" 129- [1]=> 130- string(60) "e38386e382b9e383883ae38386e382b9e3838832: e38386e382b9e38388" 131- [2]=> 132- string(42) "e38386e382b9e383883ae38386e382b9e3838833: " 133- } 138- array(3) { 139- [0]=> 140- string(128) "e38386e382b9e383883ae38386e382b9e3838831: 687474703a2f2f7777772e6578616d706c652e636f6d2fe38386e382b9e383882f, e38386e382b9e38388" 141- [1]=> 142- string(60) "e38386e382b9e383883ae38386e382b9e3838832: e38386e382b9e38388" 143- [2]=> 144- string(42) "e38386e382b9e383883ae38386e382b9e3838833: " 145- } 150- array(3) { 151- [0]=> 152- string(128) "e38386e382b9e383883ae38386e382b9e3838831: 687474703a2f2f7777772e6578616d706c652e636f6d2fe38386e382b9e383882f, e38386e382b9e38388" 153- [1]=> 154- string(60) "e38386e382b9e383883ae38386e382b9e3838832: e38386e382b9e38388" 155- [2]=> 156- string(42) "e38386e382b9e383883ae38386e382b9e3838833: " 157- } 158- Encoding: UTF-8 159- XML Prologue: not present 160- Chunk size: 1 byte(s) 161- BOM: prepended 162- array(3) { 163- [0]=> 164- string(128) "e38386e382b9e383883ae38386e382b9e3838831: 687474703a2f2f7777772e6578616d706c652e636f6d2fe38386e382b9e383882f, e38386e382b9e38388" 165- [1]=> 166- string(60) "e38386e382b9e383883ae38386e382b9e3838832: e38386e382b9e38388" 167- [2]=> 168- string(42) "e38386e382b9e383883ae38386e382b9e3838833: " 169- } 170- Encoding: UTF-16BE 171- XML Prologue: present 172- Chunk size: 1 byte(s) 173- BOM: not prepended 174- array(3) { 175- [0]=> 176- string(128) "e38386e382b9e383883ae38386e382b9e3838831: 687474703a2f2f7777772e6578616d706c652e636f6d2fe38386e382b9e383882f, e38386e382b9e38388" 177- [1]=> 178- string(60) "e38386e382b9e383883ae38386e382b9e3838832: e38386e382b9e38388" 179- [2]=> 180- string(42) "e38386e382b9e383883ae38386e382b9e3838833: " 181- } 182- Encoding: UTF-16BE 183- XML Prologue: present 184- Chunk size: 1 byte(s) 185- BOM: prepended 186- array(3) { 187- [0]=> 188- string(128) "e38386e382b9e383883ae38386e382b9e3838831: 687474703a2f2f7777772e6578616d706c652e636f6d2fe38386e382b9e383882f, e38386e382b9e38388" 189- [1]=> 190- string(60) "e38386e382b9e383883ae38386e382b9e3838832: e38386e382b9e38388" 191- [2]=> 192- string(42) "e38386e382b9e383883ae38386e382b9e3838833: " 193- } 194- Encoding: UTF-16BE 195- XML Prologue: not present 196- Chunk size: 1 byte(s) 197- BOM: prepended 198- array(3) { 199- [0]=> 200- string(128) "e38386e382b9e383883ae38386e382b9e3838831: 687474703a2f2f7777772e6578616d706c652e636f6d2fe38386e382b9e383882f, e38386e382b9e38388" 201- [1]=> 202- string(60) "e38386e382b9e383883ae38386e382b9e3838832: e38386e382b9e38388" 203- [2]=> 204- string(42) "e38386e382b9e383883ae38386e382b9e3838833: " 205- } 206- Encoding: UTF-16LE 207- XML Prologue: present 208- Chunk size: 1 byte(s) 209- BOM: not prepended 210- array(3) { 211- [0]=> 212- string(128) "e38386e382b9e383883ae38386e382b9e3838831: 687474703a2f2f7777772e6578616d706c652e636f6d2fe38386e382b9e383882f, e38386e382b9e38388" 213- [1]=> 214- string(60) "e38386e382b9e383883ae38386e382b9e3838832: e38386e382b9e38388" 215- [2]=> 216- string(42) "e38386e382b9e383883ae38386e382b9e3838833: " 217- } 218- Encoding: UTF-16LE 219- XML Prologue: present 220- Chunk size: 1 byte(s) 221- BOM: prepended 222- array(3) { 223- [0]=> 224- string(128) "e38386e382b9e383883ae38386e382b9e3838831: 687474703a2f2f7777772e6578616d706c652e636f6d2fe38386e382b9e383882f, e38386e382b9e38388" 225- [1]=> 226- string(60) "e38386e382b9e383883ae38386e382b9e3838832: e38386e382b9e38388" 227- [2]=> 228- string(42) "e38386e382b9e383883ae38386e382b9e3838833: " 229- } 230- Encoding: UTF-16LE 231- XML Prologue: not present 232- Chunk size: 1 byte(s) 233- BOM: prepended 234- array(3) { 235- [0]=> 236- string(128) "e38386e382b9e383883ae38386e382b9e3838831: 687474703a2f2f7777772e6578616d706c652e636f6d2fe38386e382b9e383882f, e38386e382b9e38388" 237- [1]=> 238- string(60) "e38386e382b9e383883ae38386e382b9e3838832: e38386e382b9e38388" 239- [2]=> 240- string(42) "e38386e382b9e383883ae38386e382b9e3838833: " 241- } ================================================================================ ================================================================================ /root/distr/php-5.2.4/sapi/cli/tests/015.phpt ================================================================================ PHP 5.2.4 (cli) (built: Oct 4 2007 11:35:58) PHP 5.2.4 (cli) (built: Oct 4 2007 11:35:58) Usage: php [options] [-f] <file> [--] [args...] Done ================================================================================ 002+ 003+ PHP 5.2.4 (cli) (built: Oct 4 2007 11:35:58) 004+ Usage: php [options] [-f] <file> [--] [args...] 005+ Done 002- Array 003- ( 004- [0] => - 005- [1] => foo 006- [2] => bar 007- [3] => baz 008- ) 009- 010- PHP %d.%d.%d%s(cli) (built: %s)%s 011- Usage: %s [options] [-f] <file> [--] [args...] 012- Done ================================================================================ ================================================================================ BUILD ENVIRONMENT ================================================================================ OS: Linux - Linux localhost.localdomain 2.6.20-1.2320.fc5 #1 Tue Jun 12 18:50:38 EDT 2007 i686 Autoconf: autoconf (GNU Autoconf) 2.59 Written by David J. MacKenzie and Akim Demaille. Copyright (C) 2003 Free Software Foundation, Inc. This is free software; see the source for copying conditions. There is NO warranty; not even for MERCHANTABILITY or FITNESS FOR A PARTICULAR PURPOSE. Bundled Libtool: ltmain.sh (GNU libtool) 1.5.20 (1.1220.2.287 2005/08/31 18:54:15) Copyright (C) 2005 Free Software Foundation, Inc. This is free software; see the source for copying conditions. There is NO warranty; not even for MERCHANTABILITY or FITNESS FOR A PARTICULAR PURPOSE. System Libtool: ltmain.sh (GNU libtool) 1.5.22 (1.1220.2.365 2005/12/18 22:14:06) Copyright (C) 2005 Free Software Foundation, Inc. This is free software; see the source for copying conditions. There is NO warranty; not even for MERCHANTABILITY or FITNESS FOR A PARTICULAR PURPOSE. Compiler: Используются внутренние спецификации. Целевая архитектура: i386-redhat-linux Параметры конфигурации: ../configure --prefix=/usr --mandir=/usr/share/man --infodir=/usr/share/info --enable-shared --enable-threads=posix --enable-checking=release --with-system-zlib --enable-__cxa_atexit --disable-libunwind-exceptions --enable-libgcj-multifile --enable-languages=c,c++,objc,obj-c++,java,fortran,ada --enable-java-awt=gtk --disable-dssi --with-java-home=/usr/lib/jvm/java-1.4.2-gcj-1.4.2.0/jre --with-cpu=generic --host=i386-redhat-linux Модель многопотоковости: posix gcc версия 4.1.1 20070105 (Red Hat 4.1.1-51) Bison: bison (GNU Bison) 2.1 Авторы: Роберт Корбет и Ричард Столмен. Copyright (C) 2005 Free Software Foundation, Inc. Это свободная программа; условия распространения смотрите в исходных текстах. НИКАКИХ гарантий не предоставляется, даже гарантии ПОЛЕЗНОСТИ или ПРИГОДНОСТИ ДЛЯ ОПРЕДЕЛЕННОЙ ЦЕЛИ. Libraries: linux-gate.so.1 => (0x00205000) libcrypt.so.1 => /lib/libcrypt.so.1 (0x007ae000) librt.so.1 => /lib/librt.so.1 (0x00110000) libmysqlclient.so.15 => /usr/local/mysql/lib/libmysqlclient.so.15 (0x0091d000) libgd.so.2 => /usr/local/lib/libgd.so.2 (0x00490000) libjpeg.so.62 => /usr/local/lib/libjpeg.so.62 (0x0022a000) libfreetype.so.6 => /usr/local/lib/libfreetype.so.6 (0x00118000) libpng12.so.0 => /usr/local/lib/libpng12.so.0 (0x0018d000) libm.so.6 => /lib/libm.so.6 (0x0053b000) libt1.so.5 => /usr/local/lib/libt1.so.5 (0x00249000) libresolv.so.2 => /lib/libresolv.so.2 (0x005fc000) libdl.so.2 => /lib/libdl.so.2 (0x00535000) libnsl.so.1 => /lib/libnsl.so.1 (0x006aa000) libcurl.so.3 => /usr/local/lib/libcurl.so.3 (0x001bc000) libxml2.so.2 => /usr/local/lib/libxml2.so.2 (0x0029c000) libc.so.6 => /lib/libc.so.6 (0x007dc000) libpthread.so.0 => /lib/libpthread.so.0 (0x005d8000) /lib/ld-linux.so.2 (0x003e3000) libnss_files.so.2 => /lib/libnss_files.so.2 (0x001f4000) libnss_dns.so.2 => /lib/libnss_dns.so.2 (0x00c11000) User's E-mail: n ================================================================================ PHPINFO ================================================================================ phpinfo() PHP Version => 5.2.4 System => Linux localhost.localdomain 2.6.20-1.2320.fc5 #1 Tue Jun 12 18:50:38 EDT 2007 i686 Build Date => Oct 4 2007 11:32:01 Configure Command => './configure' '--prefix=/usr/local/php' '--enable-reflection' '--enable-fastcgi' '--with-apxs=/usr/local/apache/bin/apxs' '--with-regex=php' '--with-zlib' '--with-mysql=/usr/local/mysql' '--with-gd=/usr/local/include' '--with-png' '--with-t1lib' '--with-freetype' '--with-jpeg' '--with-curl' '--with-iconv' '--with-gzip' '--with-zip' '--with-config-file-scan-dir=/etc' '--with-libxml' '--with-libxml2' '--with-libxml-dir=/usr/local' '--with-libxml2-dir=/usr/local' '--disable-pear' Server API => Command Line Interface Virtual Directory Support => disabled Configuration File (php.ini) Path => /usr/local/php/lib Loaded Configuration File => /usr/local/Zend/etc/php.ini Scan this dir for additional .ini files => /etc PHP API => 20041225 PHP Extension => 20060613 Zend Extension => 220060519 Debug Build => no Thread Safety => disabled Zend Memory Manager => enabled IPv6 Support => enabled Registered PHP Streams => php, file, data, http, ftp, compress.zlib Registered Stream Socket Transports => tcp, udp, unix, udg Registered Stream Filters => string.rot13, string.toupper, string.tolower, string.strip_tags, convert.*, consumed, convert.iconv.*, zlib.* This program makes use of the Zend Scripting Language Engine: Zend Engine v2.2.0, Copyright (c) 1998-2007 Zend Technologies with Zend Extension Manager v1.2.2, Copyright (c) 2003-2007, by Zend Technologies with Zend Optimizer v3.3.0, Copyright (c) 1998-2007, by Zend Technologies _______________________________________________________________________ Configuration PHP Core Directive => Local Value => Master Value allow_call_time_pass_reference => On => On allow_url_fopen => On => On allow_url_include => Off => Off always_populate_raw_post_data => Off => Off arg_separator.input => & => & arg_separator.output => & => & asp_tags => Off => Off auto_append_file => no value => no value auto_globals_jit => On => On auto_prepend_file => no value => no value browscap => no value => no value default_charset => no value => no value default_mimetype => text/html => text/html define_syslog_variables => Off => Off disable_classes => no value => no value disable_functions => no value => no value display_errors => STDOUT => STDOUT display_startup_errors => Off => Off doc_root => no value => no value docref_ext => no value => no value docref_root => no value => no value enable_dl => On => On error_append_string => no value => no value error_log => no value => no value error_prepend_string => no value => no value error_reporting => no value => no value expose_php => On => On extension_dir => /usr/local/php/lib/php/extensions/no-debug-non-zts-20060613 => /usr/local/php/lib/php/extensions/no-debug-non-zts-20060613 file_uploads => On => On highlight.bg => <font style="color: #FFFFFF">#FFFFFF</font> => <font style="color: #FFFFFF">#FFFFFF</font> highlight.comment => <font style="color: #FF8000">#FF8000</font> => <font style="color: #FF8000">#FF8000</font> highlight.default => <font style="color: #0000BB">#0000BB</font> => <font style="color: #0000BB">#0000BB</font> highlight.html => <font style="color: #000000">#000000</font> => <font style="color: #000000">#000000</font> highlight.keyword => <font style="color: #007700">#007700</font> => <font style="color: #007700">#007700</font> highlight.string => <font style="color: #DD0000">#DD0000</font> => <font style="color: #DD0000">#DD0000</font> html_errors => Off => Off ignore_repeated_errors => Off => Off ignore_repeated_source => Off => Off ignore_user_abort => Off => Off implicit_flush => On => On include_path => .: => .: log_errors => Off => Off log_errors_max_len => 1024 => 1024 magic_quotes_gpc => On => On magic_quotes_runtime => Off => Off magic_quotes_sybase => Off => Off mail.force_extra_parameters => no value => no value max_execution_time => 0 => 0 max_input_nesting_level => 64 => 64 max_input_time => -1 => -1 memory_limit => 128M => 128M open_basedir => no value => no value output_buffering => 0 => 0 output_handler => no value => no value post_max_size => 8M => 8M precision => 14 => 14 realpath_cache_size => 16K => 16K realpath_cache_ttl => 120 => 120 register_argc_argv => On => On register_globals => Off => Off register_long_arrays => On => On report_memleaks => On => On report_zend_debug => Off => Off safe_mode => Off => Off safe_mode_exec_dir => /usr/local/php/bin => /usr/local/php/bin safe_mode_gid => Off => Off safe_mode_include_dir => no value => no value sendmail_from => no value => no value sendmail_path => /usr/sbin/sendmail -t -i => /usr/sbin/sendmail -t -i serialize_precision => 100 => 100 short_open_tag => On => On SMTP => localhost => localhost smtp_port => 25 => 25 sql.safe_mode => Off => Off track_errors => Off => Off unserialize_callback_func => no value => no value upload_max_filesize => 2M => 2M upload_tmp_dir => no value => no value user_dir => no value => no value variables_order => EGPCS => EGPCS xmlrpc_error_number => 0 => 0 xmlrpc_errors => Off => Off y2k_compliance => On => On zend.ze1_compatibility_mode => Off => Off ctype ctype functions => enabled curl cURL support => enabled cURL Information => libcurl/7.15.4 zlib/1.2.3 date date/time support => enabled "Olson" Timezone Database Version => 2007.6 Timezone Database => internal Default timezone => Europe/Moscow Directive => Local Value => Master Value date.default_latitude => 31.7667 => 31.7667 date.default_longitude => 35.2333 => 35.2333 date.sunrise_zenith => 90.583333 => 90.583333 date.sunset_zenith => 90.583333 => 90.583333 date.timezone => no value => no value dom DOM/XML => enabled DOM/XML API Version => 20031129 libxml Version => 2.6.30 HTML Support => enabled XPath Support => enabled XPointer Support => enabled Schema Support => enabled RelaxNG Support => enabled filter Input Validation and Filtering => enabled Revision => $Revision: 1.52.2.39 $ Directive => Local Value => Master Value filter.default => unsafe_raw => unsafe_raw filter.default_flags => no value => no value gd GD Support => enabled GD Version => 2.0 or higher T1Lib Support => enabled GIF Read Support => enabled GIF Create Support => enabled WBMP Support => enabled hash hash support => enabled Hashing Engines => md2 md4 md5 sha1 sha256 sha384 sha512 ripemd128 ripemd160 ripemd256 ripemd320 whirlpool tiger128,3 tiger160,3 tiger192,3 tiger128,4 tiger160,4 tiger192,4 snefru gost adler32 crc32 crc32b haval128,3 haval160,3 haval192,3 haval224,3 haval256,3 haval128,4 haval160,4 haval192,4 haval224,4 haval256,4 haval128,5 haval160,5 haval192,5 haval224,5 haval256,5 iconv iconv support => enabled iconv implementation => glibc iconv library version => 2.4 Directive => Local Value => Master Value iconv.input_encoding => ISO-8859-1 => ISO-8859-1 iconv.internal_encoding => ISO-8859-1 => ISO-8859-1 iconv.output_encoding => ISO-8859-1 => ISO-8859-1 json json support => enabled json version => 1.2.1 libxml libXML support => active libXML Version => 2.6.30 libXML streams => enabled mysql MySQL Support => enabled Active Persistent Links => 0 Active Links => 0 Client API version => 5.0.45 MYSQL_MODULE_TYPE => external MYSQL_SOCKET => /tmp/mysql.sock MYSQL_INCLUDE => -I/usr/local/mysql/include MYSQL_LIBS => -L/usr/local/mysql/lib -lmysqlclient Directive => Local Value => Master Value mysql.allow_persistent => On => On mysql.connect_timeout => 60 => 60 mysql.default_host => no value => no value mysql.default_password => no value => no value mysql.default_port => no value => no value mysql.default_socket => no value => no value mysql.default_user => no value => no value mysql.max_links => Unlimited => Unlimited mysql.max_persistent => Unlimited => Unlimited mysql.trace_mode => Off => Off pcre PCRE (Perl Compatible Regular Expressions) Support => enabled PCRE Library Version => 7.2 2007-06-19 Directive => Local Value => Master Value pcre.backtrack_limit => 100000 => 100000 pcre.recursion_limit => 100000 => 100000 PDO PDO support => enabled PDO drivers => sqlite2, sqlite pdo_sqlite PDO Driver for SQLite 3.x => enabled PECL Module version => (bundled) 1.0.1 $Id: pdo_sqlite.c,v 1.10.2.6.2.2 2007/03/23 14:30:00 wez Exp $ SQLite Library => 3.3.17 posix Revision => $Revision: 1.70.2.3.2.16 $ Reflection Reflection => enabled Version => $Id: php_reflection.c,v 1.164.2.33.2.45 2007/08/20 17:01:22 sebastian Exp $ session Session Support => enabled Registered save handlers => files user sqlite Registered serializer handlers => php php_binary Directive => Local Value => Master Value session.auto_start => Off => Off session.bug_compat_42 => On => On session.bug_compat_warn => On => On session.cache_expire => 180 => 180 session.cache_limiter => nocache => nocache session.cookie_domain => no value => no value session.cookie_httponly => Off => Off session.cookie_lifetime => 0 => 0 session.cookie_path => / => / session.cookie_secure => Off => Off session.entropy_file => no value => no value session.entropy_length => 0 => 0 session.gc_divisor => 100 => 100 session.gc_maxlifetime => 1440 => 1440 session.gc_probability => 1 => 1 session.hash_bits_per_character => 4 => 4 session.hash_function => 0 => 0 session.name => PHPSESSID => PHPSESSID session.referer_check => no value => no value session.save_handler => files => files session.save_path => no value => no value session.serialize_handler => php => php session.use_cookies => On => On session.use_only_cookies => Off => Off session.use_trans_sid => 0 => 0 SimpleXML Simplexml support => enabled Revision => $Revision: 1.151.2.22.2.35 $ Schema support => enabled SPL SPL support => enabled Interfaces => Countable, OuterIterator, RecursiveIterator, SeekableIterator, SplObserver, SplSubject Classes => AppendIterator, ArrayIterator, ArrayObject, BadFunctionCallException, BadMethodCallException, CachingIterator, DirectoryIterator, DomainException, EmptyIterator, FilterIterator, InfiniteIterator, InvalidArgumentException, IteratorIterator, LengthException, LimitIterator, LogicException, NoRewindIterator, OutOfBoundsException, OutOfRangeException, OverflowException, ParentIterator, RangeException, RecursiveArrayIterator, RecursiveCachingIterator, RecursiveDirectoryIterator, RecursiveFilterIterator, RecursiveIteratorIterator, RecursiveRegexIterator, RegexIterator, RuntimeException, SimpleXMLIterator, SplFileInfo, SplFileObject, SplObjectStorage, SplTempFileObject, UnderflowException, UnexpectedValueException SQLite SQLite support => enabled PECL Module version => 2.0-dev $Id: sqlite.c,v 1.166.2.13.2.9 2007/05/19 17:58:22 iliaa Exp $ SQLite Library => 2.8.17 SQLite Encoding => iso8859 Directive => Local Value => Master Value sqlite.assoc_case => 0 => 0 standard Regex Library => Bundled library enabled Dynamic Library Support => enabled Path to sendmail => /usr/sbin/sendmail -t -i Directive => Local Value => Master Value assert.active => 1 => 1 assert.bail => 0 => 0 assert.callback => no value => no value assert.quiet_eval => 0 => 0 assert.warning => 1 => 1 auto_detect_line_endings => 0 => 0 default_socket_timeout => 60 => 60 safe_mode_allowed_env_vars => PHP_ => PHP_ safe_mode_protected_env_vars => LD_LIBRARY_PATH => LD_LIBRARY_PATH url_rewriter.tags => a=href,area=href,frame=src,form=,fieldset= => a=href,area=href,frame=src,form=,fieldset= user_agent => no value => no value tokenizer Tokenizer Support => enabled xml XML Support => active XML Namespace Support => active libxml2 Version => 2.6.30 xmlreader XMLReader => enabled xmlwriter XMLWriter => enabled Zend Optimizer Optimization Pass 1 => enabled Optimization Pass 2 => enabled Optimization Pass 3 => enabled Optimization Pass 4 => enabled Optimization Pass 9 => enabled Zend Loader => enabled License Path => Obfuscation level => 3 zlib ZLib Support => enabled Stream Wrapper support => compress.zlib:// Stream Filter support => zlib.inflate, zlib.deflate Compiled Version => 1.2.3 Linked Version => 1.2.3 Directive => Local Value => Master Value zlib.output_compression => Off => Off zlib.output_compression_level => -1 => -1 zlib.output_handler => no value => no value Additional Modules Module Name Environment Variable => Value HOSTNAME => localhost.localdomain TEST_PHP_SRCDIR => /root/distr/php-5.2.4 SHELL => /bin/sh TERM => xterm MAKEFLAGS => HISTSIZE => 1000 SSH_CLIENT => deleted SSH_TTY => deleted USER => root LS_COLORS => no=00:fi=00:di=00;34:ln=00;36:pi=40;33:so=00;35:bd=40;33;01:cd=40;33;01:or=01;05;37;41:mi=01;05;37;41:ex=00;32:*.cmd=00;32:*.exe=00;32:*.com=00;32:*.btm=00;32:*.bat=00;32:*.sh=00;32:*.csh=00;32:*.tar=00;31:*.tgz=00;31:*.arj=00;31:*.taz=00;31:*.lzh=00;31:*.zip=00;31:*.z=00;31:*.Z=00;31:*.gz=00;31:*.bz2=00;31:*.bz=00;31:*.tz=00;31:*.rpm=00;31:*.cpio=00;31:*.jpg=00;35:*.gif=00;35:*.bmp=00;35:*.xbm=00;35:*.xpm=00;35:*.png=00;35:*.tif=00;35: SSH_AUTH_SOCK => deleted MAKELEVEL => 1 MFLAGS => PATH => /usr/kerberos/sbin:/usr/kerberos/bin:/usr/local/sbin:/usr/local/bin:/sbin:/bin:/usr/sbin:/usr/bin:/root/bin MAIL => /var/spool/mail/root _ => /root/distr/php-5.2.4/sapi/cli/php PWD => /root/distr/php-5.2.4 INPUTRC => /etc/inputrc LANG => ru_RU.UTF-8 TEST_PHP_EXECUTABLE => /root/distr/php-5.2.4/sapi/cli/php HOME => /root SHLVL => 3 LOGNAME => root CVS_RSH => ssh SSH_CONNECTION => deleted LESSOPEN => |/usr/bin/lesspipe.sh %s CC => gcc G_BROKEN_FILENAMES => 1 PHP Variables Variable => Value _SERVER["HOSTNAME"] => localhost.localdomain _SERVER["TEST_PHP_SRCDIR"] => /root/distr/php-5.2.4 _SERVER["SHELL"] => /bin/sh _SERVER["TERM"] => xterm _SERVER["MAKEFLAGS"] => _SERVER["HISTSIZE"] => 1000 _SERVER["SSH_CLIENT"] => deleted _SERVER["SSH_TTY"] => deleted _SERVER["USER"] => root _SERVER["LS_COLORS"] => no=00:fi=00:di=00;34:ln=00;36:pi=40;33:so=00;35:bd=40;33;01:cd=40;33;01:or=01;05;37;41:mi=01;05;37;41:ex=00;32:*.cmd=00;32:*.exe=00;32:*.com=00;32:*.btm=00;32:*.bat=00;32:*.sh=00;32:*.csh=00;32:*.tar=00;31:*.tgz=00;31:*.arj=00;31:*.taz=00;31:*.lzh=00;31:*.zip=00;31:*.z=00;31:*.Z=00;31:*.gz=00;31:*.bz2=00;31:*.bz=00;31:*.tz=00;31:*.rpm=00;31:*.cpio=00;31:*.jpg=00;35:*.gif=00;35:*.bmp=00;35:*.xbm=00;35:*.xpm=00;35:*.png=00;35:*.tif=00;35: _SERVER["SSH_AUTH_SOCK"] => deleted _SERVER["MAKELEVEL"] => 1 _SERVER["MFLAGS"] => _SERVER["PATH"] => /usr/kerberos/sbin:/usr/kerberos/bin:/usr/local/sbin:/usr/local/bin:/sbin:/bin:/usr/sbin:/usr/bin:/root/bin _SERVER["MAIL"] => /var/spool/mail/root _SERVER["_"] => /root/distr/php-5.2.4/sapi/cli/php _SERVER["PWD"] => /root/distr/php-5.2.4 _SERVER["INPUTRC"] => /etc/inputrc _SERVER["LANG"] => ru_RU.UTF-8 _SERVER["TEST_PHP_EXECUTABLE"] => /root/distr/php-5.2.4/sapi/cli/php _SERVER["HOME"] => /root _SERVER["SHLVL"] => 3 _SERVER["LOGNAME"] => root _SERVER["CVS_RSH"] => ssh _SERVER["SSH_CONNECTION"] => deleted _SERVER["LESSOPEN"] => |/usr/bin/lesspipe.sh %s _SERVER["CC"] => gcc _SERVER["G_BROKEN_FILENAMES"] => 1 _SERVER["PHP_SELF"] => _SERVER["SCRIPT_NAME"] => _SERVER["SCRIPT_FILENAME"] => _SERVER["PATH_TRANSLATED"] => _SERVER["DOCUMENT_ROOT"] => _SERVER["REQUEST_TIME"] => 1191484113 _SERVER["argv"] => Array ( ) _SERVER["argc"] => 0 _ENV["HOSTNAME"] => localhost.localdomain _ENV["TEST_PHP_SRCDIR"] => /root/distr/php-5.2.4 _ENV["SHELL"] => /bin/sh _ENV["TERM"] => xterm _ENV["MAKEFLAGS"] => _ENV["HISTSIZE"] => 1000 _ENV["SSH_CLIENT"] => deleted _ENV["SSH_TTY"] => deleted _ENV["USER"] => root _ENV["LS_COLORS"] => no=00:fi=00:di=00;34:ln=00;36:pi=40;33:so=00;35:bd=40;33;01:cd=40;33;01:or=01;05;37;41:mi=01;05;37;41:ex=00;32:*.cmd=00;32:*.exe=00;32:*.com=00;32:*.btm=00;32:*.bat=00;32:*.sh=00;32:*.csh=00;32:*.tar=00;31:*.tgz=00;31:*.arj=00;31:*.taz=00;31:*.lzh=00;31:*.zip=00;31:*.z=00;31:*.Z=00;31:*.gz=00;31:*.bz2=00;31:*.bz=00;31:*.tz=00;31:*.rpm=00;31:*.cpio=00;31:*.jpg=00;35:*.gif=00;35:*.bmp=00;35:*.xbm=00;35:*.xpm=00;35:*.png=00;35:*.tif=00;35: _ENV["SSH_AUTH_SOCK"] => deleted _ENV["MAKELEVEL"] => 1 _ENV["MFLAGS"] => _ENV["PATH"] => /usr/kerberos/sbin:/usr/kerberos/bin:/usr/local/sbin:/usr/local/bin:/sbin:/bin:/usr/sbin:/usr/bin:/root/bin _ENV["MAIL"] => /var/spool/mail/root _ENV["_"] => /root/distr/php-5.2.4/sapi/cli/php _ENV["PWD"] => /root/distr/php-5.2.4 _ENV["INPUTRC"] => /etc/inputrc _ENV["LANG"] => ru_RU.UTF-8 _ENV["TEST_PHP_EXECUTABLE"] => /root/distr/php-5.2.4/sapi/cli/php _ENV["HOME"] => /root _ENV["SHLVL"] => 3 _ENV["LOGNAME"] => root _ENV["CVS_RSH"] => ssh _ENV["SSH_CONNECTION"] => deleted _ENV["LESSOPEN"] => |/usr/bin/lesspipe.sh %s _ENV["CC"] => gcc _ENV["G_BROKEN_FILENAMES"] => 1 PHP License This program is free software; you can redistribute it and/or modify it under the terms of the PHP License as published by the PHP Group and included in the distribution in the file: LICENSE This program is distributed in the hope that it will be useful, but WITHOUT ANY WARRANTY; without even the implied warranty of MERCHANTABILITY or FITNESS FOR A PARTICULAR PURPOSE. If you did not receive a copy of the PHP license, or have any questions about PHP licensing, please contact license@php.net.

« previous php.qa (#48980) next »