Test results for 5.2.4 [failed]

From: Date: Thu, 04 Oct 2007 08:31:40 +0000
Subject: Test results for 5.2.4 [failed]
Groups: php.qa 
Request: Send a blank email to php-qa+get-48984@lists.php.net to get a copy of this message
===================================================================== FAILED TEST SUMMARY --------------------------------------------------------------------- Error message handling (with ZendOptimizer) [tests/run-test/test008.phpt] Convert warnings to exceptions [tests/lang/038.phpt] Bug #32828 (Throwing exception in output_callback function with ob_start and ob_end_clean leads to segfault) [tests/lang/bug32828.phpt] Bug #36268 (Object destructors called even after fatal errors) [Zend/tests/bug36268.phpt] Bug #41421 (Uncaught exception from a stream wrapper segfaults) [Zend/tests/bug41421.phpt] Bug #38474 (getAttribute select attribute by order, even when prefixed) (OK to fail with libxml2 < 2.6.2x) [ext/dom/tests/bug38474.phpt] Bug #42082 (NodeList length zero should be empty) [ext/dom/tests/bug42082.phpt] libgd #106 (imagerectangle 1x1 draws 1x3) [ext/gd/tests/libgd00106.phpt] dcngettext() tests [ext/gettext/tests/dcngettext.phpt] iconv_mime_encode() [ext/iconv/tests/iconv_mime_encode.phpt] iconv stream filter [ext/iconv/tests/iconv_stream_filter.phpt] SPL: spl_autoload() with methods [ext/spl/tests/spl_autoload_005.phpt] SPL: spl_autoload() with inaccessible methods [ext/spl/tests/spl_autoload_007.phpt] SPL: spl_autoload() with exceptions [ext/spl/tests/spl_autoload_008.phpt] Bug #35821 (array_map() segfaults when exception is throwed from the callback) [ext/standard/tests/array/bug35821.phpt] Bug #38450 (constructor is not called for classes used in userspace stream wrappers) [ext/standard/tests/file/bug38450_2.phpt] proc_open() regression test 1 (proc_open() leak) [ext/standard/tests/file/proc_open01.phpt] Test is_callable() function [ext/standard/tests/general_functions/is_callable.phpt] Bug #24142 (round() problems) [ext/standard/tests/math/bug24142.phpt] Bug #25694 (round() and number_format() inconsistency) [ext/standard/tests/math/bug25694.phpt] htmlentities() test 2 (setlocale / fr_FR.ISO-8859-15) [ext/standard/tests/strings/htmlentities02.phpt] (warn: possibly braindead libc) htmlentities() test 4 (setlocale / ja_JP.EUC-JP) [ext/standard/tests/strings/htmlentities04.phpt] htmlentities() test 15 (setlocale / KOI8-R) [ext/standard/tests/strings/htmlentities15.phpt] Test strtolower() function [ext/standard/tests/strings/strtolower.phpt] Test strtoupper() function [ext/standard/tests/strings/strtoupper1.phpt] Bug #32001 (xml_parse*() goes into infinite loop when autodetection in effect), using UTF-* [ext/xml/tests/bug32001.phpt] CLI long options [sapi/cli/tests/015.phpt] ===================================================================== ===================================================================== TEST RESULT SUMMARY --------------------------------------------------------------------- Exts skipped : 46 Exts tested : 34 --------------------------------------------------------------------- Number of tests : 3973 2649 Tests skipped : 1324 ( 33.3%) -------- Tests warned : 1 ( 0.0%) ( 0.0%) Tests failed : 26 ( 0.7%) ( 1.0%) Tests passed : 2622 ( 66.0%) ( 99.0%) --------------------------------------------------------------------- Time taken : 769 seconds ===================================================================== ===================================================================== FAILED TEST SUMMARY --------------------------------------------------------------------- Error message handling (with ZendOptimizer) [tests/run-test/test008.phpt] Convert warnings to exceptions [tests/lang/038.phpt] Bug #32828 (Throwing exception in output_callback function with ob_start and ob_end_clean leads to segfault) [tests/lang/bug32828.phpt] Bug #36268 (Object destructors called even after fatal errors) [Zend/tests/bug36268.phpt] Bug #41421 (Uncaught exception from a stream wrapper segfaults) [Zend/tests/bug41421.phpt] Bug #38474 (getAttribute select attribute by order, even when prefixed) (OK to fail with libxml2 < 2.6.2x) [ext/dom/tests/bug38474.phpt] Bug #42082 (NodeList length zero should be empty) [ext/dom/tests/bug42082.phpt] libgd #106 (imagerectangle 1x1 draws 1x3) [ext/gd/tests/libgd00106.phpt] dcngettext() tests [ext/gettext/tests/dcngettext.phpt] iconv_mime_encode() [ext/iconv/tests/iconv_mime_encode.phpt] iconv stream filter [ext/iconv/tests/iconv_stream_filter.phpt] SPL: spl_autoload() with methods [ext/spl/tests/spl_autoload_005.phpt] SPL: spl_autoload() with inaccessible methods [ext/spl/tests/spl_autoload_007.phpt] SPL: spl_autoload() with exceptions [ext/spl/tests/spl_autoload_008.phpt] Bug #35821 (array_map() segfaults when exception is throwed from the callback) [ext/standard/tests/array/bug35821.phpt] Bug #38450 (constructor is not called for classes used in userspace stream wrappers) [ext/standard/tests/file/bug38450_2.phpt] proc_open() regression test 1 (proc_open() leak) [ext/standard/tests/file/proc_open01.phpt] Test is_callable() function [ext/standard/tests/general_functions/is_callable.phpt] Bug #24142 (round() problems) [ext/standard/tests/math/bug24142.phpt] Bug #25694 (round() and number_format() inconsistency) [ext/standard/tests/math/bug25694.phpt] htmlentities() test 2 (setlocale / fr_FR.ISO-8859-15) [ext/standard/tests/strings/htmlentities02.phpt] (warn: possibly braindead libc) htmlentities() test 4 (setlocale / ja_JP.EUC-JP) [ext/standard/tests/strings/htmlentities04.phpt] htmlentities() test 15 (setlocale / KOI8-R) [ext/standard/tests/strings/htmlentities15.phpt] Test strtolower() function [ext/standard/tests/strings/strtolower.phpt] Test strtoupper() function [ext/standard/tests/strings/strtoupper1.phpt] Bug #32001 (xml_parse*() goes into infinite loop when autodetection in effect), using UTF-* [ext/xml/tests/bug32001.phpt] CLI long options [sapi/cli/tests/015.phpt] ===================================================================== ================================================================================ /home/fredrik/webserver/php-5.2.4/tests/run-test/test008.phpt ================================================================================ string(1) "1" string(4) "8191" string(1) "0" string(1) "1" string(1) "0" NULL string(16) "Division by zero" ================================================================================ 001- %s: %sivision by zero in %s on line %d 006+ NULL 008- string(%d) "%sivision by zer%s" ================================================================================ ================================================================================ /home/fredrik/webserver/php-5.2.4/tests/lang/038.phpt ================================================================================ string(15) "Error2Exception" Fatal error: Uncaught exception 'MyException' with message 'Undefined offset: 1' in :0 Stack trace: #0 /home/fredrik/webserver/php-5.2.4/tests/lang/038.php(29): Error2Exception(8, 'Undefined offse...', '/home/fredrik/w...', 29, Array) #1 {main} thrown in on line 1079863068 ================================================================================ 002+ 003+ Fatal error: Uncaught exception 'MyException' with message 'Undefined offset: 1' in :0 002- string(5) "fopen" 003- ===DONE=== 004+ Stack trace: 005+ #0 /home/fredrik/webserver/php-5.2.4/tests/lang/038.php(29): Error2Exception(8, 'Undefined offse...', '/home/fredrik/w...', 29, Array) 006+ #1 {main} 007+ thrown in on line 1079863068 ================================================================================ ================================================================================ /home/fredrik/webserver/php-5.2.4/tests/lang/bug32828.phpt ================================================================================ Fatal error: Uncaught exception 'Exception' in /home/fredrik/webserver/php-5.2.4/tests/lang/bug32828.php:5 Stack trace: #0 /home/fredrik/webserver/php-5.2.4/tests/lang/bug32828.php(10): output_handler('', 5) #1 {main} thrown in /home/fredrik/webserver/php-5.2.4/tests/lang/bug32828.php on line 5 ================================================================================ 003+ #0 /home/fredrik/webserver/php-5.2.4/tests/lang/bug32828.php(10): output_handler('', 5) 004+ #1 {main} 003- #0 [internal function]: output_handler('', %d) 004- #1 %s(%d): ob_end_clean() 005- #2 {main} ================================================================================ ================================================================================ /home/fredrik/webserver/php-5.2.4/Zend/tests/bug36268.phpt ================================================================================ Fatal error: Call to undefined function bar() in /home/fredrik/webserver/php-5.2.4/Zend/tests/bug36268.php on line 8 ================================================================================ 001+ Fatal error: Call to undefined function bar() in /home/fredrik/webserver/php-5.2.4/Zend/tests/bug36268.php on line 8 001- Fatal error: Call to undefined function bar() in %sbug36268.php on line 8 ================================================================================ ================================================================================ /home/fredrik/webserver/php-5.2.4/Zend/tests/bug41421.phpt ================================================================================ Warning: feof(): wrapper::stream_eof is not implemented! Assuming EOF in /home/fredrik/webserver/php-5.2.4/Zend/tests/bug41421.php on line 18 Fatal error: Uncaught exception 'Exception' in /home/fredrik/webserver/php-5.2.4/Zend/tests/bug41421.php:8 Stack trace: #0 /home/fredrik/webserver/php-5.2.4/Zend/tests/bug41421.php(14): wrapper->stream_eof() #1 {main} thrown in /home/fredrik/webserver/php-5.2.4/Zend/tests/bug41421.php on line 8 ================================================================================ 005+ #0 /home/fredrik/webserver/php-5.2.4/Zend/tests/bug41421.php(14): wrapper->stream_eof() 006+ #1 {main} 005- #0 [internal function]: wrapper->stream_eof() 006- #1 %s(%d): feof(Resource id #6) 007- #2 {main} ================================================================================ ================================================================================ /home/fredrik/webserver/php-5.2.4/ext/dom/tests/bug38474.phpt ================================================================================ bar bar bar bar baz2 ================================================================================ 001+ bar 001- foo 003+ bar 004+ bar 005+ 006+ 003- foo2 004- bar2 005- baz 008- baz ================================================================================ ================================================================================ /home/fredrik/webserver/php-5.2.4/ext/dom/tests/bug42082.phpt ================================================================================ Warning: DOMXPath::query(): xpath.c:11188 Internal error: document without root in /home/fredrik/webserver/php-5.2.4/ext/dom/tests/bug42082.php on line 4 object(DOMNodeList)#3 (0) { } int(0) bool(true) bool(true) string(0) "" bool(true) bool(true) bool(false) bool(false) ================================================================================ 001+ Warning: DOMXPath::query(): xpath.c:11188 Internal error: document without root in /home/fredrik/webserver/php-5.2.4/ext/dom/tests/bug42082.php on line 4 ================================================================================ ================================================================================ /home/fredrik/webserver/php-5.2.4/ext/gd/tests/libgd00106.phpt ================================================================================ failed ================================================================================ 001+ failed 001- Ok ================================================================================ ================================================================================ /home/fredrik/webserver/php-5.2.4/ext/gettext/tests/dcngettext.phpt ================================================================================ Warning: Wrong parameter count for dcngettext() in /home/fredrik/webserver/php-5.2.4/ext/gettext/tests/dcngettext.php on line 3 bool(false) string(1) "1" string(4) "test" string(4) "test" ================================================================================ 006- string(4) "test" 007- string(0) "" 008- string(0) "" 009- Done ================================================================================ ================================================================================ /home/fredrik/webserver/php-5.2.4/ext/iconv/tests/iconv_mime_encode.phpt ================================================================================ -------- line length=0 2: iconv_mime_encode(): Buffer length exceeded bool(false) -------- -------- line length=1 2: iconv_mime_encode(): Buffer length exceeded bool(false) -------- -------- line length=2 2: iconv_mime_encode(): Buffer length exceeded bool(false) -------- -------- line length=3 2: iconv_mime_encode(): Buffer length exceeded bool(false) -------- -------- line length=4 2: iconv_mime_encode(): Buffer length exceeded bool(false) -------- -------- line length=5 2: iconv_mime_encode(): Buffer length exceeded bool(false) -------- -------- line length=6 2: iconv_mime_encode(): Buffer length exceeded bool(false) -------- -------- line length=7 2: iconv_mime_encode(): Buffer length exceeded bool(false) -------- -------- line length=8 2: iconv_mime_encode(): Buffer length exceeded bool(false) -------- -------- line length=9 2: iconv_mime_encode(): Buffer length exceeded bool(false) -------- -------- line length=10 2: iconv_mime_encode(): Buffer length exceeded bool(false) -------- -------- line length=11 2: iconv_mime_encode(): Buffer length exceeded bool(false) -------- -------- line length=12 2: iconv_mime_encode(): Buffer length exceeded bool(false) -------- -------- line length=13 2: iconv_mime_encode(): Buffer length exceeded bool(false) -------- -------- line length=14 2: iconv_mime_encode(): Buffer length exceeded bool(false) -------- -------- line length=15 2: iconv_mime_encode(): Buffer length exceeded bool(false) -------- -------- line length=16 2: iconv_mime_encode(): Buffer length exceeded bool(false) -------- -------- line length=17 2: iconv_mime_encode(): Buffer length exceeded bool(false) -------- -------- line length=18 2: iconv_mime_encode(): Buffer length exceeded bool(false) -------- -------- line length=19 2: iconv_mime_encode(): Buffer length exceeded bool(false) -------- -------- line length=20 2: iconv_mime_encode(): Buffer length exceeded bool(false) -------- -------- line length=21 2: iconv_mime_encode(): Buffer length exceeded bool(false) -------- -------- line length=22 2: iconv_mime_encode(): Buffer length exceeded bool(false) -------- -------- line length=23 2: iconv_mime_encode(): Buffer length exceeded bool(false) -------- -------- line length=24 2: iconv_mime_encode(): Buffer length exceeded bool(false) -------- -------- line length=25 2: iconv_mime_encode(): Buffer length exceeded bool(false) -------- -------- line length=26 2: iconv_mime_encode(): Buffer length exceeded bool(false) -------- -------- line length=27 2: iconv_mime_encode(): Buffer length exceeded bool(false) -------- -------- line length=28 2: iconv_mime_encode(): Buffer length exceeded bool(false) -------- -------- line length=29 2: iconv_mime_encode(): Buffer length exceeded bool(false) -------- -------- line length=30 2: iconv_mime_encode(): Buffer length exceeded bool(false) -------- -------- line length=31 2: iconv_mime_encode(): Buffer length exceeded bool(false) -------- -------- line length=32 2: iconv_mime_encode(): Buffer length exceeded bool(false) -------- -------- line length=33 2: iconv_mime_encode(): Buffer length exceeded bool(false) -------- -------- line length=34 2: iconv_mime_encode(): Buffer length exceeded bool(false) -------- -------- line length=35 2: iconv_mime_encode(): Buffer length exceeded bool(false) -------- -------- line length=36 string(216) "From: =?ISO-2022-JP?B?GyRCJTUbKEI=?= =?ISO-2022-JP?B?JXMlVyVrSjgbKEI=?= =?ISO-2022-JP?B?O3pOcyU1JXMbKEI=?= =?ISO-2022-JP?B?JVcla0o4O3obKEI=?= =?ISO-2022-JP?B?TnNGfEtcOGwbKEI=?= =?ISO-2022-JP?B?JUYlLSU5JUgbKEI=?=" -------- bool(true) -------- line length=37 string(216) "From: =?ISO-2022-JP?B?GyRCJTUbKEI=?= =?ISO-2022-JP?B?JXMlVyVrSjgbKEI=?= =?ISO-2022-JP?B?O3pOcyU1JXMbKEI=?= =?ISO-2022-JP?B?JVcla0o4O3obKEI=?= =?ISO-2022-JP?B?TnNGfEtcOGwbKEI=?= =?ISO-2022-JP?B?JUYlLSU5JUgbKEI=?=" -------- bool(true) -------- line length=38 string(216) "From: =?ISO-2022-JP?B?GyRCJTUbKEI=?= =?ISO-2022-JP?B?JXMlVyVrSjgbKEI=?= =?ISO-2022-JP?B?O3pOcyU1JXMbKEI=?= =?ISO-2022-JP?B?JVcla0o4O3obKEI=?= =?ISO-2022-JP?B?TnNGfEtcOGwbKEI=?= =?ISO-2022-JP?B?JUYlLSU5JUgbKEI=?=" -------- bool(true) -------- line length=39 string(196) "From: =?ISO-2022-JP?B?GyRCJTUbKEI=?= =?ISO-2022-JP?B?JXMlVyVrSjg7ehsoQg==?= =?ISO-2022-JP?B?TnMlNSVzJVclaxsoQg==?= =?ISO-2022-JP?B?Sjg7ek5zRnxLXBsoQg==?= =?ISO-2022-JP?B?OGwlRiUtJTklSBsoQg==?=" -------- bool(true) -------- line length=40 string(196) "From: =?ISO-2022-JP?B?GyRCJTUlcxsoQg==?= =?ISO-2022-JP?B?JVcla0o4O3pOcxsoQg==?= =?ISO-2022-JP?B?JTUlcyVXJWtKOBsoQg==?= =?ISO-2022-JP?B?O3pOc0Z8S1w4bBsoQg==?= =?ISO-2022-JP?B?JUYlLSU5JUgbKEI=?=" -------- bool(true) -------- line length=41 string(196) "From: =?ISO-2022-JP?B?GyRCJTUlcxsoQg==?= =?ISO-2022-JP?B?JVcla0o4O3pOcxsoQg==?= =?ISO-2022-JP?B?JTUlcyVXJWtKOBsoQg==?= =?ISO-2022-JP?B?O3pOc0Z8S1w4bBsoQg==?= =?ISO-2022-JP?B?JUYlLSU5JUgbKEI=?=" -------- bool(true) -------- line length=42 string(196) "From: =?ISO-2022-JP?B?GyRCJTUlcxsoQg==?= =?ISO-2022-JP?B?JVcla0o4O3pOcxsoQg==?= =?ISO-2022-JP?B?JTUlcyVXJWtKOBsoQg==?= =?ISO-2022-JP?B?O3pOc0Z8S1w4bBsoQg==?= =?ISO-2022-JP?B?JUYlLSU5JUgbKEI=?=" -------- bool(true) -------- line length=43 string(168) "From: =?ISO-2022-JP?B?GyRCJTUlcxsoQg==?= =?ISO-2022-JP?B?JVcla0o4O3pOcyU1JXMbKEI=?= =?ISO-2022-JP?B?JVcla0o4O3pOc0Z8S1wbKEI=?= =?ISO-2022-JP?B?OGwlRiUtJTklSBsoQg==?=" -------- bool(true) -------- line length=44 string(164) "From: =?ISO-2022-JP?B?GyRCJTUlcyVXJWsbKEI=?= =?ISO-2022-JP?B?Sjg7ek5zJTUlcyVXJWsbKEI=?= =?ISO-2022-JP?B?Sjg7ek5zRnxLXDhsJUYbKEI=?= =?ISO-2022-JP?B?JS0lOSVIGyhC?=" -------- bool(true) -------- line length=45 string(164) "From: =?ISO-2022-JP?B?GyRCJTUlcyVXJWsbKEI=?= =?ISO-2022-JP?B?Sjg7ek5zJTUlcyVXJWsbKEI=?= =?ISO-2022-JP?B?Sjg7ek5zRnxLXDhsJUYbKEI=?= =?ISO-2022-JP?B?JS0lOSVIGyhC?=" -------- bool(true) -------- line length=46 string(164) "From: =?ISO-2022-JP?B?GyRCJTUlcyVXJWsbKEI=?= =?ISO-2022-JP?B?Sjg7ek5zJTUlcyVXJWsbKEI=?= =?ISO-2022-JP?B?Sjg7ek5zRnxLXDhsJUYbKEI=?= =?ISO-2022-JP?B?JS0lOSVIGyhC?=" -------- bool(true) -------- line length=47 string(168) "From: =?ISO-2022-JP?B?GyRCJTUlcyVXJWsbKEI=?= =?ISO-2022-JP?B?Sjg7ek5zJTUlcyVXJWtKOBsoQg==?= =?ISO-2022-JP?B?O3pOc0Z8S1w4bCVGJS0lORsoQg==?= =?ISO-2022-JP?B?JUgbKEI=?=" -------- bool(true) -------- line length=48 string(144) "From: =?ISO-2022-JP?B?GyRCJTUlcyVXJWtKOBsoQg==?= =?ISO-2022-JP?B?O3pOcyU1JXMlVyVrSjg7ehsoQg==?= =?ISO-2022-JP?B?TnNGfEtcOGwlRiUtJTklSBsoQg==?=" -------- bool(true) -------- line length=49 string(144) "From: =?ISO-2022-JP?B?GyRCJTUlcyVXJWtKOBsoQg==?= =?ISO-2022-JP?B?O3pOcyU1JXMlVyVrSjg7ehsoQg==?= =?ISO-2022-JP?B?TnNGfEtcOGwlRiUtJTklSBsoQg==?=" -------- bool(true) -------- line length=50 string(144) "From: =?ISO-2022-JP?B?GyRCJTUlcyVXJWtKOBsoQg==?= =?ISO-2022-JP?B?O3pOcyU1JXMlVyVrSjg7ehsoQg==?= =?ISO-2022-JP?B?TnNGfEtcOGwlRiUtJTklSBsoQg==?=" -------- bool(true) -------- line length=51 string(140) "From: =?ISO-2022-JP?B?GyRCJTUlcyVXJWtKOBsoQg==?= =?ISO-2022-JP?B?O3pOcyU1JXMlVyVrSjg7ek5zRnwbKEI=?= =?ISO-2022-JP?B?S1w4bCVGJS0lOSVIGyhC?=" -------- bool(true) -------- line length=52 string(140) "From: =?ISO-2022-JP?B?GyRCJTUlcyVXJWtKODt6TnMbKEI=?= =?ISO-2022-JP?B?JTUlcyVXJWtKODt6TnNGfEtcOGwbKEI=?= =?ISO-2022-JP?B?JUYlLSU5JUgbKEI=?=" -------- bool(true) -------- line length=53 string(140) "From: =?ISO-2022-JP?B?GyRCJTUlcyVXJWtKODt6TnMbKEI=?= =?ISO-2022-JP?B?JTUlcyVXJWtKODt6TnNGfEtcOGwbKEI=?= =?ISO-2022-JP?B?JUYlLSU5JUgbKEI=?=" -------- bool(true) -------- line length=54 string(140) "From: =?ISO-2022-JP?B?GyRCJTUlcyVXJWtKODt6TnMbKEI=?= =?ISO-2022-JP?B?JTUlcyVXJWtKODt6TnNGfEtcOGwbKEI=?= =?ISO-2022-JP?B?JUYlLSU5JUgbKEI=?=" -------- bool(true) -------- line length=55 string(140) "From: =?ISO-2022-JP?B?GyRCJTUlcyVXJWtKODt6TnMbKEI=?= =?ISO-2022-JP?B?JTUlcyVXJWtKODt6TnNGfEtcOGwlRhsoQg==?= =?ISO-2022-JP?B?JS0lOSVIGyhC?=" -------- bool(true) -------- line length=56 string(144) "From: =?ISO-2022-JP?B?GyRCJTUlcyVXJWtKODt6TnMlNRsoQg==?= =?ISO-2022-JP?B?JXMlVyVrSjg7ek5zRnxLXDhsJUYlLRsoQg==?= =?ISO-2022-JP?B?JTklSBsoQg==?=" -------- bool(true) -------- line length=57 string(144) "From: =?ISO-2022-JP?B?GyRCJTUlcyVXJWtKODt6TnMlNRsoQg==?= =?ISO-2022-JP?B?JXMlVyVrSjg7ek5zRnxLXDhsJUYlLRsoQg==?= =?ISO-2022-JP?B?JTklSBsoQg==?=" -------- bool(true) -------- line length=58 string(144) "From: =?ISO-2022-JP?B?GyRCJTUlcyVXJWtKODt6TnMlNRsoQg==?= =?ISO-2022-JP?B?JXMlVyVrSjg7ek5zRnxLXDhsJUYlLRsoQg==?= =?ISO-2022-JP?B?JTklSBsoQg==?=" -------- bool(true) -------- line length=59 string(116) "From: =?ISO-2022-JP?B?GyRCJTUlcyVXJWtKODt6TnMlNRsoQg==?= =?ISO-2022-JP?B?JXMlVyVrSjg7ek5zRnxLXDhsJUYlLSU5JUgbKEI=?=" -------- bool(true) -------- line length=60 string(116) "From: =?ISO-2022-JP?B?GyRCJTUlcyVXJWtKODt6TnMlNSVzJVcbKEI=?= =?ISO-2022-JP?B?JWtKODt6TnNGfEtcOGwlRiUtJTklSBsoQg==?=" -------- bool(true) -------- line length=61 string(116) "From: =?ISO-2022-JP?B?GyRCJTUlcyVXJWtKODt6TnMlNSVzJVcbKEI=?= =?ISO-2022-JP?B?JWtKODt6TnNGfEtcOGwlRiUtJTklSBsoQg==?=" -------- bool(true) -------- line length=62 string(116) "From: =?ISO-2022-JP?B?GyRCJTUlcyVXJWtKODt6TnMlNSVzJVcbKEI=?= =?ISO-2022-JP?B?JWtKODt6TnNGfEtcOGwlRiUtJTklSBsoQg==?=" -------- bool(true) -------- line length=63 string(116) "From: =?ISO-2022-JP?B?GyRCJTUlcyVXJWtKODt6TnMlNSVzJVcbKEI=?= =?ISO-2022-JP?B?JWtKODt6TnNGfEtcOGwlRiUtJTklSBsoQg==?=" -------- bool(true) -------- line length=64 string(116) "From: =?ISO-2022-JP?B?GyRCJTUlcyVXJWtKODt6TnMlNSVzJVclaxsoQg==?= =?ISO-2022-JP?B?Sjg7ek5zRnxLXDhsJUYlLSU5JUgbKEI=?=" -------- bool(true) -------- line length=65 string(116) "From: =?ISO-2022-JP?B?GyRCJTUlcyVXJWtKODt6TnMlNSVzJVclaxsoQg==?= =?ISO-2022-JP?B?Sjg7ek5zRnxLXDhsJUYlLSU5JUgbKEI=?=" -------- bool(true) -------- line length=66 string(116) "From: =?ISO-2022-JP?B?GyRCJTUlcyVXJWtKODt6TnMlNSVzJVclaxsoQg==?= =?ISO-2022-JP?B?Sjg7ek5zRnxLXDhsJUYlLSU5JUgbKEI=?=" -------- bool(true) -------- line length=67 string(116) "From: =?ISO-2022-JP?B?GyRCJTUlcyVXJWtKODt6TnMlNSVzJVclaxsoQg==?= =?ISO-2022-JP?B?Sjg7ek5zRnxLXDhsJUYlLSU5JUgbKEI=?=" -------- bool(true) -------- line length=68 string(116) "From: =?ISO-2022-JP?B?GyRCJTUlcyVXJWtKODt6TnMlNSVzJVcla0o4O3obKEI=?= =?ISO-2022-JP?B?TnNGfEtcOGwlRiUtJTklSBsoQg==?=" -------- bool(true) -------- line length=69 string(116) "From: =?ISO-2022-JP?B?GyRCJTUlcyVXJWtKODt6TnMlNSVzJVcla0o4O3obKEI=?= =?ISO-2022-JP?B?TnNGfEtcOGwlRiUtJTklSBsoQg==?=" -------- bool(true) -------- line length=70 string(116) "From: =?ISO-2022-JP?B?GyRCJTUlcyVXJWtKODt6TnMlNSVzJVcla0o4O3obKEI=?= =?ISO-2022-JP?B?TnNGfEtcOGwlRiUtJTklSBsoQg==?=" -------- bool(true) -------- line length=71 string(116) "From: =?ISO-2022-JP?B?GyRCJTUlcyVXJWtKODt6TnMlNSVzJVcla0o4O3obKEI=?= =?ISO-2022-JP?B?TnNGfEtcOGwlRiUtJTklSBsoQg==?=" -------- bool(true) -------- line length=72 string(116) "From: =?ISO-2022-JP?B?GyRCJTUlcyVXJWtKODt6TnMlNSVzJVcla0o4O3pOcxsoQg==?= =?ISO-2022-JP?B?RnxLXDhsJUYlLSU5JUgbKEI=?=" -------- bool(true) -------- line length=73 string(116) "From: =?ISO-2022-JP?B?GyRCJTUlcyVXJWtKODt6TnMlNSVzJVcla0o4O3pOcxsoQg==?= =?ISO-2022-JP?B?RnxLXDhsJUYlLSU5JUgbKEI=?=" -------- bool(true) -------- line length=74 string(116) "From: =?ISO-2022-JP?B?GyRCJTUlcyVXJWtKODt6TnMlNSVzJVcla0o4O3pOcxsoQg==?= =?ISO-2022-JP?B?RnxLXDhsJUYlLSU5JUgbKEI=?=" -------- bool(true) -------- line length=75 string(116) "From: =?ISO-2022-JP?B?GyRCJTUlcyVXJWtKODt6TnMlNSVzJVcla0o4O3pOcxsoQg==?= =?ISO-2022-JP?B?RnxLXDhsJUYlLSU5JUgbKEI=?=" -------- bool(true) -------- line length=76 string(116) "From: =?ISO-2022-JP?B?GyRCJTUlcyVXJWtKODt6TnMlNSVzJVcla0o4O3pOc0Z8S1wbKEI=?= =?ISO-2022-JP?B?OGwlRiUtJTklSBsoQg==?=" -------- bool(true) -------- line length=77 string(116) "From: =?ISO-2022-JP?B?GyRCJTUlcyVXJWtKODt6TnMlNSVzJVcla0o4O3pOc0Z8S1wbKEI=?= =?ISO-2022-JP?B?OGwlRiUtJTklSBsoQg==?=" -------- bool(true) -------- line length=78 string(116) "From: =?ISO-2022-JP?B?GyRCJTUlcyVXJWtKODt6TnMlNSVzJVcla0o4O3pOc0Z8S1wbKEI=?= =?ISO-2022-JP?B?OGwlRiUtJTklSBsoQg==?=" -------- bool(true) -------- line length=79 string(116) "From: =?ISO-2022-JP?B?GyRCJTUlcyVXJWtKODt6TnMlNSVzJVcla0o4O3pOc0Z8S1wbKEI=?= =?ISO-2022-JP?B?OGwlRiUtJTklSBsoQg==?=" -------- bool(true) ================================================================================ 146+ string(216) "From: =?ISO-2022-JP?B?GyRCJTUbKEI=?= 147+ =?ISO-2022-JP?B?JXMlVyVrSjgbKEI=?= 148+ =?ISO-2022-JP?B?O3pOcyU1JXMbKEI=?= 149+ =?ISO-2022-JP?B?JVcla0o4O3obKEI=?= 150+ =?ISO-2022-JP?B?TnNGfEtcOGwbKEI=?= 151+ =?ISO-2022-JP?B?JUYlLSU5JUgbKEI=?=" 146- string(396) "From: =?ISO-2022-JP?B?GyRCJTUbKEI=?= 147- =?ISO-2022-JP?B?GyRCJXMlVxsoQg==?= 148- =?ISO-2022-JP?B?GyRCJWtKOBsoQg==?= 149- =?ISO-2022-JP?B?GyRCO3pOcxsoQg==?= 150- =?ISO-2022-JP?B?GyRCJTUlcxsoQg==?= 151- =?ISO-2022-JP?B?GyRCJVclaxsoQg==?= 152- =?ISO-2022-JP?B?GyRCSjg7ehsoQg==?= 153- =?ISO-2022-JP?B?GyRCTnNGfBsoQg==?= 154- =?ISO-2022-JP?B?GyRCS1w4bBsoQg==?= 155- =?ISO-2022-JP?B?GyRCJUYlLRsoQg==?= 156- =?ISO-2022-JP?B?GyRCJTklSBsoQg==?=" 154+ string(216) "From: =?ISO-2022-JP?B?GyRCJTUbKEI=?= 155+ =?ISO-2022-JP?B?JXMlVyVrSjgbKEI=?= 156+ =?ISO-2022-JP?B?O3pOcyU1JXMbKEI=?= 157+ =?ISO-2022-JP?B?JVcla0o4O3obKEI=?= 158+ =?ISO-2022-JP?B?TnNGfEtcOGwbKEI=?= 159+ =?ISO-2022-JP?B?JUYlLSU5JUgbKEI=?=" 159- string(396) "From: =?ISO-2022-JP?B?GyRCJTUbKEI=?= 160- =?ISO-2022-JP?B?GyRCJXMlVxsoQg==?= 161- =?ISO-2022-JP?B?GyRCJWtKOBsoQg==?= 162- =?ISO-2022-JP?B?GyRCO3pOcxsoQg==?= 163- =?ISO-2022-JP?B?GyRCJTUlcxsoQg==?= 164- =?ISO-2022-JP?B?GyRCJVclaxsoQg==?= 165- =?ISO-2022-JP?B?GyRCSjg7ehsoQg==?= 166- =?ISO-2022-JP?B?GyRCTnNGfBsoQg==?= 167- =?ISO-2022-JP?B?GyRCS1w4bBsoQg==?= 168- =?ISO-2022-JP?B?GyRCJUYlLRsoQg==?= 169- =?ISO-2022-JP?B?GyRCJTklSBsoQg==?=" 162+ string(216) "From: =?ISO-2022-JP?B?GyRCJTUbKEI=?= 163+ =?ISO-2022-JP?B?JXMlVyVrSjgbKEI=?= 164+ =?ISO-2022-JP?B?O3pOcyU1JXMbKEI=?= 165+ =?ISO-2022-JP?B?JVcla0o4O3obKEI=?= 166+ =?ISO-2022-JP?B?TnNGfEtcOGwbKEI=?= 167+ =?ISO-2022-JP?B?JUYlLSU5JUgbKEI=?=" 170+ string(196) "From: =?ISO-2022-JP?B?GyRCJTUbKEI=?= 171+ =?ISO-2022-JP?B?JXMlVyVrSjg7ehsoQg==?= 172+ =?ISO-2022-JP?B?TnMlNSVzJVclaxsoQg==?= 173+ =?ISO-2022-JP?B?Sjg7ek5zRnxLXBsoQg==?= 174+ =?ISO-2022-JP?B?OGwlRiUtJTklSBsoQg==?=" 172- string(396) "From: =?ISO-2022-JP?B?GyRCJTUbKEI=?= 173- =?ISO-2022-JP?B?GyRCJXMlVxsoQg==?= 174- =?ISO-2022-JP?B?GyRCJWtKOBsoQg==?= 175- =?ISO-2022-JP?B?GyRCO3pOcxsoQg==?= 176- =?ISO-2022-JP?B?GyRCJTUlcxsoQg==?= 177- =?ISO-2022-JP?B?GyRCJVclaxsoQg==?= 178- =?ISO-2022-JP?B?GyRCSjg7ehsoQg==?= 179- =?ISO-2022-JP?B?GyRCTnNGfBsoQg==?= 180- =?ISO-2022-JP?B?GyRCS1w4bBsoQg==?= 181- =?ISO-2022-JP?B?GyRCJUYlLRsoQg==?= 182- =?ISO-2022-JP?B?GyRCJTklSBsoQg==?=" 177+ string(196) "From: =?ISO-2022-JP?B?GyRCJTUlcxsoQg==?= 178+ =?ISO-2022-JP?B?JVcla0o4O3pOcxsoQg==?= 179+ =?ISO-2022-JP?B?JTUlcyVXJWtKOBsoQg==?= 180+ =?ISO-2022-JP?B?O3pOc0Z8S1w4bBsoQg==?= 181+ =?ISO-2022-JP?B?JUYlLSU5JUgbKEI=?=" 184+ string(196) "From: =?ISO-2022-JP?B?GyRCJTUlcxsoQg==?= 185+ =?ISO-2022-JP?B?JVcla0o4O3pOcxsoQg==?= 186+ =?ISO-2022-JP?B?JTUlcyVXJWtKOBsoQg==?= 187+ =?ISO-2022-JP?B?O3pOc0Z8S1w4bBsoQg==?= 188+ =?ISO-2022-JP?B?JUYlLSU5JUgbKEI=?=" 185- string(236) "From: =?ISO-2022-JP?B?GyRCJTUbKEI=?= 186- =?ISO-2022-JP?B?GyRCJXMlVyVrSjgbKEI=?= 187- =?ISO-2022-JP?B?GyRCO3pOcyU1JXMbKEI=?= 188- =?ISO-2022-JP?B?GyRCJVcla0o4O3obKEI=?= 189- =?ISO-2022-JP?B?GyRCTnNGfEtcOGwbKEI=?= 190- =?ISO-2022-JP?B?GyRCJUYlLSU5JUgbKEI=?=" 191+ string(196) "From: =?ISO-2022-JP?B?GyRCJTUlcxsoQg==?= 192+ =?ISO-2022-JP?B?JVcla0o4O3pOcxsoQg==?= 193+ =?ISO-2022-JP?B?JTUlcyVXJWtKOBsoQg==?= 194+ =?ISO-2022-JP?B?O3pOc0Z8S1w4bBsoQg==?= 195+ =?ISO-2022-JP?B?JUYlLSU5JUgbKEI=?=" 193- string(236) "From: =?ISO-2022-JP?B?GyRCJTUlcxsoQg==?= 194- =?ISO-2022-JP?B?GyRCJVcla0o4O3obKEI=?= 195- =?ISO-2022-JP?B?GyRCTnMlNSVzJVcbKEI=?= 196- =?ISO-2022-JP?B?GyRCJWtKODt6TnMbKEI=?= 197- =?ISO-2022-JP?B?GyRCRnxLXDhsJUYbKEI=?= 198- =?ISO-2022-JP?B?GyRCJS0lOSVIGyhC?=" 198+ string(168) "From: =?ISO-2022-JP?B?GyRCJTUlcxsoQg==?= 199+ =?ISO-2022-JP?B?JVcla0o4O3pOcyU1JXMbKEI=?= 200+ =?ISO-2022-JP?B?JVcla0o4O3pOc0Z8S1wbKEI=?= 201+ =?ISO-2022-JP?B?OGwlRiUtJTklSBsoQg==?=" 201- string(236) "From: =?ISO-2022-JP?B?GyRCJTUlcxsoQg==?= 202- =?ISO-2022-JP?B?GyRCJVcla0o4O3obKEI=?= 203- =?ISO-2022-JP?B?GyRCTnMlNSVzJVcbKEI=?= 204- =?ISO-2022-JP?B?GyRCJWtKODt6TnMbKEI=?= 205- =?ISO-2022-JP?B?GyRCRnxLXDhsJUYbKEI=?= 206- =?ISO-2022-JP?B?GyRCJS0lOSVIGyhC?=" 204+ string(164) "From: =?ISO-2022-JP?B?GyRCJTUlcyVXJWsbKEI=?= 205+ =?ISO-2022-JP?B?Sjg7ek5zJTUlcyVXJWsbKEI=?= 206+ =?ISO-2022-JP?B?Sjg7ek5zRnxLXDhsJUYbKEI=?= 207+ =?ISO-2022-JP?B?JS0lOSVIGyhC?=" 209- string(236) "From: =?ISO-2022-JP?B?GyRCJTUlcxsoQg==?= 210- =?ISO-2022-JP?B?GyRCJVcla0o4O3obKEI=?= 211- =?ISO-2022-JP?B?GyRCTnMlNSVzJVcbKEI=?= 212- =?ISO-2022-JP?B?GyRCJWtKODt6TnMbKEI=?= 213- =?ISO-2022-JP?B?GyRCRnxLXDhsJUYbKEI=?= 214- =?ISO-2022-JP?B?GyRCJS0lOSVIGyhC?=" 210+ string(164) "From: =?ISO-2022-JP?B?GyRCJTUlcyVXJWsbKEI=?= 211+ =?ISO-2022-JP?B?Sjg7ek5zJTUlcyVXJWsbKEI=?= 212+ =?ISO-2022-JP?B?Sjg7ek5zRnxLXDhsJUYbKEI=?= 213+ =?ISO-2022-JP?B?JS0lOSVIGyhC?=" 216+ string(164) "From: =?ISO-2022-JP?B?GyRCJTUlcyVXJWsbKEI=?= 217+ =?ISO-2022-JP?B?Sjg7ek5zJTUlcyVXJWsbKEI=?= 218+ =?ISO-2022-JP?B?Sjg7ek5zRnxLXDhsJUYbKEI=?= 219+ =?ISO-2022-JP?B?JS0lOSVIGyhC?=" 217- string(212) "From: =?ISO-2022-JP?B?GyRCJTUlcxsoQg==?= 218- =?ISO-2022-JP?B?GyRCJVcla0o4O3pOcxsoQg==?= 219- =?ISO-2022-JP?B?GyRCJTUlcyVXJWtKOBsoQg==?= 220- =?ISO-2022-JP?B?GyRCO3pOc0Z8S1w4bBsoQg==?= 221- =?ISO-2022-JP?B?GyRCJUYlLSU5JUgbKEI=?=" 222+ string(168) "From: =?ISO-2022-JP?B?GyRCJTUlcyVXJWsbKEI=?= 223+ =?ISO-2022-JP?B?Sjg7ek5zJTUlcyVXJWtKOBsoQg==?= 224+ =?ISO-2022-JP?B?O3pOc0Z8S1w4bCVGJS0lORsoQg==?= 225+ =?ISO-2022-JP?B?JUgbKEI=?=" 224- string(212) "From: =?ISO-2022-JP?B?GyRCJTUlcyVXJWsbKEI=?= 225- =?ISO-2022-JP?B?GyRCSjg7ek5zJTUlcxsoQg==?= 226- =?ISO-2022-JP?B?GyRCJVcla0o4O3pOcxsoQg==?= 227- =?ISO-2022-JP?B?GyRCRnxLXDhsJUYlLRsoQg==?= 228- =?ISO-2022-JP?B?GyRCJTklSBsoQg==?=" 228+ string(144) "From: =?ISO-2022-JP?B?GyRCJTUlcyVXJWtKOBsoQg==?= 229+ =?ISO-2022-JP?B?O3pOcyU1JXMlVyVrSjg7ehsoQg==?= 230+ =?ISO-2022-JP?B?TnNGfEtcOGwlRiUtJTklSBsoQg==?=" 231- string(212) "From: =?ISO-2022-JP?B?GyRCJTUlcyVXJWsbKEI=?= 232- =?ISO-2022-JP?B?GyRCSjg7ek5zJTUlcxsoQg==?= 233- =?ISO-2022-JP?B?GyRCJVcla0o4O3pOcxsoQg==?= 234- =?ISO-2022-JP?B?GyRCRnxLXDhsJUYlLRsoQg==?= 235- =?ISO-2022-JP?B?GyRCJTklSBsoQg==?=" 233+ string(144) "From: =?ISO-2022-JP?B?GyRCJTUlcyVXJWtKOBsoQg==?= 234+ =?ISO-2022-JP?B?O3pOcyU1JXMlVyVrSjg7ehsoQg==?= 235+ =?ISO-2022-JP?B?TnNGfEtcOGwlRiUtJTklSBsoQg==?=" 238+ string(144) "From: =?ISO-2022-JP?B?GyRCJTUlcyVXJWtKOBsoQg==?= 239+ =?ISO-2022-JP?B?O3pOcyU1JXMlVyVrSjg7ehsoQg==?= 240+ =?ISO-2022-JP?B?TnNGfEtcOGwlRiUtJTklSBsoQg==?=" 238- string(212) "From: =?ISO-2022-JP?B?GyRCJTUlcyVXJWsbKEI=?= 239- =?ISO-2022-JP?B?GyRCSjg7ek5zJTUlcxsoQg==?= 240- =?ISO-2022-JP?B?GyRCJVcla0o4O3pOcxsoQg==?= 241- =?ISO-2022-JP?B?GyRCRnxLXDhsJUYlLRsoQg==?= 242- =?ISO-2022-JP?B?GyRCJTklSBsoQg==?=" 243+ string(140) "From: =?ISO-2022-JP?B?GyRCJTUlcyVXJWtKOBsoQg==?= 244+ =?ISO-2022-JP?B?O3pOcyU1JXMlVyVrSjg7ek5zRnwbKEI=?= 245+ =?ISO-2022-JP?B?S1w4bCVGJS0lOSVIGyhC?=" 245- string(176) "From: =?ISO-2022-JP?B?GyRCJTUlcyVXJWsbKEI=?= 246- =?ISO-2022-JP?B?GyRCSjg7ek5zJTUlcyVXJWsbKEI=?= 247- =?ISO-2022-JP?B?GyRCSjg7ek5zRnxLXDhsJUYbKEI=?= 248- =?ISO-2022-JP?B?GyRCJS0lOSVIGyhC?=" 248+ string(140) "From: =?ISO-2022-JP?B?GyRCJTUlcyVXJWtKODt6TnMbKEI=?= 249+ =?ISO-2022-JP?B?JTUlcyVXJWtKODt6TnNGfEtcOGwbKEI=?= 250+ =?ISO-2022-JP?B?JUYlLSU5JUgbKEI=?=" 251- string(180) "From: =?ISO-2022-JP?B?GyRCJTUlcyVXJWtKOBsoQg==?= 252- =?ISO-2022-JP?B?GyRCO3pOcyU1JXMlVyVrSjgbKEI=?= 253- =?ISO-2022-JP?B?GyRCO3pOc0Z8S1w4bCVGJS0bKEI=?= 254- =?ISO-2022-JP?B?GyRCJTklSBsoQg==?=" 253+ string(140) "From: =?ISO-2022-JP?B?GyRCJTUlcyVXJWtKODt6TnMbKEI=?= 254+ =?ISO-2022-JP?B?JTUlcyVXJWtKODt6TnNGfEtcOGwbKEI=?= 255+ =?ISO-2022-JP?B?JUYlLSU5JUgbKEI=?=" 257- string(180) "From: =?ISO-2022-JP?B?GyRCJTUlcyVXJWtKOBsoQg==?= 258- =?ISO-2022-JP?B?GyRCO3pOcyU1JXMlVyVrSjgbKEI=?= 259- =?ISO-2022-JP?B?GyRCO3pOc0Z8S1w4bCVGJS0bKEI=?= 260- =?ISO-2022-JP?B?GyRCJTklSBsoQg==?=" 258+ string(140) "From: =?ISO-2022-JP?B?GyRCJTUlcyVXJWtKODt6TnMbKEI=?= 259+ =?ISO-2022-JP?B?JTUlcyVXJWtKODt6TnNGfEtcOGwbKEI=?= 260+ =?ISO-2022-JP?B?JUYlLSU5JUgbKEI=?=" 263+ string(140) "From: =?ISO-2022-JP?B?GyRCJTUlcyVXJWtKODt6TnMbKEI=?= 264+ =?ISO-2022-JP?B?JTUlcyVXJWtKODt6TnNGfEtcOGwlRhsoQg==?= 265+ =?ISO-2022-JP?B?JS0lOSVIGyhC?=" 263- string(180) "From: =?ISO-2022-JP?B?GyRCJTUlcyVXJWtKOBsoQg==?= 264- =?ISO-2022-JP?B?GyRCO3pOcyU1JXMlVyVrSjgbKEI=?= 265- =?ISO-2022-JP?B?GyRCO3pOc0Z8S1w4bCVGJS0bKEI=?= 266- =?ISO-2022-JP?B?GyRCJTklSBsoQg==?=" 268+ string(144) "From: =?ISO-2022-JP?B?GyRCJTUlcyVXJWtKODt6TnMlNRsoQg==?= 269+ =?ISO-2022-JP?B?JXMlVyVrSjg7ek5zRnxLXDhsJUYlLRsoQg==?= 270+ =?ISO-2022-JP?B?JTklSBsoQg==?=" 269- string(152) "From: =?ISO-2022-JP?B?GyRCJTUlcyVXJWtKOBsoQg==?= 270- =?ISO-2022-JP?B?GyRCO3pOcyU1JXMlVyVrSjg7ehsoQg==?= 271- =?ISO-2022-JP?B?GyRCTnNGfEtcOGwlRiUtJTklSBsoQg==?=" 273+ string(144) "From: =?ISO-2022-JP?B?GyRCJTUlcyVXJWtKODt6TnMlNRsoQg==?= 274+ =?ISO-2022-JP?B?JXMlVyVrSjg7ek5zRnxLXDhsJUYlLRsoQg==?= 275+ =?ISO-2022-JP?B?JTklSBsoQg==?=" 274- string(148) "From: =?ISO-2022-JP?B?GyRCJTUlcyVXJWtKODt6TnMbKEI=?= 275- =?ISO-2022-JP?B?GyRCJTUlcyVXJWtKODt6TnNGfBsoQg==?= 276- =?ISO-2022-JP?B?GyRCS1w4bCVGJS0lOSVIGyhC?=" 278+ string(144) "From: =?ISO-2022-JP?B?GyRCJTUlcyVXJWtKODt6TnMlNRsoQg==?= 279+ =?ISO-2022-JP?B?JXMlVyVrSjg7ek5zRnxLXDhsJUYlLRsoQg==?= 280+ =?ISO-2022-JP?B?JTklSBsoQg==?=" 279- string(148) "From: =?ISO-2022-JP?B?GyRCJTUlcyVXJWtKODt6TnMbKEI=?= 280- =?ISO-2022-JP?B?GyRCJTUlcyVXJWtKODt6TnNGfBsoQg==?= 281- =?ISO-2022-JP?B?GyRCS1w4bCVGJS0lOSVIGyhC?=" 283+ string(116) "From: =?ISO-2022-JP?B?GyRCJTUlcyVXJWtKODt6TnMlNRsoQg==?= 284+ =?ISO-2022-JP?B?JXMlVyVrSjg7ek5zRnxLXDhsJUYlLSU5JUgbKEI=?=" 284- string(148) "From: =?ISO-2022-JP?B?GyRCJTUlcyVXJWtKODt6TnMbKEI=?= 285- =?ISO-2022-JP?B?GyRCJTUlcyVXJWtKODt6TnNGfBsoQg==?= 286- =?ISO-2022-JP?B?GyRCS1w4bCVGJS0lOSVIGyhC?=" 287+ string(116) "From: =?ISO-2022-JP?B?GyRCJTUlcyVXJWtKODt6TnMlNSVzJVcbKEI=?= 288+ =?ISO-2022-JP?B?JWtKODt6TnNGfEtcOGwlRiUtJTklSBsoQg==?=" 289- string(148) "From: =?ISO-2022-JP?B?GyRCJTUlcyVXJWtKODt6TnMbKEI=?= 290- =?ISO-2022-JP?B?GyRCJTUlcyVXJWtKODt6TnNGfEtcOGwbKEI=?= 291- =?ISO-2022-JP?B?GyRCJUYlLSU5JUgbKEI=?=" 291+ string(116) "From: =?ISO-2022-JP?B?GyRCJTUlcyVXJWtKODt6TnMlNSVzJVcbKEI=?= 292+ =?ISO-2022-JP?B?JWtKODt6TnNGfEtcOGwlRiUtJTklSBsoQg==?=" 294- string(148) "From: =?ISO-2022-JP?B?GyRCJTUlcyVXJWtKODt6TnMlNRsoQg==?= 295- =?ISO-2022-JP?B?GyRCJXMlVyVrSjg7ek5zRnxLXDhsJUYbKEI=?= 296- =?ISO-2022-JP?B?GyRCJS0lOSVIGyhC?=" 295+ string(116) "From: =?ISO-2022-JP?B?GyRCJTUlcyVXJWtKODt6TnMlNSVzJVcbKEI=?= 296+ =?ISO-2022-JP?B?JWtKODt6TnNGfEtcOGwlRiUtJTklSBsoQg==?=" 299+ string(116) "From: =?ISO-2022-JP?B?GyRCJTUlcyVXJWtKODt6TnMlNSVzJVcbKEI=?= 300+ =?ISO-2022-JP?B?JWtKODt6TnNGfEtcOGwlRiUtJTklSBsoQg==?=" 299- string(148) "From: =?ISO-2022-JP?B?GyRCJTUlcyVXJWtKODt6TnMlNRsoQg==?= 300- =?ISO-2022-JP?B?GyRCJXMlVyVrSjg7ek5zRnxLXDhsJUYbKEI=?= 301- =?ISO-2022-JP?B?GyRCJS0lOSVIGyhC?=" 303+ string(116) "From: =?ISO-2022-JP?B?GyRCJTUlcyVXJWtKODt6TnMlNSVzJVclaxsoQg==?= 304+ =?ISO-2022-JP?B?Sjg7ek5zRnxLXDhsJUYlLSU5JUgbKEI=?=" 304- string(148) "From: =?ISO-2022-JP?B?GyRCJTUlcyVXJWtKODt6TnMlNRsoQg==?= 305- =?ISO-2022-JP?B?GyRCJXMlVyVrSjg7ek5zRnxLXDhsJUYbKEI=?= 306- =?ISO-2022-JP?B?GyRCJS0lOSVIGyhC?=" 307+ string(116) "From: =?ISO-2022-JP?B?GyRCJTUlcyVXJWtKODt6TnMlNSVzJVclaxsoQg==?= 308+ =?ISO-2022-JP?B?Sjg7ek5zRnxLXDhsJUYlLSU5JUgbKEI=?=" 309- string(152) "From: =?ISO-2022-JP?B?GyRCJTUlcyVXJWtKODt6TnMlNRsoQg==?= 310- =?ISO-2022-JP?B?GyRCJXMlVyVrSjg7ek5zRnxLXDhsJUYlLRsoQg==?= 311- =?ISO-2022-JP?B?GyRCJTklSBsoQg==?=" 311+ string(116) "From: =?ISO-2022-JP?B?GyRCJTUlcyVXJWtKODt6TnMlNSVzJVclaxsoQg==?= 312+ =?ISO-2022-JP?B?Sjg7ek5zRnxLXDhsJUYlLSU5JUgbKEI=?=" 314- string(120) "From: =?ISO-2022-JP?B?GyRCJTUlcyVXJWtKODt6TnMlNSVzJVcbKEI=?= 315- =?ISO-2022-JP?B?GyRCJWtKODt6TnNGfEtcOGwlRiUtJTklSBsoQg==?=" 315+ string(116) "From: =?ISO-2022-JP?B?GyRCJTUlcyVXJWtKODt6TnMlNSVzJVclaxsoQg==?= 316+ =?ISO-2022-JP?B?Sjg7ek5zRnxLXDhsJUYlLSU5JUgbKEI=?=" 318- string(120) "From: =?ISO-2022-JP?B?GyRCJTUlcyVXJWtKODt6TnMlNSVzJVcbKEI=?= 319- =?ISO-2022-JP?B?GyRCJWtKODt6TnNGfEtcOGwlRiUtJTklSBsoQg==?=" 319+ string(116) "From: =?ISO-2022-JP?B?GyRCJTUlcyVXJWtKODt6TnMlNSVzJVcla0o4O3obKEI=?= 320+ =?ISO-2022-JP?B?TnNGfEtcOGwlRiUtJTklSBsoQg==?=" 322- string(120) "From: =?ISO-2022-JP?B?GyRCJTUlcyVXJWtKODt6TnMlNSVzJVcbKEI=?= 323- =?ISO-2022-JP?B?GyRCJWtKODt6TnNGfEtcOGwlRiUtJTklSBsoQg==?=" 323+ string(116) "From: =?ISO-2022-JP?B?GyRCJTUlcyVXJWtKODt6TnMlNSVzJVcla0o4O3obKEI=?= 324+ =?ISO-2022-JP?B?TnNGfEtcOGwlRiUtJTklSBsoQg==?=" 326- string(120) "From: =?ISO-2022-JP?B?GyRCJTUlcyVXJWtKODt6TnMlNSVzJVcbKEI=?= 327- =?ISO-2022-JP?B?GyRCJWtKODt6TnNGfEtcOGwlRiUtJTklSBsoQg==?=" 327+ string(116) "From: =?ISO-2022-JP?B?GyRCJTUlcyVXJWtKODt6TnMlNSVzJVcla0o4O3obKEI=?= 328+ =?ISO-2022-JP?B?TnNGfEtcOGwlRiUtJTklSBsoQg==?=" 330- string(120) "From: =?ISO-2022-JP?B?GyRCJTUlcyVXJWtKODt6TnMlNSVzJVclaxsoQg==?= 331- =?ISO-2022-JP?B?GyRCSjg7ek5zRnxLXDhsJUYlLSU5JUgbKEI=?=" 331+ string(116) "From: =?ISO-2022-JP?B?GyRCJTUlcyVXJWtKODt6TnMlNSVzJVcla0o4O3obKEI=?= 332+ =?ISO-2022-JP?B?TnNGfEtcOGwlRiUtJTklSBsoQg==?=" 334- string(120) "From: =?ISO-2022-JP?B?GyRCJTUlcyVXJWtKODt6TnMlNSVzJVclaxsoQg==?= 335- =?ISO-2022-JP?B?GyRCSjg7ek5zRnxLXDhsJUYlLSU5JUgbKEI=?=" 335+ string(116) "From: =?ISO-2022-JP?B?GyRCJTUlcyVXJWtKODt6TnMlNSVzJVcla0o4O3pOcxsoQg==?= 336+ =?ISO-2022-JP?B?RnxLXDhsJUYlLSU5JUgbKEI=?=" 338- string(120) "From: =?ISO-2022-JP?B?GyRCJTUlcyVXJWtKODt6TnMlNSVzJVclaxsoQg==?= 339- =?ISO-2022-JP?B?GyRCSjg7ek5zRnxLXDhsJUYlLSU5JUgbKEI=?=" 339+ string(116) "From: =?ISO-2022-JP?B?GyRCJTUlcyVXJWtKODt6TnMlNSVzJVcla0o4O3pOcxsoQg==?= 340+ =?ISO-2022-JP?B?RnxLXDhsJUYlLSU5JUgbKEI=?=" 342- string(120) "From: =?ISO-2022-JP?B?GyRCJTUlcyVXJWtKODt6TnMlNSVzJVclaxsoQg==?= 343- =?ISO-2022-JP?B?GyRCSjg7ek5zRnxLXDhsJUYlLSU5JUgbKEI=?=" 343+ string(116) "From: =?ISO-2022-JP?B?GyRCJTUlcyVXJWtKODt6TnMlNSVzJVcla0o4O3pOcxsoQg==?= 344+ =?ISO-2022-JP?B?RnxLXDhsJUYlLSU5JUgbKEI=?=" 346- string(120) "From: =?ISO-2022-JP?B?GyRCJTUlcyVXJWtKODt6TnMlNSVzJVcla0o4O3obKEI=?= 347- =?ISO-2022-JP?B?GyRCTnNGfEtcOGwlRiUtJTklSBsoQg==?=" 347+ string(116) "From: =?ISO-2022-JP?B?GyRCJTUlcyVXJWtKODt6TnMlNSVzJVcla0o4O3pOcxsoQg==?= 348+ =?ISO-2022-JP?B?RnxLXDhsJUYlLSU5JUgbKEI=?=" 350- string(120) "From: =?ISO-2022-JP?B?GyRCJTUlcyVXJWtKODt6TnMlNSVzJVcla0o4O3obKEI=?= 351- =?ISO-2022-JP?B?GyRCTnNGfEtcOGwlRiUtJTklSBsoQg==?=" 351+ string(116) "From: =?ISO-2022-JP?B?GyRCJTUlcyVXJWtKODt6TnMlNSVzJVcla0o4O3pOc0Z8S1wbKEI=?= 352+ =?ISO-2022-JP?B?OGwlRiUtJTklSBsoQg==?=" 354- string(120) "From: =?ISO-2022-JP?B?GyRCJTUlcyVXJWtKODt6TnMlNSVzJVcla0o4O3obKEI=?= 355- =?ISO-2022-JP?B?GyRCTnNGfEtcOGwlRiUtJTklSBsoQg==?=" 355+ string(116) "From: =?ISO-2022-JP?B?GyRCJTUlcyVXJWtKODt6TnMlNSVzJVcla0o4O3pOc0Z8S1wbKEI=?= 356+ =?ISO-2022-JP?B?OGwlRiUtJTklSBsoQg==?=" 358- string(120) "From: =?ISO-2022-JP?B?GyRCJTUlcyVXJWtKODt6TnMlNSVzJVcla0o4O3obKEI=?= 359- =?ISO-2022-JP?B?GyRCTnNGfEtcOGwlRiUtJTklSBsoQg==?=" 359+ string(116) "From: =?ISO-2022-JP?B?GyRCJTUlcyVXJWtKODt6TnMlNSVzJVcla0o4O3pOc0Z8S1wbKEI=?= 360+ =?ISO-2022-JP?B?OGwlRiUtJTklSBsoQg==?=" 362- string(120) "From: =?ISO-2022-JP?B?GyRCJTUlcyVXJWtKODt6TnMlNSVzJVcla0o4O3pOcxsoQg==?= 363- =?ISO-2022-JP?B?GyRCRnxLXDhsJUYlLSU5JUgbKEI=?=" 363+ string(116) "From: =?ISO-2022-JP?B?GyRCJTUlcyVXJWtKODt6TnMlNSVzJVcla0o4O3pOc0Z8S1wbKEI=?= 364+ =?ISO-2022-JP?B?OGwlRiUtJTklSBsoQg==?=" 366- string(120) "From: =?ISO-2022-JP?B?GyRCJTUlcyVXJWtKODt6TnMlNSVzJVcla0o4O3pOcxsoQg==?= 367- =?ISO-2022-JP?B?GyRCRnxLXDhsJUYlLSU5JUgbKEI=?=" 370- string(120) "From: =?ISO-2022-JP?B?GyRCJTUlcyVXJWtKODt6TnMlNSVzJVcla0o4O3pOcxsoQg==?= 371- =?ISO-2022-JP?B?GyRCRnxLXDhsJUYlLSU5JUgbKEI=?=" 374- string(120) "From: =?ISO-2022-JP?B?GyRCJTUlcyVXJWtKODt6TnMlNSVzJVcla0o4O3pOcxsoQg==?= 375- =?ISO-2022-JP?B?GyRCRnxLXDhsJUYlLSU5JUgbKEI=?=" 378- string(120) "From: =?ISO-2022-JP?B?GyRCJTUlcyVXJWtKODt6TnMlNSVzJVcla0o4O3pOc0Z8S1wbKEI=?= 379- =?ISO-2022-JP?B?GyRCOGwlRiUtJTklSBsoQg==?=" 382- string(120) "From: =?ISO-2022-JP?B?GyRCJTUlcyVXJWtKODt6TnMlNSVzJVcla0o4O3pOc0Z8S1wbKEI=?= 383- =?ISO-2022-JP?B?GyRCOGwlRiUtJTklSBsoQg==?=" 386- string(120) "From: =?ISO-2022-JP?B?GyRCJTUlcyVXJWtKODt6TnMlNSVzJVcla0o4O3pOc0Z8S1wbKEI=?= 387- =?ISO-2022-JP?B?GyRCOGwlRiUtJTklSBsoQg==?=" 390- string(120) "From: =?ISO-2022-JP?B?GyRCJTUlcyVXJWtKODt6TnMlNSVzJVcla0o4O3pOc0Z8S1wbKEI=?= 391- =?ISO-2022-JP?B?GyRCOGwlRiUtJTklSBsoQg==?=" ================================================================================ ================================================================================ /home/fredrik/webserver/php-5.2.4/ext/iconv/tests/iconv_stream_filter.phpt ================================================================================ string(20) "1b244224332473244b24" string(10) "41244f1b28" string(2) "42" string(20) "a4b3a4f3a4cba4c1a4cf" string(10) "69636f6e76" string(2) "0a" string(20) "1b244f24332466245824" string(10) "4e24421b28" string(2) "4f" ================================================================================ 007+ string(20) "1b244f24332466245824" 008+ string(10) "4e24421b28" 009+ string(2) "4f" 007- 008- Warning: fread(): iconv stream filter ("ISO-2022-JP"=>"EUC-JP"): invalid multibyte sequence in %s on line %d 009- string(0) "" 010- string(0) "" 011- string(0) "" ================================================================================ ================================================================================ /home/fredrik/webserver/php-5.2.4/ext/spl/tests/spl_autoload_005.phpt ================================================================================ Strict Standards: Non-static method MyAutoLoader::autoLoad() cannot be called statically in /home/fredrik/webserver/php-5.2.4/ext/spl/tests/spl_autoload_005.php on line 19 Exception: Passed array specifies a non static method but no object MyAutoLoader::autoLoad(TestClass) MyAutoLoader::autoThrow(TestClass) Exception: Unavailable ===DONE=== ================================================================================ 001+ Strict Standards: Non-static method MyAutoLoader::autoLoad() cannot be called statically in /home/fredrik/webserver/php-5.2.4/ext/spl/tests/spl_autoload_005.php on line 19 ================================================================================ ================================================================================ /home/fredrik/webserver/php-5.2.4/ext/spl/tests/spl_autoload_007.phpt ================================================================================ string(22) "MyAutoLoader::notExist" Function 'MyAutoLoader::notExist' not found string(22) "MyAutoLoader::noAccess" Function 'MyAutoLoader::noAccess' not callable string(22) "MyAutoLoader::autoLoad" ok string(22) "MyAutoLoader::dynaLoad" Function 'MyAutoLoader::dynaLoad' not callable array(2) { [0]=> string(12) "MyAutoLoader" [1]=> string(8) "notExist" } MyAutoLoader::autoLoad(321o67vfigy0) MyAutoLoader::autoLoad(321o67vfigy0) Passed array does not specify an existing static method array(2) { [0]=> string(12) "MyAutoLoader" [1]=> string(8) "noAccess" } Passed array does not specify a callable static method array(2) { [0]=> string(12) "MyAutoLoader" [1]=> string(8) "autoLoad" } ok array(2) { [0]=> string(12) "MyAutoLoader" [1]=> string(8) "dynaLoad" } Strict Standards: Non-static method MyAutoLoader::dynaLoad() cannot be called statically in /home/fredrik/webserver/php-5.2.4/ext/spl/tests/spl_autoload_007.php on line 41 Passed array specifies a non static method but no object array(2) { [0]=> object(MyAutoLoader)#1 (0) { } [1]=> string(8) "notExist" } Passed array does not specify an existing method array(2) { [0]=> object(MyAutoLoader)#1 (0) { } [1]=> string(8) "noAccess" } Passed array does not specify a callable method array(2) { [0]=> object(MyAutoLoader)#1 (0) { } [1]=> string(8) "autoLoad" } ok array(2) { [0]=> object(MyAutoLoader)#1 (0) { } [1]=> string(8) "dynaLoad" } ok ===DONE=== ================================================================================ 019+ MyAutoLoader::autoLoad(321o67vfigy0) 020+ MyAutoLoader::autoLoad(321o67vfigy0) 045+ 046+ Strict Standards: Non-static method MyAutoLoader::dynaLoad() cannot be called statically in /home/fredrik/webserver/php-5.2.4/ext/spl/tests/spl_autoload_007.php on line 41 ================================================================================ ================================================================================ /home/fredrik/webserver/php-5.2.4/ext/spl/tests/spl_autoload_008.phpt ================================================================================ ====0==== string(10) "MyAutoLoad" registered MyAutoLoad(NoExistingTestClass) Exception: Bla int(0) ====1==== string(22) "MyAutoLoader::autoLoad" registered MyAutoLoader::autoLoad(NoExistingTestClass) Exception: Bla int(0) ====2==== string(22) "MyAutoLoader::dynaLoad" LogicException: Function 'MyAutoLoader::dynaLoad' not callable int(0) ====3==== array(2) { [0]=> string(12) "MyAutoLoader" [1]=> string(8) "autoLoad" } registered MyAutoLoader::autoLoad(NoExistingTestClass) Exception: Bla int(0) ====4==== array(2) { [0]=> string(12) "MyAutoLoader" [1]=> string(8) "dynaLoad" } Strict Standards: Non-static method MyAutoLoader::dynaLoad() cannot be called statically in /home/fredrik/webserver/php-5.2.4/ext/spl/tests/spl_autoload_008.php on line 43 LogicException: Passed array specifies a non static method but no object int(0) ====5==== array(2) { [0]=> object(MyAutoLoader)#1 (0) { } [1]=> string(8) "autoLoad" } registered MyAutoLoader::autoLoad(NoExistingTestClass) Exception: Bla int(0) ====6==== array(2) { [0]=> object(MyAutoLoader)#1 (0) { } [1]=> string(8) "dynaLoad" } registered MyAutoLoader::dynaLoad(NoExistingTestClass) Exception: Bla int(0) ===DONE=== ================================================================================ 035+ 036+ Strict Standards: Non-static method MyAutoLoader::dynaLoad() cannot be called statically in /home/fredrik/webserver/php-5.2.4/ext/spl/tests/spl_autoload_008.php on line 43 ================================================================================ ================================================================================ /home/fredrik/webserver/php-5.2.4/ext/standard/tests/array/bug35821.phpt ================================================================================ Warning: array_map(): An error occurred while invoking the map callback in /home/fredrik/webserver/php-5.2.4/ext/standard/tests/array/bug35821.php on line 21 Fatal error: Uncaught exception 'Exception' in /home/fredrik/webserver/php-5.2.4/ext/standard/tests/array/bug35821.php:7 Stack trace: #0 /home/fredrik/webserver/php-5.2.4/ext/standard/tests/array/bug35821.php(12): Element->ThrowException() #1 /home/fredrik/webserver/php-5.2.4/ext/standard/tests/array/bug35821.php(17): Element::CallBack(Object(Element)) #2 {main} thrown in /home/fredrik/webserver/php-5.2.4/ext/standard/tests/array/bug35821.php on line 7 ================================================================================ 006+ #1 /home/fredrik/webserver/php-5.2.4/ext/standard/tests/array/bug35821.php(17): Element::CallBack(Object(Element)) 007+ #2 {main} 006- #1 [internal function]: Element::CallBack(Object(Element)) 007- #2 %s(%d): array_map(Array, Array) 008- #3 {main} ================================================================================ ================================================================================ /home/fredrik/webserver/php-5.2.4/ext/standard/tests/file/bug38450_2.phpt ================================================================================ Warning: Missing argument 1 for VariableStream::__construct() in /home/fredrik/webserver/php-5.2.4/ext/standard/tests/file/bug38450_2.php on line 7 Warning: fopen(var://myvar): failed to open stream: "VariableStream::stream_open" call failed in /home/fredrik/webserver/php-5.2.4/ext/standard/tests/file/bug38450_2.php on line 101 Fatal error: Uncaught exception 'Exception' with message 'constructor' in /home/fredrik/webserver/php-5.2.4/ext/standard/tests/file/bug38450_2.php:8 Stack trace: #0 /home/fredrik/webserver/php-5.2.4/ext/standard/tests/file/bug38450_2.php(86): VariableStream->__construct() #1 {main} thrown in /home/fredrik/webserver/php-5.2.4/ext/standard/tests/file/bug38450_2.php on line 8 ================================================================================ 007+ #0 /home/fredrik/webserver/php-5.2.4/ext/standard/tests/file/bug38450_2.php(86): VariableStream->__construct() 008+ #1 {main} 007- #0 [internal function]: VariableStream->__construct() 008- #1 %s(%d): fopen('var://myvar', 'r+') 009- #2 {main} ================================================================================ ================================================================================ /home/fredrik/webserver/php-5.2.4/ext/standard/tests/file/proc_open01.phpt ================================================================================ array(2) { [0]=> resource(4) of type (stream) [1]=> resource(5) of type (stream) } terminated after 1000 iterations string(0) "" array(3) { [0]=> int(1) [1]=> int(2) [2]=> int(3) } ================================================================================ 007+ terminated after 1000 iterations 008+ string(0) "" 007- string(5) "yay! 008- " ================================================================================ ================================================================================ /home/fredrik/webserver/php-5.2.4/ext/standard/tests/general_functions/is_callable.phpt ================================================================================ *** Testing is_callable() on defined functions *** -- Iteration 1 -- bool(true) bool(true) bool(true) bool(true) bool(true) someFunction -- Iteration 2 -- bool(true) bool(true) bool(true) bool(true) bool(true) x123 -- Iteration 3 -- bool(true) bool(true) bool(true) bool(true) bool(true) NULL -- Iteration 4 -- bool(true) bool(true) bool(true) bool(true) bool(true) false -- Iteration 5 -- bool(true) bool(true) bool(true) bool(true) bool(true) Hello_World *** Testing is_callable() on undefined functions *** -- Iteration 1 -- bool(false) bool(true) bool(true) bool(false) bool(false) -- Iteration 2 -- bool(false) bool(true) bool(true) bool(false) bool(false) -- Iteration 3 -- bool(false) bool(true) bool(true) bool(false) bool(false) -- Iteration 4 -- bool(false) bool(true) bool(true) bool(false) bool(false) -- Iteration 5 -- bool(false) bool(true) bool(true) bool(false) bool(false) 12356 -- Iteration 6 -- bool(false) bool(true) bool(true) bool(false) bool(false) -- Iteration 7 -- bool(false) bool(true) bool(true) bool(false) bool(false) \0 -- Iteration 8 -- bool(false) bool(true) bool(true) bool(false) bool(false) hello world -- Iteration 9 -- bool(false) bool(true) bool(true) bool(false) bool(false) hello world -- Iteration 10 -- bool(false) bool(true) bool(true) bool(false) bool(false) welcome -- Iteration 11 -- bool(false) bool(true) bool(true) bool(false) bool(false) welcome\0 -- Iteration 12 -- bool(false) bool(true) bool(true) bool(false) bool(false) ==%%%***$$$@@@!! -- Iteration 13 -- bool(true) bool(true) bool(true) bool(true) bool(true) false -- Iteration 14 -- bool(false) bool(true) bool(true) bool(false) bool(false) 8 -- Iteration 15 -- bool(false) bool(true) bool(true) bool(false) bool(false) \t -- Iteration 16 -- bool(false) bool(true) bool(true) bool(false) bool(false) \007 -- Iteration 17 -- bool(false) bool(true) bool(true) bool(false) bool(false) 123 -- Iteration 18 -- bool(false) bool(true) bool(true) bool(false) bool(false) echo() *** Testing is_callable() on objects *** ** Testing behavior of is_callable() on static methods ** bool(true) bool(false) ** Testing normal operations of is_callable() on objects ** --- Outerloop iteration 1 --- -- Innerloop iteration 1 of Outerloop iteration 1 -- bool(true) bool(true) bool(true) bool(true) bool(true) object_class::foo1 -- Innerloop iteration 2 of Outerloop iteration 1 -- bool(false) bool(true) bool(false) bool(true) bool(false) object_class::foo2 -- Innerloop iteration 3 of Outerloop iteration 1 -- bool(false) bool(true) bool(false) bool(true) bool(false) object_class::foo3 -- Innerloop iteration 4 of Outerloop iteration 1 -- bool(true) bool(true) bool(true) bool(true) bool(true) object_class::x123 -- Innerloop iteration 5 of Outerloop iteration 1 -- bool(true) bool(true) bool(true) bool(true) bool(true) object_class::null -- Innerloop iteration 6 of Outerloop iteration 1 -- bool(true) bool(true) bool(true) bool(true) bool(true) object_class::TRUE -- Innerloop iteration 7 of Outerloop iteration 1 -- bool(false) bool(true) bool(false) bool(true) bool(false) object_class::123 -- Innerloop iteration 8 of Outerloop iteration 1 -- bool(false) bool(false) bool(false) bool(false) bool(false) Array -- Innerloop iteration 9 of Outerloop iteration 1 -- bool(false) bool(true) bool(false) bool(true) bool(false) object_class::func -- Innerloop iteration 10 of Outerloop iteration 1 -- Strict Standards: Non-static method object_class::foo1() cannot be called statically in /home/fredrik/webserver/php-5.2.4/ext/standard/tests/general_functions/is_callable.php on line 35 Strict Standards: Non-static method object_class::foo1() cannot be called statically in /home/fredrik/webserver/php-5.2.4/ext/standard/tests/general_functions/is_callable.php on line 35 bool(true) Strict Standards: Non-static method object_class::foo1() cannot be called statically in /home/fredrik/webserver/php-5.2.4/ext/standard/tests/general_functions/is_callable.php on line 36 bool(true) Strict Standards: Non-static method object_class::foo1() cannot be called statically in /home/fredrik/webserver/php-5.2.4/ext/standard/tests/general_functions/is_callable.php on line 37 Strict Standards: Non-static method object_class::foo1() cannot be called statically in /home/fredrik/webserver/php-5.2.4/ext/standard/tests/general_functions/is_callable.php on line 37 bool(true) Strict Standards: Non-static method object_class::foo1() cannot be called statically in /home/fredrik/webserver/php-5.2.4/ext/standard/tests/general_functions/is_callable.php on line 38 bool(true) Strict Standards: Non-static method object_class::foo1() cannot be called statically in /home/fredrik/webserver/php-5.2.4/ext/standard/tests/general_functions/is_callable.php on line 39 Strict Standards: Non-static method object_class::foo1() cannot be called statically in /home/fredrik/webserver/php-5.2.4/ext/standard/tests/general_functions/is_callable.php on line 39 bool(true) object_class::foo1 --- Outerloop iteration 2 --- -- Innerloop iteration 1 of Outerloop iteration 2 -- bool(false) bool(true) bool(false) bool(true) bool(false) no_member_class::foo1 -- Innerloop iteration 2 of Outerloop iteration 2 -- bool(false) bool(true) bool(false) bool(true) bool(false) no_member_class::foo2 -- Innerloop iteration 3 of Outerloop iteration 2 -- bool(false) bool(true) bool(false) bool(true) bool(false) no_member_class::foo3 -- Innerloop iteration 4 of Outerloop iteration 2 -- bool(false) bool(true) bool(false) bool(true) bool(false) no_member_class::x123 -- Innerloop iteration 5 of Outerloop iteration 2 -- bool(false) bool(true) bool(false) bool(true) bool(false) no_member_class::null -- Innerloop iteration 6 of Outerloop iteration 2 -- bool(false) bool(true) bool(false) bool(true) bool(false) no_member_class::TRUE -- Innerloop iteration 7 of Outerloop iteration 2 -- bool(false) bool(true) bool(false) bool(true) bool(false) no_member_class::123 -- Innerloop iteration 8 of Outerloop iteration 2 -- bool(false) bool(false) bool(false) bool(false) bool(false) Array -- Innerloop iteration 9 of Outerloop iteration 2 -- bool(false) bool(true) bool(false) bool(true) bool(false) no_member_class::func -- Innerloop iteration 10 of Outerloop iteration 2 -- Strict Standards: Non-static method object_class::foo1() cannot be called statically in /home/fredrik/webserver/php-5.2.4/ext/standard/tests/general_functions/is_callable.php on line 35 Strict Standards: Non-static method object_class::foo1() cannot be called statically in /home/fredrik/webserver/php-5.2.4/ext/standard/tests/general_functions/is_callable.php on line 35 bool(true) Strict Standards: Non-static method object_class::foo1() cannot be called statically in /home/fredrik/webserver/php-5.2.4/ext/standard/tests/general_functions/is_callable.php on line 36 bool(true) Strict Standards: Non-static method object_class::foo1() cannot be called statically in /home/fredrik/webserver/php-5.2.4/ext/standard/tests/general_functions/is_callable.php on line 37 Strict Standards: Non-static method object_class::foo1() cannot be called statically in /home/fredrik/webserver/php-5.2.4/ext/standard/tests/general_functions/is_callable.php on line 37 bool(true) Strict Standards: Non-static method object_class::foo1() cannot be called statically in /home/fredrik/webserver/php-5.2.4/ext/standard/tests/general_functions/is_callable.php on line 38 bool(true) Strict Standards: Non-static method object_class::foo1() cannot be called statically in /home/fredrik/webserver/php-5.2.4/ext/standard/tests/general_functions/is_callable.php on line 39 Strict Standards: Non-static method object_class::foo1() cannot be called statically in /home/fredrik/webserver/php-5.2.4/ext/standard/tests/general_functions/is_callable.php on line 39 bool(true) object_class::foo1 --- Outerloop iteration 3 --- -- Innerloop iteration 1 of Outerloop iteration 3 -- bool(false) bool(true) bool(false) bool(true) bool(false) contains_object_class::foo1 -- Innerloop iteration 2 of Outerloop iteration 3 -- bool(false) bool(true) bool(false) bool(true) bool(false) contains_object_class::foo2 -- Innerloop iteration 3 of Outerloop iteration 3 -- bool(false) bool(true) bool(false) bool(true) bool(false) contains_object_class::foo3 -- Innerloop iteration 4 of Outerloop iteration 3 -- bool(false) bool(true) bool(false) bool(true) bool(false) contains_object_class::x123 -- Innerloop iteration 5 of Outerloop iteration 3 -- bool(false) bool(true) bool(false) bool(true) bool(false) contains_object_class::null -- Innerloop iteration 6 of Outerloop iteration 3 -- bool(false) bool(true) bool(false) bool(true) bool(false) contains_object_class::TRUE -- Innerloop iteration 7 of Outerloop iteration 3 -- bool(false) bool(true) bool(false) bool(true) bool(false) contains_object_class::123 -- Innerloop iteration 8 of Outerloop iteration 3 -- bool(false) bool(false) bool(false) bool(false) bool(false) Array -- Innerloop iteration 9 of Outerloop iteration 3 -- bool(true) bool(true) bool(true) bool(true) bool(true) contains_object_class::func -- Innerloop iteration 10 of Outerloop iteration 3 -- Strict Standards: Non-static method object_class::foo1() cannot be called statically in /home/fredrik/webserver/php-5.2.4/ext/standard/tests/general_functions/is_callable.php on line 35 Strict Standards: Non-static method object_class::foo1() cannot be called statically in /home/fredrik/webserver/php-5.2.4/ext/standard/tests/general_functions/is_callable.php on line 35 bool(true) Strict Standards: Non-static method object_class::foo1() cannot be called statically in /home/fredrik/webserver/php-5.2.4/ext/standard/tests/general_functions/is_callable.php on line 36 bool(true) Strict Standards: Non-static method object_class::foo1() cannot be called statically in /home/fredrik/webserver/php-5.2.4/ext/standard/tests/general_functions/is_callable.php on line 37 Strict Standards: Non-static method object_class::foo1() cannot be called statically in /home/fredrik/webserver/php-5.2.4/ext/standard/tests/general_functions/is_callable.php on line 37 bool(true) Strict Standards: Non-static method object_class::foo1() cannot be called statically in /home/fredrik/webserver/php-5.2.4/ext/standard/tests/general_functions/is_callable.php on line 38 bool(true) Strict Standards: Non-static method object_class::foo1() cannot be called statically in /home/fredrik/webserver/php-5.2.4/ext/standard/tests/general_functions/is_callable.php on line 39 Strict Standards: Non-static method object_class::foo1() cannot be called statically in /home/fredrik/webserver/php-5.2.4/ext/standard/tests/general_functions/is_callable.php on line 39 bool(true) object_class::foo1 --- Outerloop iteration 4 --- -- Innerloop iteration 1 of Outerloop iteration 4 -- bool(false) bool(true) bool(false) bool(true) bool(false) contains_object_class::foo1 -- Innerloop iteration 2 of Outerloop iteration 4 -- bool(false) bool(true) bool(false) bool(true) bool(false) contains_object_class::foo2 -- Innerloop iteration 3 of Outerloop iteration 4 -- bool(false) bool(true) bool(false) bool(true) bool(false) contains_object_class::foo3 -- Innerloop iteration 4 of Outerloop iteration 4 -- bool(false) bool(true) bool(false) bool(true) bool(false) contains_object_class::x123 -- Innerloop iteration 5 of Outerloop iteration 4 -- bool(false) bool(true) bool(false) bool(true) bool(false) contains_object_class::null -- Innerloop iteration 6 of Outerloop iteration 4 -- bool(false) bool(true) bool(false) bool(true) bool(false) contains_object_class::TRUE -- Innerloop iteration 7 of Outerloop iteration 4 -- bool(false) bool(true) bool(false) bool(true) bool(false) contains_object_class::123 -- Innerloop iteration 8 of Outerloop iteration 4 -- bool(false) bool(false) bool(false) bool(false) bool(false) Array -- Innerloop iteration 9 of Outerloop iteration 4 -- bool(true) bool(true) bool(true) bool(true) bool(true) contains_object_class::func -- Innerloop iteration 10 of Outerloop iteration 4 -- Strict Standards: Non-static method object_class::foo1() cannot be called statically in /home/fredrik/webserver/php-5.2.4/ext/standard/tests/general_functions/is_callable.php on line 35 Strict Standards: Non-static method object_class::foo1() cannot be called statically in /home/fredrik/webserver/php-5.2.4/ext/standard/tests/general_functions/is_callable.php on line 35 bool(true) Strict Standards: Non-static method object_class::foo1() cannot be called statically in /home/fredrik/webserver/php-5.2.4/ext/standard/tests/general_functions/is_callable.php on line 36 bool(true) Strict Standards: Non-static method object_class::foo1() cannot be called statically in /home/fredrik/webserver/php-5.2.4/ext/standard/tests/general_functions/is_callable.php on line 37 Strict Standards: Non-static method object_class::foo1() cannot be called statically in /home/fredrik/webserver/php-5.2.4/ext/standard/tests/general_functions/is_callable.php on line 37 bool(true) Strict Standards: Non-static method object_class::foo1() cannot be called statically in /home/fredrik/webserver/php-5.2.4/ext/standard/tests/general_functions/is_callable.php on line 38 bool(true) Strict Standards: Non-static method object_class::foo1() cannot be called statically in /home/fredrik/webserver/php-5.2.4/ext/standard/tests/general_functions/is_callable.php on line 39 Strict Standards: Non-static method object_class::foo1() cannot be called statically in /home/fredrik/webserver/php-5.2.4/ext/standard/tests/general_functions/is_callable.php on line 39 bool(true) object_class::foo1 --- Outerloop iteration 5 --- -- Innerloop iteration 1 of Outerloop iteration 5 -- bool(true) bool(true) bool(true) bool(true) bool(true) object_class::foo1 -- Innerloop iteration 2 of Outerloop iteration 5 -- bool(false) bool(true) bool(false) bool(true) bool(false) object_class::foo2 -- Innerloop iteration 3 of Outerloop iteration 5 -- bool(false) bool(true) bool(false) bool(true) bool(false) object_class::foo3 -- Innerloop iteration 4 of Outerloop iteration 5 -- bool(true) bool(true) bool(true) bool(true) bool(true) object_class::x123 -- Innerloop iteration 5 of Outerloop iteration 5 -- bool(true) bool(true) bool(true) bool(true) bool(true) object_class::null -- Innerloop iteration 6 of Outerloop iteration 5 -- bool(true) bool(true) bool(true) bool(true) bool(true) object_class::TRUE -- Innerloop iteration 7 of Outerloop iteration 5 -- bool(false) bool(true) bool(false) bool(true) bool(false) object_class::123 -- Innerloop iteration 8 of Outerloop iteration 5 -- bool(false) bool(false) bool(false) bool(false) bool(false) Array -- Innerloop iteration 9 of Outerloop iteration 5 -- bool(false) bool(true) bool(false) bool(true) bool(false) object_class::func -- Innerloop iteration 10 of Outerloop iteration 5 -- Strict Standards: Non-static method object_class::foo1() cannot be called statically in /home/fredrik/webserver/php-5.2.4/ext/standard/tests/general_functions/is_callable.php on line 35 Strict Standards: Non-static method object_class::foo1() cannot be called statically in /home/fredrik/webserver/php-5.2.4/ext/standard/tests/general_functions/is_callable.php on line 35 bool(true) Strict Standards: Non-static method object_class::foo1() cannot be called statically in /home/fredrik/webserver/php-5.2.4/ext/standard/tests/general_functions/is_callable.php on line 36 bool(true) Strict Standards: Non-static method object_class::foo1() cannot be called statically in /home/fredrik/webserver/php-5.2.4/ext/standard/tests/general_functions/is_callable.php on line 37 Strict Standards: Non-static method object_class::foo1() cannot be called statically in /home/fredrik/webserver/php-5.2.4/ext/standard/tests/general_functions/is_callable.php on line 37 bool(true) Strict Standards: Non-static method object_class::foo1() cannot be called statically in /home/fredrik/webserver/php-5.2.4/ext/standard/tests/general_functions/is_callable.php on line 38 bool(true) Strict Standards: Non-static method object_class::foo1() cannot be called statically in /home/fredrik/webserver/php-5.2.4/ext/standard/tests/general_functions/is_callable.php on line 39 Strict Standards: Non-static method object_class::foo1() cannot be called statically in /home/fredrik/webserver/php-5.2.4/ext/standard/tests/general_functions/is_callable.php on line 39 bool(true) object_class::foo1 --- Outerloop iteration 6 --- -- Innerloop iteration 1 of Outerloop iteration 6 -- bool(false) bool(true) bool(false) bool(true) bool(false) no_member_class::foo1 -- Innerloop iteration 2 of Outerloop iteration 6 -- bool(false) bool(true) bool(false) bool(true) bool(false) no_member_class::foo2 -- Innerloop iteration 3 of Outerloop iteration 6 -- bool(false) bool(true) bool(false) bool(true) bool(false) no_member_class::foo3 -- Innerloop iteration 4 of Outerloop iteration 6 -- bool(false) bool(true) bool(false) bool(true) bool(false) no_member_class::x123 -- Innerloop iteration 5 of Outerloop iteration 6 -- bool(false) bool(true) bool(false) bool(true) bool(false) no_member_class::null -- Innerloop iteration 6 of Outerloop iteration 6 -- bool(false) bool(true) bool(false) bool(true) bool(false) no_member_class::TRUE -- Innerloop iteration 7 of Outerloop iteration 6 -- bool(false) bool(true) bool(false) bool(true) bool(false) no_member_class::123 -- Innerloop iteration 8 of Outerloop iteration 6 -- bool(false) bool(false) bool(false) bool(false) bool(false) Array -- Innerloop iteration 9 of Outerloop iteration 6 -- bool(false) bool(true) bool(false) bool(true) bool(false) no_member_class::func -- Innerloop iteration 10 of Outerloop iteration 6 -- Strict Standards: Non-static method object_class::foo1() cannot be called statically in /home/fredrik/webserver/php-5.2.4/ext/standard/tests/general_functions/is_callable.php on line 35 Strict Standards: Non-static method object_class::foo1() cannot be called statically in /home/fredrik/webserver/php-5.2.4/ext/standard/tests/general_functions/is_callable.php on line 35 bool(true) Strict Standards: Non-static method object_class::foo1() cannot be called statically in /home/fredrik/webserver/php-5.2.4/ext/standard/tests/general_functions/is_callable.php on line 36 bool(true) Strict Standards: Non-static method object_class::foo1() cannot be called statically in /home/fredrik/webserver/php-5.2.4/ext/standard/tests/general_functions/is_callable.php on line 37 Strict Standards: Non-static method object_class::foo1() cannot be called statically in /home/fredrik/webserver/php-5.2.4/ext/standard/tests/general_functions/is_callable.php on line 37 bool(true) Strict Standards: Non-static method object_class::foo1() cannot be called statically in /home/fredrik/webserver/php-5.2.4/ext/standard/tests/general_functions/is_callable.php on line 38 bool(true) Strict Standards: Non-static method object_class::foo1() cannot be called statically in /home/fredrik/webserver/php-5.2.4/ext/standard/tests/general_functions/is_callable.php on line 39 Strict Standards: Non-static method object_class::foo1() cannot be called statically in /home/fredrik/webserver/php-5.2.4/ext/standard/tests/general_functions/is_callable.php on line 39 bool(true) object_class::foo1 --- Outerloop iteration 7 --- -- Innerloop iteration 1 of Outerloop iteration 7 -- bool(true) bool(true) bool(true) bool(true) bool(true) object_class::foo1 -- Innerloop iteration 2 of Outerloop iteration 7 -- bool(false) bool(true) bool(false) bool(true) bool(false) object_class::foo2 -- Innerloop iteration 3 of Outerloop iteration 7 -- bool(false) bool(true) bool(false) bool(true) bool(false) object_class::foo3 -- Innerloop iteration 4 of Outerloop iteration 7 -- bool(true) bool(true) bool(true) bool(true) bool(true) object_class::x123 -- Innerloop iteration 5 of Outerloop iteration 7 -- bool(true) bool(true) bool(true) bool(true) bool(true) object_class::null -- Innerloop iteration 6 of Outerloop iteration 7 -- bool(true) bool(true) bool(true) bool(true) bool(true) object_class::TRUE -- Innerloop iteration 7 of Outerloop iteration 7 -- bool(false) bool(true) bool(false) bool(true) bool(false) object_class::123 -- Innerloop iteration 8 of Outerloop iteration 7 -- bool(false) bool(false) bool(false) bool(false) bool(false) Array -- Innerloop iteration 9 of Outerloop iteration 7 -- bool(false) bool(true) bool(false) bool(true) bool(false) object_class::func -- Innerloop iteration 10 of Outerloop iteration 7 -- Strict Standards: Non-static method object_class::foo1() cannot be called statically in /home/fredrik/webserver/php-5.2.4/ext/standard/tests/general_functions/is_callable.php on line 35 Strict Standards: Non-static method object_class::foo1() cannot be called statically in /home/fredrik/webserver/php-5.2.4/ext/standard/tests/general_functions/is_callable.php on line 35 bool(true) Strict Standards: Non-static method object_class::foo1() cannot be called statically in /home/fredrik/webserver/php-5.2.4/ext/standard/tests/general_functions/is_callable.php on line 36 bool(true) Strict Standards: Non-static method object_class::foo1() cannot be called statically in /home/fredrik/webserver/php-5.2.4/ext/standard/tests/general_functions/is_callable.php on line 37 Strict Standards: Non-static method object_class::foo1() cannot be called statically in /home/fredrik/webserver/php-5.2.4/ext/standard/tests/general_functions/is_callable.php on line 37 bool(true) Strict Standards: Non-static method object_class::foo1() cannot be called statically in /home/fredrik/webserver/php-5.2.4/ext/standard/tests/general_functions/is_callable.php on line 38 bool(true) Strict Standards: Non-static method object_class::foo1() cannot be called statically in /home/fredrik/webserver/php-5.2.4/ext/standard/tests/general_functions/is_callable.php on line 39 Strict Standards: Non-static method object_class::foo1() cannot be called statically in /home/fredrik/webserver/php-5.2.4/ext/standard/tests/general_functions/is_callable.php on line 39 bool(true) object_class::foo1 --- Outerloop iteration 8 --- -- Innerloop iteration 1 of Outerloop iteration 8 -- bool(false) bool(false) bool(false) bool(false) bool(false) Array -- Innerloop iteration 2 of Outerloop iteration 8 -- bool(false) bool(false) bool(false) bool(false) bool(false) Array -- Innerloop iteration 3 of Outerloop iteration 8 -- bool(false) bool(false) bool(false) bool(false) bool(false) Array -- Innerloop iteration 4 of Outerloop iteration 8 -- bool(false) bool(false) bool(false) bool(false) bool(false) Array -- Innerloop iteration 5 of Outerloop iteration 8 -- bool(false) bool(false) bool(false) bool(false) bool(false) Array -- Innerloop iteration 6 of Outerloop iteration 8 -- bool(false) bool(false) bool(false) bool(false) bool(false) Array -- Innerloop iteration 7 of Outerloop iteration 8 -- bool(false) bool(false) bool(false) bool(false) bool(false) Array -- Innerloop iteration 8 of Outerloop iteration 8 -- bool(false) bool(false) bool(false) bool(false) bool(false) Array -- Innerloop iteration 9 of Outerloop iteration 8 -- bool(false) bool(false) bool(false) bool(false) bool(false) Array -- Innerloop iteration 10 of Outerloop iteration 8 -- Strict Standards: Non-static method object_class::foo1() cannot be called statically in /home/fredrik/webserver/php-5.2.4/ext/standard/tests/general_functions/is_callable.php on line 35 Strict Standards: Non-static method object_class::foo1() cannot be called statically in /home/fredrik/webserver/php-5.2.4/ext/standard/tests/general_functions/is_callable.php on line 35 bool(true) Strict Standards: Non-static method object_class::foo1() cannot be called statically in /home/fredrik/webserver/php-5.2.4/ext/standard/tests/general_functions/is_callable.php on line 36 bool(true) Strict Standards: Non-static method object_class::foo1() cannot be called statically in /home/fredrik/webserver/php-5.2.4/ext/standard/tests/general_functions/is_callable.php on line 37 Strict Standards: Non-static method object_class::foo1() cannot be called statically in /home/fredrik/webserver/php-5.2.4/ext/standard/tests/general_functions/is_callable.php on line 37 bool(true) Strict Standards: Non-static method object_class::foo1() cannot be called statically in /home/fredrik/webserver/php-5.2.4/ext/standard/tests/general_functions/is_callable.php on line 38 bool(true) Strict Standards: Non-static method object_class::foo1() cannot be called statically in /home/fredrik/webserver/php-5.2.4/ext/standard/tests/general_functions/is_callable.php on line 39 Strict Standards: Non-static method object_class::foo1() cannot be called statically in /home/fredrik/webserver/php-5.2.4/ext/standard/tests/general_functions/is_callable.php on line 39 bool(true) object_class::foo1 *** Testing is_callable() on invalid function names *** -- Iteration 1 -- bool(false) bool(false) bool(false) bool(false) bool(false) -- Iteration 2 -- bool(false) bool(false) bool(false) bool(false) bool(false) 0 -- Iteration 3 -- bool(false) bool(false) bool(false) bool(false) bool(false) 1234567890 -- Iteration 4 -- bool(false) bool(false) bool(false) bool(false) bool(false) -100123456782 -- Iteration 5 -- bool(false) bool(false) bool(false) bool(false) bool(false) -2 -- Iteration 6 -- bool(false) bool(false) bool(false) bool(false) bool(false) 0.567 -- Iteration 7 -- bool(false) bool(false) bool(false) bool(false) bool(false) -- Iteration 8 -- bool(false) bool(false) bool(false) bool(false) bool(false) Array -- Iteration 9 -- bool(false) bool(false) bool(false) bool(false) bool(false) -- Iteration 10 -- bool(false) bool(false) bool(false) bool(false) bool(false) -- Iteration 11 -- bool(false) bool(false) bool(false) bool(false) bool(false) Resource id #5 *** Testing error conditions *** Warning: Wrong parameter count for is_callable() in /home/fredrik/webserver/php-5.2.4/ext/standard/tests/general_functions/is_callable.php on line 228 NULL Warning: Wrong parameter count for is_callable() in /home/fredrik/webserver/php-5.2.4/ext/standard/tests/general_functions/is_callable.php on line 230 NULL Done ================================================================================ 240+ 241+ Strict Standards: Non-static method object_class::foo1() cannot be called statically in /home/fredrik/webserver/php-5.2.4/ext/standard/tests/general_functions/is_callable.php on line 35 240- bool(true) 245- bool(true) 246+ 247+ Strict Standards: Non-static method object_class::foo1() cannot be called statically in /home/fredrik/webserver/php-5.2.4/ext/standard/tests/general_functions/is_callable.php on line 37 251+ 252+ Strict Standards: Non-static method object_class::foo1() cannot be called statically in /home/fredrik/webserver/php-5.2.4/ext/standard/tests/general_functions/is_callable.php on line 38 253+ bool(true) 254+ 255+ Strict Standards: Non-static method object_class::foo1() cannot be called statically in /home/fredrik/webserver/php-5.2.4/ext/standard/tests/general_functions/is_callable.php on line 39 256+ 257+ Strict Standards: Non-static method object_class::foo1() cannot be called statically in /home/fredrik/webserver/php-5.2.4/ext/standard/tests/general_functions/is_callable.php on line 39 258+ bool(true) 317- bool(true) 322- bool(true) 327+ 328+ Strict Standards: Non-static method object_class::foo1() cannot be called statically in /home/fredrik/webserver/php-5.2.4/ext/standard/tests/general_functions/is_callable.php on line 35 333+ 334+ Strict Standards: Non-static method object_class::foo1() cannot be called statically in /home/fredrik/webserver/php-5.2.4/ext/standard/tests/general_functions/is_callable.php on line 37 338+ 339+ Strict Standards: Non-static method object_class::foo1() cannot be called statically in /home/fredrik/webserver/php-5.2.4/ext/standard/tests/general_functions/is_callable.php on line 38 340+ bool(true) 341+ 342+ Strict Standards: Non-static method object_class::foo1() cannot be called statically in /home/fredrik/webserver/php-5.2.4/ext/standard/tests/general_functions/is_callable.php on line 39 343+ 344+ Strict Standards: Non-static method object_class::foo1() cannot be called statically in /home/fredrik/webserver/php-5.2.4/ext/standard/tests/general_functions/is_callable.php on line 39 345+ bool(true) 394- bool(true) 399- bool(true) 414+ 415+ Strict Standards: Non-static method object_class::foo1() cannot be called statically in /home/fredrik/webserver/php-5.2.4/ext/standard/tests/general_functions/is_callable.php on line 35 420+ 421+ Strict Standards: Non-static method object_class::foo1() cannot be called statically in /home/fredrik/webserver/php-5.2.4/ext/standard/tests/general_functions/is_callable.php on line 37 425+ 426+ Strict Standards: Non-static method object_class::foo1() cannot be called statically in /home/fredrik/webserver/php-5.2.4/ext/standard/tests/general_functions/is_callable.php on line 38 427+ bool(true) 428+ 429+ Strict Standards: Non-static method object_class::foo1() cannot be called statically in /home/fredrik/webserver/php-5.2.4/ext/standard/tests/general_functions/is_callable.php on line 39 430+ 431+ Strict Standards: Non-static method object_class::foo1() cannot be called statically in /home/fredrik/webserver/php-5.2.4/ext/standard/tests/general_functions/is_callable.php on line 39 432+ bool(true) 471- bool(true) 476- bool(true) 501+ 502+ Strict Standards: Non-static method object_class::foo1() cannot be called statically in /home/fredrik/webserver/php-5.2.4/ext/standard/tests/general_functions/is_callable.php on line 35 507+ 508+ Strict Standards: Non-static method object_class::foo1() cannot be called statically in /home/fredrik/webserver/php-5.2.4/ext/standard/tests/general_functions/is_callable.php on line 37 512+ 513+ Strict Standards: Non-static method object_class::foo1() cannot be called statically in /home/fredrik/webserver/php-5.2.4/ext/standard/tests/general_functions/is_callable.php on line 38 514+ bool(true) 515+ 516+ Strict Standards: Non-static method object_class::foo1() cannot be called statically in /home/fredrik/webserver/php-5.2.4/ext/standard/tests/general_functions/is_callable.php on line 39 517+ 518+ Strict Standards: Non-static method object_class::foo1() cannot be called statically in /home/fredrik/webserver/php-5.2.4/ext/standard/tests/general_functions/is_callable.php on line 39 519+ bool(true) 548- bool(true) 553- bool(true) 588+ 589+ Strict Standards: Non-static method object_class::foo1() cannot be called statically in /home/fredrik/webserver/php-5.2.4/ext/standard/tests/general_functions/is_callable.php on line 35 594+ 595+ Strict Standards: Non-static method object_class::foo1() cannot be called statically in /home/fredrik/webserver/php-5.2.4/ext/standard/tests/general_functions/is_callable.php on line 37 599+ 600+ Strict Standards: Non-static method object_class::foo1() cannot be called statically in /home/fredrik/webserver/php-5.2.4/ext/standard/tests/general_functions/is_callable.php on line 38 601+ bool(true) 602+ 603+ Strict Standards: Non-static method object_class::foo1() cannot be called statically in /home/fredrik/webserver/php-5.2.4/ext/standard/tests/general_functions/is_callable.php on line 39 604+ 605+ Strict Standards: Non-static method object_class::foo1() cannot be called statically in /home/fredrik/webserver/php-5.2.4/ext/standard/tests/general_functions/is_callable.php on line 39 606+ bool(true) 625- bool(true) 630- bool(true) 675+ 676+ Strict Standards: Non-static method object_class::foo1() cannot be called statically in /home/fredrik/webserver/php-5.2.4/ext/standard/tests/general_functions/is_callable.php on line 35 681+ 682+ Strict Standards: Non-static method object_class::foo1() cannot be called statically in /home/fredrik/webserver/php-5.2.4/ext/standard/tests/general_functions/is_callable.php on line 37 686+ 687+ Strict Standards: Non-static method object_class::foo1() cannot be called statically in /home/fredrik/webserver/php-5.2.4/ext/standard/tests/general_functions/is_callable.php on line 38 688+ bool(true) 689+ 690+ Strict Standards: Non-static method object_class::foo1() cannot be called statically in /home/fredrik/webserver/php-5.2.4/ext/standard/tests/general_functions/is_callable.php on line 39 691+ 692+ Strict Standards: Non-static method object_class::foo1() cannot be called statically in /home/fredrik/webserver/php-5.2.4/ext/standard/tests/general_functions/is_callable.php on line 39 693+ bool(true) 702- bool(true) 707- bool(true) 762+ 763+ Strict Standards: Non-static method object_class::foo1() cannot be called statically in /home/fredrik/webserver/php-5.2.4/ext/standard/tests/general_functions/is_callable.php on line 35 768+ 769+ Strict Standards: Non-static method object_class::foo1() cannot be called statically in /home/fredrik/webserver/php-5.2.4/ext/standard/tests/general_functions/is_callable.php on line 37 773+ 774+ Strict Standards: Non-static method object_class::foo1() cannot be called statically in /home/fredrik/webserver/php-5.2.4/ext/standard/tests/general_functions/is_callable.php on line 38 775+ bool(true) 776+ 777+ Strict Standards: Non-static method object_class::foo1() cannot be called statically in /home/fredrik/webserver/php-5.2.4/ext/standard/tests/general_functions/is_callable.php on line 39 778+ 779+ Strict Standards: Non-static method object_class::foo1() cannot be called statically in /home/fredrik/webserver/php-5.2.4/ext/standard/tests/general_functions/is_callable.php on line 39 780+ bool(true) 779- bool(true) 784- bool(true) 849+ 850+ Strict Standards: Non-static method object_class::foo1() cannot be called statically in /home/fredrik/webserver/php-5.2.4/ext/standard/tests/general_functions/is_callable.php on line 35 855+ 856+ Strict Standards: Non-static method object_class::foo1() cannot be called statically in /home/fredrik/webserver/php-5.2.4/ext/standard/tests/general_functions/is_callable.php on line 37 860+ 861+ Strict Standards: Non-static method object_class::foo1() cannot be called statically in /home/fredrik/webserver/php-5.2.4/ext/standard/tests/general_functions/is_callable.php on line 38 862+ bool(true) 863+ 864+ Strict Standards: Non-static method object_class::foo1() cannot be called statically in /home/fredrik/webserver/php-5.2.4/ext/standard/tests/general_functions/is_callable.php on line 39 865+ 866+ Strict Standards: Non-static method object_class::foo1() cannot be called statically in /home/fredrik/webserver/php-5.2.4/ext/standard/tests/general_functions/is_callable.php on line 39 867+ bool(true) ================================================================================ ================================================================================ /home/fredrik/webserver/php-5.2.4/ext/standard/tests/math/bug24142.phpt ================================================================================ round(0.005, 2) -> 0.01 round(0.015, 2) -> 0.01 round(0.025, 2) -> 0.03 round(0.035, 2) -> 0.04 round(0.045, 2) -> 0.05 round(0.055, 2) -> 0.06 round(0.065, 2) -> 0.07 round(0.075, 2) -> 0.07 round(0.085, 2) -> 0.08 ================================================================================ 002+ round(0.015, 2) -> 0.01 002- round(0.015, 2) -> 0.02 008+ round(0.075, 2) -> 0.07 009+ round(0.085, 2) -> 0.08 008- round(0.075, 2) -> 0.08 009- round(0.085, 2) -> 0.09 ================================================================================ ================================================================================ /home/fredrik/webserver/php-5.2.4/ext/standard/tests/math/bug25694.phpt ================================================================================ round 0.045 = 0.04 number format 0.045 = 0.04 round 0.055 = 0.06 number format 0.055 = 0.06 round 5.045 = 5.04 number format 5.045 = 5.04 round 5.055 = 5.05 number format 5.055 = 5.05 round 3.025 = 3.02 number format 3.025 = 3.02 round 4.025 = 4.03 number format 4.025 = 4.03 ================================================================================ 001+ round 0.045 = 0.04 002+ number format 0.045 = 0.04 001- round 0.045 = 0.05 002- number format 0.045 = 0.05 007+ round 5.045 = 5.04 008+ number format 5.045 = 5.04 009+ 010+ round 5.055 = 5.05 011+ number format 5.055 = 5.05 012+ 013+ round 3.025 = 3.02 014+ number format 3.025 = 3.02 007- round 5.045 = 5.05 008- number format 5.045 = 5.05 010- round 5.055 = 5.06 011- number format 5.055 = 5.06 012- 013- round 3.025 = 3.03 014- number format 3.025 = 3.03 015- ================================================================================ ================================================================================ /home/fredrik/webserver/php-5.2.4/ext/standard/tests/strings/htmlentities02.phpt (warn: possibly braindead libc) ================================================================================ string(24) "&frac14;&frac12;&frac34;" ================================================================================ 001+ string(24) "&frac14;&frac12;&frac34;" 001- string(20) "&OElig;&oelig;&Yuml;" ================================================================================ ================================================================================ /home/fredrik/webserver/php-5.2.4/ext/standard/tests/strings/htmlentities04.phpt ================================================================================ string(42) "&iexcl;&cent;&iexcl;&pound;&iexcl;&curren;" ================================================================================ 001+ string(42) "&iexcl;&cent;&iexcl;&pound;&iexcl;&curren;" 001- string(6) "¡¢¡£¡¤" ================================================================================ ================================================================================ /home/fredrik/webserver/php-5.2.4/ext/standard/tests/strings/htmlentities15.phpt ================================================================================ string(9) "ÒÏÓËÏÛÎÙÊ" string(63) "&Ograve;&Iuml;&Oacute;&Euml;&Iuml;&Ucirc;&Icirc;&Ugrave;&Ecirc;" ================================================================================ 002+ string(63) "&Ograve;&Iuml;&Oacute;&Euml;&Iuml;&Ucirc;&Icirc;&Ugrave;&Ecirc;" 002- string(63) "&#1088;&#1086;&#1089;&#1082;&#1086;&#1096;&#1085;&#1099;&#1081;" ================================================================================ ================================================================================ /home/fredrik/webserver/php-5.2.4/ext/standard/tests/strings/strtolower.phpt ================================================================================ *** Testing strtolower() with all 256 chars *** 00 => 00 01 => 01 02 => 02 03 => 03 04 => 04 05 => 05 06 => 06 07 => 07 08 => 08 09 => 09 0a => 0a 0b => 0b 0c => 0c 0d => 0d 0e => 0e 0f => 0f 10 => 10 11 => 11 12 => 12 13 => 13 14 => 14 15 => 15 16 => 16 17 => 17 18 => 18 19 => 19 1a => 1a 1b => 1b 1c => 1c 1d => 1d 1e => 1e 1f => 1f 20 => 20 21 => 21 22 => 22 23 => 23 24 => 24 25 => 25 26 => 26 27 => 27 28 => 28 29 => 29 2a => 2a 2b => 2b 2c => 2c 2d => 2d 2e => 2e 2f => 2f 30 => 30 31 => 31 32 => 32 33 => 33 34 => 34 35 => 35 36 => 36 37 => 37 38 => 38 39 => 39 3a => 3a 3b => 3b 3c => 3c 3d => 3d 3e => 3e 3f => 3f 40 => 40 41 => 61 42 => 62 43 => 63 44 => 64 45 => 65 46 => 66 47 => 67 48 => 68 49 => 69 4a => 6a 4b => 6b 4c => 6c 4d => 6d 4e => 6e 4f => 6f 50 => 70 51 => 71 52 => 72 53 => 73 54 => 74 55 => 75 56 => 76 57 => 77 58 => 78 59 => 79 5a => 7a 5b => 5b 5c => 5c 5d => 5d 5e => 5e 5f => 5f 60 => 60 61 => 61 62 => 62 63 => 63 64 => 64 65 => 65 66 => 66 67 => 67 68 => 68 69 => 69 6a => 6a 6b => 6b 6c => 6c 6d => 6d 6e => 6e 6f => 6f 70 => 70 71 => 71 72 => 72 73 => 73 74 => 74 75 => 75 76 => 76 77 => 77 78 => 78 79 => 79 7a => 7a 7b => 7b 7c => 7c 7d => 7d 7e => 7e 7f => 7f 80 => 80 81 => 81 82 => 82 83 => 83 84 => 84 85 => 85 86 => 86 87 => 87 88 => 88 89 => 89 8a => 8a 8b => 8b 8c => 8c 8d => 8d 8e => 8e 8f => 8f 90 => 90 91 => 91 92 => 92 93 => 93 94 => 94 95 => 95 96 => 96 97 => 97 98 => 98 99 => 99 9a => 9a 9b => 9b 9c => 9c 9d => 9d 9e => 9e 9f => 9f a0 => a0 a1 => a1 a2 => a2 a3 => a3 a4 => a4 a5 => a5 a6 => a6 a7 => a7 a8 => a8 a9 => a9 aa => aa ab => ab ac => ac ad => ad ae => ae af => af b0 => b0 b1 => b1 b2 => b2 b3 => b3 b4 => b4 b5 => b5 b6 => b6 b7 => b7 b8 => b8 b9 => b9 ba => ba bb => bb bc => bc bd => bd be => be bf => bf c0 => e0 c1 => e1 c2 => e2 c3 => e3 c4 => e4 c5 => e5 c6 => e6 c7 => e7 c8 => e8 c9 => e9 ca => ea cb => eb cc => ec cd => ed ce => ee cf => ef d0 => f0 d1 => f1 d2 => f2 d3 => f3 d4 => f4 d5 => f5 d6 => f6 d7 => d7 d8 => f8 d9 => f9 da => fa db => fb dc => fc dd => fd de => fe df => df e0 => e0 e1 => e1 e2 => e2 e3 => e3 e4 => e4 e5 => e5 e6 => e6 e7 => e7 e8 => e8 e9 => e9 ea => ea eb => eb ec => ec ed => ed ee => ee ef => ef f0 => f0 f1 => f1 f2 => f2 f3 => f3 f4 => f4 f5 => f5 f6 => f6 f7 => f7 f8 => f8 f9 => f9 fa => fa fb => fb fc => fc fd => fd fe => fe ff => ff *** Testing strlower() with basic strings *** string(43) "mary had a little lamb and she loved it so " *** Testing strtolower() with various strings *** -- Iteration 0 -- string(0) "" -- Iteration 1 -- string(6) "string" -- Iteration 2 -- string(10) "string0234" -- Iteration 3 -- string(20) "1.233.344string12333" -- Iteration 4 -- string(31) "$$$$$$!!!!@@@@@@@ abcdef !!!***" -- Iteration 5 -- string(13) "abcd[0x0]abcdabcd" -- Iteration 6 -- string(0) "" -- Iteration 7 -- string(1) "1" -- Iteration 8 -- string(0) "" -- Iteration 9 -- Notice: Array to string conversion in /home/fredrik/webserver/php-5.2.4/ext/standard/tests/strings/strtolower.php on line 37 string(5) "array" *** Testing strtolower() with two different case strings *** strings are same, with Case Insensitive *** Testing error conditions *** Warning: Wrong parameter count for strtolower() in /home/fredrik/webserver/php-5.2.4/ext/standard/tests/strings/strtolower.php on line 48 NULL Warning: Wrong parameter count for strtolower() in /home/fredrik/webserver/php-5.2.4/ext/standard/tests/strings/strtolower.php on line 49 NULL *** Done *** ================================================================================ 194+ c0 => e0 195+ c1 => e1 196+ c2 => e2 197+ c3 => e3 198+ c4 => e4 199+ c5 => e5 200+ c6 => e6 201+ c7 => e7 202+ c8 => e8 203+ c9 => e9 204+ ca => ea 205+ cb => eb 206+ cc => ec 207+ cd => ed 208+ ce => ee 209+ cf => ef 210+ d0 => f0 211+ d1 => f1 212+ d2 => f2 213+ d3 => f3 214+ d4 => f4 215+ d5 => f5 216+ d6 => f6 194- c0 => c0 195- c1 => c1 196- c2 => c2 197- c3 => c3 198- c4 => c4 199- c5 => c5 200- c6 => c6 201- c7 => c7 202- c8 => c8 203- c9 => c9 204- ca => ca 205- cb => cb 206- cc => cc 207- cd => cd 208- ce => ce 209- cf => cf 210- d0 => d0 211- d1 => d1 212- d2 => d2 213- d3 => d3 214- d4 => d4 215- d5 => d5 216- d6 => d6 218+ d8 => f8 219+ d9 => f9 220+ da => fa 221+ db => fb 222+ dc => fc 223+ dd => fd 224+ de => fe 218- d8 => d8 219- d9 => d9 220- da => da 221- db => db 222- dc => dc 223- dd => dd 224- de => de ================================================================================ ================================================================================ /home/fredrik/webserver/php-5.2.4/ext/standard/tests/strings/strtoupper1.phpt ================================================================================ *** Testing strtoupper() with all 256 chars *** 00 => 00 01 => 01 02 => 02 03 => 03 04 => 04 05 => 05 06 => 06 07 => 07 08 => 08 09 => 09 0a => 0a 0b => 0b 0c => 0c 0d => 0d 0e => 0e 0f => 0f 10 => 10 11 => 11 12 => 12 13 => 13 14 => 14 15 => 15 16 => 16 17 => 17 18 => 18 19 => 19 1a => 1a 1b => 1b 1c => 1c 1d => 1d 1e => 1e 1f => 1f 20 => 20 21 => 21 22 => 22 23 => 23 24 => 24 25 => 25 26 => 26 27 => 27 28 => 28 29 => 29 2a => 2a 2b => 2b 2c => 2c 2d => 2d 2e => 2e 2f => 2f 30 => 30 31 => 31 32 => 32 33 => 33 34 => 34 35 => 35 36 => 36 37 => 37 38 => 38 39 => 39 3a => 3a 3b => 3b 3c => 3c 3d => 3d 3e => 3e 3f => 3f 40 => 40 41 => 41 42 => 42 43 => 43 44 => 44 45 => 45 46 => 46 47 => 47 48 => 48 49 => 49 4a => 4a 4b => 4b 4c => 4c 4d => 4d 4e => 4e 4f => 4f 50 => 50 51 => 51 52 => 52 53 => 53 54 => 54 55 => 55 56 => 56 57 => 57 58 => 58 59 => 59 5a => 5a 5b => 5b 5c => 5c 5d => 5d 5e => 5e 5f => 5f 60 => 60 61 => 41 62 => 42 63 => 43 64 => 44 65 => 45 66 => 46 67 => 47 68 => 48 69 => 49 6a => 4a 6b => 4b 6c => 4c 6d => 4d 6e => 4e 6f => 4f 70 => 50 71 => 51 72 => 52 73 => 53 74 => 54 75 => 55 76 => 56 77 => 57 78 => 58 79 => 59 7a => 5a 7b => 7b 7c => 7c 7d => 7d 7e => 7e 7f => 7f 80 => 80 81 => 81 82 => 82 83 => 83 84 => 84 85 => 85 86 => 86 87 => 87 88 => 88 89 => 89 8a => 8a 8b => 8b 8c => 8c 8d => 8d 8e => 8e 8f => 8f 90 => 90 91 => 91 92 => 92 93 => 93 94 => 94 95 => 95 96 => 96 97 => 97 98 => 98 99 => 99 9a => 9a 9b => 9b 9c => 9c 9d => 9d 9e => 9e 9f => 9f a0 => a0 a1 => a1 a2 => a2 a3 => a3 a4 => a4 a5 => a5 a6 => a6 a7 => a7 a8 => a8 a9 => a9 aa => aa ab => ab ac => ac ad => ad ae => ae af => af b0 => b0 b1 => b1 b2 => b2 b3 => b3 b4 => b4 b5 => b5 b6 => b6 b7 => b7 b8 => b8 b9 => b9 ba => ba bb => bb bc => bc bd => bd be => be bf => bf c0 => c0 c1 => c1 c2 => c2 c3 => c3 c4 => c4 c5 => c5 c6 => c6 c7 => c7 c8 => c8 c9 => c9 ca => ca cb => cb cc => cc cd => cd ce => ce cf => cf d0 => d0 d1 => d1 d2 => d2 d3 => d3 d4 => d4 d5 => d5 d6 => d6 d7 => d7 d8 => d8 d9 => d9 da => da db => db dc => dc dd => dd de => de df => df e0 => c0 e1 => c1 e2 => c2 e3 => c3 e4 => c4 e5 => c5 e6 => c6 e7 => c7 e8 => c8 e9 => c9 ea => ca eb => cb ec => cc ed => cd ee => ce ef => cf f0 => d0 f1 => d1 f2 => d2 f3 => d3 f4 => d4 f5 => d5 f6 => d6 f7 => f7 f8 => d8 f9 => d9 fa => da fb => db fc => dc fd => dd fe => de ff => ff *** Testing strtoupper() with basic strings *** string(43) "MARY HAD A LITTLE LAMB AND SHE LOVED IT SO " *** Testing strtoupper() with various strings *** -- Iteration 0 -- string(0) "" -- Iteration 1 -- string(6) "STRING" -- Iteration 2 -- string(10) "STRING0234" -- Iteration 3 -- string(20) "1.233.344STRING12333" -- Iteration 4 -- string(31) "$$$$$$!!!!@@@@@@@ ABCDEF !!!***" -- Iteration 5 -- string(13) "ABCD[0x0]ABCDABCD" -- Iteration 6 -- string(0) "" -- Iteration 7 -- string(1) "1" -- Iteration 8 -- string(0) "" -- Iteration 9 -- Notice: Array to string conversion in /home/fredrik/webserver/php-5.2.4/ext/standard/tests/strings/strtoupper1.php on line 37 string(5) "ARRAY" *** Testing strtoupper() with two different case strings *** strings are same, with Case Insensitive *** Testing error conditions *** Warning: Wrong parameter count for strtoupper() in /home/fredrik/webserver/php-5.2.4/ext/standard/tests/strings/strtoupper1.php on line 48 NULL Warning: Wrong parameter count for strtoupper() in /home/fredrik/webserver/php-5.2.4/ext/standard/tests/strings/strtoupper1.php on line 49 NULL *** Done *** ================================================================================ 226+ e0 => c0 227+ e1 => c1 228+ e2 => c2 229+ e3 => c3 230+ e4 => c4 231+ e5 => c5 232+ e6 => c6 233+ e7 => c7 234+ e8 => c8 235+ e9 => c9 236+ ea => ca 237+ eb => cb 238+ ec => cc 239+ ed => cd 240+ ee => ce 241+ ef => cf 242+ f0 => d0 243+ f1 => d1 244+ f2 => d2 245+ f3 => d3 246+ f4 => d4 247+ f5 => d5 248+ f6 => d6 226- e0 => e0 227- e1 => e1 228- e2 => e2 229- e3 => e3 230- e4 => e4 231- e5 => e5 232- e6 => e6 233- e7 => e7 234- e8 => e8 235- e9 => e9 236- ea => ea 237- eb => eb 238- ec => ec 239- ed => ed 240- ee => ee 241- ef => ef 242- f0 => f0 243- f1 => f1 244- f2 => f2 245- f3 => f3 246- f4 => f4 247- f5 => f5 248- f6 => f6 250+ f8 => d8 251+ f9 => d9 252+ fa => da 253+ fb => db 254+ fc => dc 255+ fd => dd 256+ fe => de 250- f8 => f8 251- f9 => f9 252- fa => fa 253- fb => fb 254- fc => fc 255- fd => fd 256- fe => fe ================================================================================ ================================================================================ /home/fredrik/webserver/php-5.2.4/ext/xml/tests/bug32001.phpt ================================================================================ libxml2 Version => 2.6.11 Encoding: UTF-8 XML Prologue: present Chunk size: all data at once BOM: not prepended array(3) { [0]=> string(128) "e38386e382b9e383883ae38386e382b9e3838831: 687474703a2f2f7777772e6578616d706c652e636f6d2fe38386e382b9e383882f, e38386e382b9e38388" [1]=> string(60) "e38386e382b9e383883ae38386e382b9e3838832: e38386e382b9e38388" [2]=> string(42) "e38386e382b9e383883ae38386e382b9e3838833: " } Encoding: UTF-8 XML Prologue: not present Chunk size: all data at once BOM: not prepended array(3) { [0]=> string(128) "e38386e382b9e383883ae38386e382b9e3838831: 687474703a2f2f7777772e6578616d706c652e636f6d2fe38386e382b9e383882f, e38386e382b9e38388" [1]=> string(60) "e38386e382b9e383883ae38386e382b9e3838832: e38386e382b9e38388" [2]=> string(42) "e38386e382b9e383883ae38386e382b9e3838833: " } Encoding: UTF-8 XML Prologue: present Chunk size: all data at once BOM: prepended array(3) { [0]=> string(128) "e38386e382b9e383883ae38386e382b9e3838831: 687474703a2f2f7777772e6578616d706c652e636f6d2fe38386e382b9e383882f, e38386e382b9e38388" [1]=> string(60) "e38386e382b9e383883ae38386e382b9e3838832: e38386e382b9e38388" [2]=> string(42) "e38386e382b9e383883ae38386e382b9e3838833: " } Encoding: UTF-8 XML Prologue: not present Chunk size: all data at once BOM: prepended array(3) { [0]=> string(128) "e38386e382b9e383883ae38386e382b9e3838831: 687474703a2f2f7777772e6578616d706c652e636f6d2fe38386e382b9e383882f, e38386e382b9e38388" [1]=> string(60) "e38386e382b9e383883ae38386e382b9e3838832: e38386e382b9e38388" [2]=> string(42) "e38386e382b9e383883ae38386e382b9e3838833: " } Encoding: UTF-16BE XML Prologue: present Chunk size: all data at once BOM: not prepended array(3) { [0]=> string(128) "e38386e382b9e383883ae38386e382b9e3838831: 687474703a2f2f7777772e6578616d706c652e636f6d2fe38386e382b9e383882f, e38386e382b9e38388" [1]=> string(60) "e38386e382b9e383883ae38386e382b9e3838832: e38386e382b9e38388" [2]=> string(42) "e38386e382b9e383883ae38386e382b9e3838833: " } Encoding: UTF-16BE XML Prologue: present Chunk size: all data at once BOM: prepended array(3) { [0]=> string(128) "e38386e382b9e383883ae38386e382b9e3838831: 687474703a2f2f7777772e6578616d706c652e636f6d2fe38386e382b9e383882f, e38386e382b9e38388" [1]=> string(60) "e38386e382b9e383883ae38386e382b9e3838832: e38386e382b9e38388" [2]=> string(42) "e38386e382b9e383883ae38386e382b9e3838833: " } Encoding: UTF-16BE XML Prologue: not present Chunk size: all data at once BOM: prepended array(3) { [0]=> string(128) "e38386e382b9e383883ae38386e382b9e3838831: 687474703a2f2f7777772e6578616d706c652e636f6d2fe38386e382b9e383882f, e38386e382b9e38388" [1]=> string(60) "e38386e382b9e383883ae38386e382b9e3838832: e38386e382b9e38388" [2]=> string(42) "e38386e382b9e383883ae38386e382b9e3838833: " } Encoding: UTF-16LE XML Prologue: present Chunk size: all data at once BOM: not prepended array(3) { [0]=> string(128) "e38386e382b9e383883ae38386e382b9e3838831: 687474703a2f2f7777772e6578616d706c652e636f6d2fe38386e382b9e383882f, e38386e382b9e38388" [1]=> string(60) "e38386e382b9e383883ae38386e382b9e3838832: e38386e382b9e38388" [2]=> string(42) "e38386e382b9e383883ae38386e382b9e3838833: " } Encoding: UTF-16LE XML Prologue: present Chunk size: all data at once BOM: prepended array(3) { [0]=> string(128) "e38386e382b9e383883ae38386e382b9e3838831: 687474703a2f2f7777772e6578616d706c652e636f6d2fe38386e382b9e383882f, e38386e382b9e38388" [1]=> string(60) "e38386e382b9e383883ae38386e382b9e3838832: e38386e382b9e38388" [2]=> string(42) "e38386e382b9e383883ae38386e382b9e3838833: " } Encoding: UTF-16LE XML Prologue: not present Chunk size: all data at once BOM: prepended array(3) { [0]=> string(128) "e38386e382b9e383883ae38386e382b9e3838831: 687474703a2f2f7777772e6578616d706c652e636f6d2fe38386e382b9e383882f, e38386e382b9e38388" [1]=> string(60) "e38386e382b9e383883ae38386e382b9e3838832: e38386e382b9e38388" [2]=> string(42) "e38386e382b9e383883ae38386e382b9e3838833: " } Encoding: UTF-8 XML Prologue: present Chunk size: 1 byte(s) BOM: not prepended array(3) { [0]=> string(128) "e38386e382b9e383883ae38386e382b9e3838831: 687474703a2f2f7777772e6578616d706c652e636f6d2fe38386e382b9e383882f, e38386e382b9e38388" [1]=> string(60) "e38386e382b9e383883ae38386e382b9e3838832: e38386e382b9e38388" [2]=> string(42) "e38386e382b9e383883ae38386e382b9e3838833: " } ================================================================================ 134- Encoding: UTF-8 135- XML Prologue: not present 136- Chunk size: 1 byte(s) 137- BOM: not prepended 138- array(3) { 139- [0]=> 140- string(128) "e38386e382b9e383883ae38386e382b9e3838831: 687474703a2f2f7777772e6578616d706c652e636f6d2fe38386e382b9e383882f, e38386e382b9e38388" 141- [1]=> 142- string(60) "e38386e382b9e383883ae38386e382b9e3838832: e38386e382b9e38388" 143- [2]=> 144- string(42) "e38386e382b9e383883ae38386e382b9e3838833: " 145- } 146- Encoding: UTF-8 147- XML Prologue: present 148- Chunk size: 1 byte(s) 149- BOM: prepended 150- array(3) { 151- [0]=> 152- string(128) "e38386e382b9e383883ae38386e382b9e3838831: 687474703a2f2f7777772e6578616d706c652e636f6d2fe38386e382b9e383882f, e38386e382b9e38388" 153- [1]=> 154- string(60) "e38386e382b9e383883ae38386e382b9e3838832: e38386e382b9e38388" 155- [2]=> 156- string(42) "e38386e382b9e383883ae38386e382b9e3838833: " 157- } 158- Encoding: UTF-8 159- XML Prologue: not present 160- Chunk size: 1 byte(s) 161- BOM: prepended 162- array(3) { 163- [0]=> 164- string(128) "e38386e382b9e383883ae38386e382b9e3838831: 687474703a2f2f7777772e6578616d706c652e636f6d2fe38386e382b9e383882f, e38386e382b9e38388" 165- [1]=> 166- string(60) "e38386e382b9e383883ae38386e382b9e3838832: e38386e382b9e38388" 167- [2]=> 168- string(42) "e38386e382b9e383883ae38386e382b9e3838833: " 169- } 170- Encoding: UTF-16BE 171- XML Prologue: present 172- Chunk size: 1 byte(s) 173- BOM: not prepended 174- array(3) { 175- [0]=> 176- string(128) "e38386e382b9e383883ae38386e382b9e3838831: 687474703a2f2f7777772e6578616d706c652e636f6d2fe38386e382b9e383882f, e38386e382b9e38388" 177- [1]=> 178- string(60) "e38386e382b9e383883ae38386e382b9e3838832: e38386e382b9e38388" 179- [2]=> 180- string(42) "e38386e382b9e383883ae38386e382b9e3838833: " 181- } 182- Encoding: UTF-16BE 183- XML Prologue: present 184- Chunk size: 1 byte(s) 185- BOM: prepended 186- array(3) { 187- [0]=> 188- string(128) "e38386e382b9e383883ae38386e382b9e3838831: 687474703a2f2f7777772e6578616d706c652e636f6d2fe38386e382b9e383882f, e38386e382b9e38388" 189- [1]=> 190- string(60) "e38386e382b9e383883ae38386e382b9e3838832: e38386e382b9e38388" 191- [2]=> 192- string(42) "e38386e382b9e383883ae38386e382b9e3838833: " 193- } 194- Encoding: UTF-16BE 195- XML Prologue: not present 196- Chunk size: 1 byte(s) 197- BOM: prepended 198- array(3) { 199- [0]=> 200- string(128) "e38386e382b9e383883ae38386e382b9e3838831: 687474703a2f2f7777772e6578616d706c652e636f6d2fe38386e382b9e383882f, e38386e382b9e38388" 201- [1]=> 202- string(60) "e38386e382b9e383883ae38386e382b9e3838832: e38386e382b9e38388" 203- [2]=> 204- string(42) "e38386e382b9e383883ae38386e382b9e3838833: " 205- } 206- Encoding: UTF-16LE 207- XML Prologue: present 208- Chunk size: 1 byte(s) 209- BOM: not prepended 210- array(3) { 211- [0]=> 212- string(128) "e38386e382b9e383883ae38386e382b9e3838831: 687474703a2f2f7777772e6578616d706c652e636f6d2fe38386e382b9e383882f, e38386e382b9e38388" 213- [1]=> 214- string(60) "e38386e382b9e383883ae38386e382b9e3838832: e38386e382b9e38388" 215- [2]=> 216- string(42) "e38386e382b9e383883ae38386e382b9e3838833: " 217- } 218- Encoding: UTF-16LE 219- XML Prologue: present 220- Chunk size: 1 byte(s) 221- BOM: prepended 222- array(3) { 223- [0]=> 224- string(128) "e38386e382b9e383883ae38386e382b9e3838831: 687474703a2f2f7777772e6578616d706c652e636f6d2fe38386e382b9e383882f, e38386e382b9e38388" 225- [1]=> 226- string(60) "e38386e382b9e383883ae38386e382b9e3838832: e38386e382b9e38388" 227- [2]=> 228- string(42) "e38386e382b9e383883ae38386e382b9e3838833: " 229- } 230- Encoding: UTF-16LE 231- XML Prologue: not present 232- Chunk size: 1 byte(s) 233- BOM: prepended 234- array(3) { 235- [0]=> 236- string(128) "e38386e382b9e383883ae38386e382b9e3838831: 687474703a2f2f7777772e6578616d706c652e636f6d2fe38386e382b9e383882f, e38386e382b9e38388" 237- [1]=> 238- string(60) "e38386e382b9e383883ae38386e382b9e3838832: e38386e382b9e38388" 239- [2]=> 240- string(42) "e38386e382b9e383883ae38386e382b9e3838833: " 241- } ================================================================================ ================================================================================ /home/fredrik/webserver/php-5.2.4/sapi/cli/tests/015.phpt ================================================================================ PHP 5.2.4 (cli) (built: Oct 4 2007 10:17:34) PHP 5.2.4 (cli) (built: Oct 4 2007 10:17:34) Usage: php [options] [-f] <file> [--] [args...] Done ================================================================================ 002+ 003+ PHP 5.2.4 (cli) (built: Oct 4 2007 10:17:34) 004+ Usage: php [options] [-f] <file> [--] [args...] 005+ Done 002- Array 003- ( 004- [0] => - 005- [1] => foo 006- [2] => bar 007- [3] => baz 008- ) 009- 010- PHP %d.%d.%d%s(cli) (built: %s)%s 011- Usage: %s [options] [-f] <file> [--] [args...] 012- Done ================================================================================ ================================================================================ BUILD ENVIRONMENT ================================================================================ OS: Linux - Linux einstein.designtech.se 2.4.20-28.7 #1 Thu Dec 18 11:31:59 EST 2003 i686 Autoconf: Autoconf version 2.13 Bundled Libtool: ltmain.sh (GNU libtool) 1.5.20 (1.1220.2.287 2005/08/31 18:54:15) Copyright (C) 2005 Free Software Foundation, Inc. This is free software; see the source for copying conditions. There is NO warranty; not even for MERCHANTABILITY or FITNESS FOR A PARTICULAR PURPOSE. System Libtool: ltmain.sh (GNU libtool) 1.4 (1.920 2001/04/24 23:26:18) Compiler: Reading specs from /usr/local/lib/gcc/i686-pc-linux-gnu/3.4.0/specs Configured with: ./configure Thread model: posix gcc version 3.4.0 Bison: GNU Bison version 1.28 Libraries: libcrypt.so.1 => /lib/libcrypt.so.1 (0x4002c000) libpthread.so.0 => /lib/i686/libpthread.so.0 (0x40059000) librt.so.1 => /lib/librt.so.1 (0x4006e000) libm.so.6 => /lib/i686/libm.so.6 (0x40080000) libmhash.so.2 => /usr/local/lib/libmhash.so.2 (0x400a3000) libmcrypt.so.4 => /usr/local/lib/libmcrypt.so.4 (0x400c6000) libltdl.so.3 => /usr/lib/libltdl.so.3 (0x400fe000) libdl.so.2 => /lib/libdl.so.2 (0x40105000) libldap-2.3.so.0 => /usr/local/lib/libldap-2.3.so.0 (0x40109000) libssl.so.0.9.7 => /usr/local/ssl/lib/libssl.so.0.9.7 (0x4013d000) libcrypto.so.0.9.7 => /usr/local/ssl/lib/libcrypto.so.0.9.7 (0x4016c000) liblber-2.3.so.0 => /usr/local/lib/liblber-2.3.so.0 (0x4025e000) libfreetype.so.6 => /usr/lib/libfreetype.so.6 (0x4026c000) libpng.so.3 => /usr/local/lib/libpng.so.3 (0x402ab000) libresolv.so.2 => /lib/libresolv.so.2 (0x402e4000) libnsl.so.1 => /lib/libnsl.so.1 (0x402f6000) libcurl.so.3 => /usr/local/lib/libcurl.so.3 (0x4030c000) libxml2.so.2 => /usr/local/lib/libxml2.so.2 (0x4034a000) libc.so.6 => /lib/i686/libc.so.6 (0x40474000) libgcc_s.so.1 => /usr/local/lib/libgcc_s.so.1 (0x405b0000) libz.so.1 => /lib/libz.so.1 (0x405b9000) /lib/ld-linux.so.2 => /lib/ld-linux.so.2 (0x40000000) User's E-mail: fredrik dot lindvall at designtech dot se ================================================================================ PHPINFO ================================================================================ phpinfo() PHP Version => 5.2.4 System => Linux einstein.designtech.se 2.4.20-28.7 #1 Thu Dec 18 11:31:59 EST 2003 i686 Build Date => Oct 4 2007 10:11:26 Configure Command => ./configure --with-apxs2=/usr/local/apache2/bin/apxs --with-mysql=/usr/local/mysql --enable-zip --disable-debug --with-mcrypt=/usr/local --with-mhash=/usr/local --with-gd --enable-inline-optimization --with-openssl=/usr/local/ssl --with-zlib --with-freetype-dir=/usr --with-png-dir=/usr/local --with-zlib-dir=/usr/local --with-gettext -with-java=/usr/local/j2sdk1.4.2_04 --with-curl --with-ldap=/usr/local --enable-mbstring Server API => Command Line Interface Virtual Directory Support => disabled Configuration File (php.ini) Path => /usr/local/lib Loaded Configuration File => /usr/local/Zend/etc/php.ini PHP API => 20041225 PHP Extension => 20060613 Zend Extension => 220060519 Debug Build => no Thread Safety => disabled Zend Memory Manager => enabled IPv6 Support => enabled Registered PHP Streams => zip, php, file, data, http, ftp, compress.zlib, https, ftps Registered Stream Socket Transports => tcp, udp, unix, udg, ssl, sslv3, sslv2, tls Registered Stream Filters => string.rot13, string.toupper, string.tolower, string.strip_tags, convert.*, consumed, convert.iconv.*, zlib.* This program makes use of the Zend Scripting Language Engine: Zend Engine v2.2.0, Copyright (c) 1998-2007 Zend Technologies with Zend Extension Manager v1.2.2, Copyright (c) 2003-2007, by Zend Technologies with Zend Optimizer v3.3.0, Copyright (c) 1998-2007, by Zend Technologies _______________________________________________________________________ Configuration PHP Core Directive => Local Value => Master Value allow_call_time_pass_reference => On => On allow_url_fopen => On => On allow_url_include => Off => Off always_populate_raw_post_data => Off => Off arg_separator.input => & => & arg_separator.output => & => & asp_tags => Off => Off auto_append_file => no value => no value auto_globals_jit => On => On auto_prepend_file => no value => no value browscap => no value => no value default_charset => no value => no value default_mimetype => text/html => text/html define_syslog_variables => Off => Off disable_classes => no value => no value disable_functions => no value => no value display_errors => STDOUT => STDOUT display_startup_errors => Off => Off doc_root => no value => no value docref_ext => no value => no value docref_root => no value => no value enable_dl => On => On error_append_string => no value => no value error_log => no value => no value error_prepend_string => no value => no value error_reporting => 6135 => 6135 expose_php => On => On extension_dir => /usr/local/lib/php/extensions/no-debug-non-zts-20060613/ => /usr/local/lib/php/extensions/no-debug-non-zts-20060613/ file_uploads => On => On highlight.bg => <font style="color: #FFFFFF">#FFFFFF</font> => <font style="color: #FFFFFF">#FFFFFF</font> highlight.comment => <font style="color: #FF9900">#FF9900</font> => <font style="color: #FF9900">#FF9900</font> highlight.default => <font style="color: #0000CC">#0000CC</font> => <font style="color: #0000CC">#0000CC</font> highlight.html => <font style="color: #000000">#000000</font> => <font style="color: #000000">#000000</font> highlight.keyword => <font style="color: #006600">#006600</font> => <font style="color: #006600">#006600</font> highlight.string => <font style="color: #CC0000">#CC0000</font> => <font style="color: #CC0000">#CC0000</font> html_errors => Off => Off ignore_repeated_errors => Off => Off ignore_repeated_source => Off => Off ignore_user_abort => Off => Off implicit_flush => On => On include_path => .:/usr/local/ZendFramework/library:/php/includes:/usr/share/php/PEAR:/usr/local/lib/php:/usr/share/wallit/client:/usr/share/esup-phpcas/source => .:/usr/local/ZendFramework/library:/php/includes:/usr/share/php/PEAR:/usr/local/lib/php:/usr/share/wallit/client:/usr/share/esup-phpcas/source log_errors => On => On log_errors_max_len => 1024 => 1024 magic_quotes_gpc => On => On magic_quotes_runtime => Off => Off magic_quotes_sybase => Off => Off mail.force_extra_parameters => no value => no value max_execution_time => 0 => 0 max_input_nesting_level => 64 => 64 max_input_time => -1 => -1 memory_limit => 256M => 256M open_basedir => no value => no value output_buffering => 0 => 0 output_handler => no value => no value post_max_size => 300M => 300M precision => 14 => 14 realpath_cache_size => 16K => 16K realpath_cache_ttl => 120 => 120 register_argc_argv => On => On register_globals => Off => Off register_long_arrays => On => On report_memleaks => On => On report_zend_debug => Off => Off safe_mode => Off => Off safe_mode_exec_dir => no value => no value safe_mode_gid => Off => Off safe_mode_include_dir => no value => no value sendmail_from => me@localhost.com => me@localhost.com sendmail_path => /usr/sbin/sendmail -t -i => /usr/sbin/sendmail -t -i serialize_precision => 100 => 100 short_open_tag => On => On SMTP => localhost => localhost smtp_port => 25 => 25 sql.safe_mode => Off => Off track_errors => Off => Off unserialize_callback_func => no value => no value upload_max_filesize => 3000M => 3000M upload_tmp_dir => /var/tmp => /var/tmp user_dir => no value => no value variables_order => EGPCS => EGPCS xmlrpc_error_number => 0 => 0 xmlrpc_errors => Off => Off y2k_compliance => Off => Off zend.ze1_compatibility_mode => Off => Off ctype ctype functions => enabled curl cURL support => enabled cURL Information => libcurl/7.14.0 OpenSSL/0.9.7d zlib/1.2.2 date date/time support => enabled "Olson" Timezone Database Version => 2007.6 Timezone Database => internal Default timezone => Europe/Berlin Directive => Local Value => Master Value date.default_latitude => 31.7667 => 31.7667 date.default_longitude => 35.2333 => 35.2333 date.sunrise_zenith => 90.583333 => 90.583333 date.sunset_zenith => 90.583333 => 90.583333 date.timezone => no value => no value dom DOM/XML => enabled DOM/XML API Version => 20031129 libxml Version => 2.6.11 HTML Support => enabled XPath Support => enabled XPointer Support => enabled Schema Support => enabled RelaxNG Support => enabled filter Input Validation and Filtering => enabled Revision => $Revision: 1.52.2.39 $ Directive => Local Value => Master Value filter.default => unsafe_raw => unsafe_raw filter.default_flags => no value => no value gd GD Support => enabled GD Version => bundled (2.0.34 compatible) FreeType Support => enabled FreeType Linkage => with freetype FreeType Version => 2.0.9 GIF Read Support => enabled GIF Create Support => enabled PNG Support => enabled WBMP Support => enabled XBM Support => enabled gettext GetText Support => enabled hash hash support => enabled Hashing Engines => md2 md4 md5 sha1 sha256 sha384 sha512 ripemd128 ripemd160 ripemd256 ripemd320 whirlpool tiger128,3 tiger160,3 tiger192,3 tiger128,4 tiger160,4 tiger192,4 snefru gost adler32 crc32 crc32b haval128,3 haval160,3 haval192,3 haval224,3 haval256,3 haval128,4 haval160,4 haval192,4 haval224,4 haval256,4 haval128,5 haval160,5 haval192,5 haval224,5 haval256,5 iconv iconv support => enabled iconv implementation => glibc iconv library version => 2.2.4 Directive => Local Value => Master Value iconv.input_encoding => ISO-8859-1 => ISO-8859-1 iconv.internal_encoding => ISO-8859-1 => ISO-8859-1 iconv.output_encoding => ISO-8859-1 => ISO-8859-1 json json support => enabled json version => 1.2.1 ldap LDAP Support => enabled RCS Version => $Id: ldap.c,v 1.161.2.3.2.11 2007/07/17 09:09:42 jani Exp $ Total Links => 0/unlimited API Version => 3001 Vendor Name => OpenLDAP Vendor Version => 20338 libxml libXML support => active libXML Version => 2.6.11 libXML streams => enabled mbstring Multibyte Support => enabled Multibyte string engine => libmbfl Multibyte (japanese) regex support => enabled Multibyte regex (oniguruma) version => 4.4.4 Multibyte regex (oniguruma) backtrack check => On mbstring extension makes use of "streamable kanji code filter and converter", which is distributed under the GNU Lesser General Public License version 2.1. Directive => Local Value => Master Value mbstring.detect_order => no value => no value mbstring.encoding_translation => Off => Off mbstring.func_overload => 0 => 0 mbstring.http_input => pass => pass mbstring.http_output => pass => pass mbstring.internal_encoding => ISO-8859-1 => no value mbstring.language => neutral => neutral mbstring.strict_detection => Off => Off mbstring.substitute_character => no value => no value mcrypt mcrypt support => enabled Version => 2.5.7 Api No => 20021217 Supported ciphers => cast-128 gost rijndael-128 twofish arcfour cast-256 loki97 rijndael-192 saferplus wake blowfish-compat des rijndael-256 serpent xtea blowfish enigma rc2 tripledes Supported modes => cbc cfb ctr ecb ncfb nofb ofb stream Directive => Local Value => Master Value mcrypt.algorithms_dir => no value => no value mcrypt.modes_dir => no value => no value mhash MHASH support => Enabled MHASH API Version => 20020524 mysql MySQL Support => enabled Active Persistent Links => 0 Active Links => 0 Client API version => 4.0.18 MYSQL_MODULE_TYPE => external MYSQL_SOCKET => /tmp/mysql.sock MYSQL_INCLUDE => -I/usr/local/mysql/include/mysql MYSQL_LIBS => -L/usr/local/mysql/lib/mysql -lmysqlclient Directive => Local Value => Master Value mysql.allow_persistent => On => On mysql.connect_timeout => 60 => 60 mysql.default_host => no value => no value mysql.default_password => no value => no value mysql.default_port => no value => no value mysql.default_socket => no value => no value mysql.default_user => no value => no value mysql.max_links => Unlimited => Unlimited mysql.max_persistent => Unlimited => Unlimited mysql.trace_mode => Off => Off openssl OpenSSL support => enabled OpenSSL Version => OpenSSL 0.9.7g 11 Apr 2005 pcre PCRE (Perl Compatible Regular Expressions) Support => enabled PCRE Library Version => 7.2 2007-06-19 Directive => Local Value => Master Value pcre.backtrack_limit => 100000 => 100000 pcre.recursion_limit => 100000 => 100000 PDO PDO support => enabled PDO drivers => sqlite2, sqlite pdo_sqlite PDO Driver for SQLite 3.x => enabled PECL Module version => (bundled) 1.0.1 $Id: pdo_sqlite.c,v 1.10.2.6.2.2 2007/03/23 14:30:00 wez Exp $ SQLite Library => 3.3.17 posix Revision => $Revision: 1.70.2.3.2.16 $ Reflection Reflection => enabled Version => $Id: php_reflection.c,v 1.164.2.33.2.45 2007/08/20 17:01:22 sebastian Exp $ session Session Support => enabled Registered save handlers => files user sqlite Registered serializer handlers => php php_binary Directive => Local Value => Master Value session.auto_start => Off => Off session.bug_compat_42 => On => On session.bug_compat_warn => On => On session.cache_expire => 180 => 180 session.cache_limiter => nocache => nocache session.cookie_domain => no value => no value session.cookie_httponly => Off => Off session.cookie_lifetime => 0 => 0 session.cookie_path => / => / session.cookie_secure => Off => Off session.entropy_file => no value => no value session.entropy_length => 0 => 0 session.gc_divisor => 100 => 100 session.gc_maxlifetime => 1440 => 1440 session.gc_probability => 1 => 1 session.hash_bits_per_character => 4 => 4 session.hash_function => 0 => 0 session.name => PHPSESSID => PHPSESSID session.referer_check => no value => no value session.save_handler => files => files session.save_path => /tmp => /tmp session.serialize_handler => php => php session.use_cookies => On => On session.use_only_cookies => Off => Off session.use_trans_sid => 1 => 1 SimpleXML Simplexml support => enabled Revision => $Revision: 1.151.2.22.2.35 $ Schema support => enabled SPL SPL support => enabled Interfaces => Countable, OuterIterator, RecursiveIterator, SeekableIterator, SplObserver, SplSubject Classes => AppendIterator, ArrayIterator, ArrayObject, BadFunctionCallException, BadMethodCallException, CachingIterator, DirectoryIterator, DomainException, EmptyIterator, FilterIterator, InfiniteIterator, InvalidArgumentException, IteratorIterator, LengthException, LimitIterator, LogicException, NoRewindIterator, OutOfBoundsException, OutOfRangeException, OverflowException, ParentIterator, RangeException, RecursiveArrayIterator, RecursiveCachingIterator, RecursiveDirectoryIterator, RecursiveFilterIterator, RecursiveIteratorIterator, RecursiveRegexIterator, RegexIterator, RuntimeException, SimpleXMLIterator, SplFileInfo, SplFileObject, SplObjectStorage, SplTempFileObject, UnderflowException, UnexpectedValueException SQLite SQLite support => enabled PECL Module version => 2.0-dev $Id: sqlite.c,v 1.166.2.13.2.9 2007/05/19 17:58:22 iliaa Exp $ SQLite Library => 2.8.17 SQLite Encoding => iso8859 Directive => Local Value => Master Value sqlite.assoc_case => 0 => 0 standard Regex Library => Bundled library enabled Dynamic Library Support => enabled Path to sendmail => /usr/sbin/sendmail -t -i Directive => Local Value => Master Value assert.active => 1 => 1 assert.bail => 0 => 0 assert.callback => no value => no value assert.quiet_eval => 0 => 0 assert.warning => 1 => 1 auto_detect_line_endings => 0 => 0 default_socket_timeout => 60 => 60 safe_mode_allowed_env_vars => PHP_ => PHP_ safe_mode_protected_env_vars => LD_LIBRARY_PATH => LD_LIBRARY_PATH url_rewriter.tags => a=href,area=href,frame=src,input=src,form=fakeentry => a=href,area=href,frame=src,input=src,form=fakeentry user_agent => no value => no value tokenizer Tokenizer Support => enabled xml XML Support => active XML Namespace Support => active libxml2 Version => 2.6.11 xmlreader XMLReader => enabled xmlwriter XMLWriter => enabled Zend Optimizer Optimization Pass 1 => enabled Optimization Pass 2 => enabled Optimization Pass 3 => enabled Optimization Pass 4 => enabled Optimization Pass 9 => disabled Zend Loader => enabled License Path => /etc/httpd/pc2.zl Obfuscation level => 3 zip Zip => enabled Extension Version => $Id: php_zip.c,v 1.1.2.38 2007/08/06 22:02:32 bjori Exp $ Zip version => 2.0.0 Libzip version => 0.7.1 zlib ZLib Support => enabled Stream Wrapper support => compress.zlib:// Stream Filter support => zlib.inflate, zlib.deflate Compiled Version => 1.2.2 Linked Version => 1.2.2 Directive => Local Value => Master Value zlib.output_compression => Off => Off zlib.output_compression_level => -1 => -1 zlib.output_handler => no value => no value Additional Modules Module Name Environment Variable => Value PWD => /home/fredrik/webserver/php-5.2.4 XAUTHORITY => /root/.xauthxUZo1Z MAKEFLAGS => MFLAGS => HOSTNAME => einstein.designtech.se QTDIR => /usr/lib/qt-2.3.1 LESSOPEN => |/usr/bin/lesspipe.sh %s CC => gcc SSH_CONNECTION => deleted KDEDIR => /usr LS_COLORS => no=00:fi=00:di=01;34:ln=01;36:pi=40;33:so=01;35:bd=40;33;01:cd=40;33;01:or=01;05;37;41:mi=01;05;37;41:ex=01;32:*.cmd=01;32:*.exe=01;32:*.com=01;32:*.btm=01;32:*.bat=01;32:*.sh=01;32:*.csh=01;32:*.tar=01;31:*.tgz=01;31:*.arj=01;31:*.taz=01;31:*.lzh=01;31:*.zip=01;31:*.z=01;31:*.Z=01;31:*.gz=01;31:*.bz2=01;31:*.bz=01;31:*.tz=01;31:*.rpm=01;31:*.cpio=01;31:*.jpg=01;35:*.gif=01;35:*.bmp=01;35:*.xbm=01;35:*.xpm=01;35:*.png=01;35:*.tif=01;35: USER => fredrik MACHTYPE => i386-redhat-linux-gnu TEST_PHP_SRCDIR => /home/fredrik/webserver/php-5.2.4 MAIL => /var/spool/mail/fredrik INPUTRC => /etc/inputrc LANG => sv_SE MAKELEVEL => 1 DISPLAY => einstein.designtech.se:10.0 SHLVL => 4 LOGNAME => fredrik TEST_PHP_EXECUTABLE => /home/fredrik/webserver/php-5.2.4/sapi/cli/php _ => /home/fredrik/webserver/php-5.2.4/sapi/cli/php SHELL => /bin/sh HOSTTYPE => i386 HISTSIZE => 1000 OSTYPE => linux-gnu TERM => xterm HOME => /root SSH_AUTH_SOCK => deleted PATH => /usr/bin:/bin:/usr/sbin:/sbin:/usr/local/bin:/usr/local/j2sdk1.4.2_04/bin:/usr/X11R6/bin CFLAGS => -I/usr/include -O3 -fomit-frame-pointer -march=i686 -prefer-non-pic SSH_TTY => deleted PHP Variables Variable => Value _SERVER["PWD"] => /home/fredrik/webserver/php-5.2.4 _SERVER["XAUTHORITY"] => /root/.xauthxUZo1Z _SERVER["MAKEFLAGS"] => _SERVER["MFLAGS"] => _SERVER["HOSTNAME"] => einstein.designtech.se _SERVER["QTDIR"] => /usr/lib/qt-2.3.1 _SERVER["LESSOPEN"] => |/usr/bin/lesspipe.sh %s _SERVER["CC"] => gcc _SERVER["SSH_CONNECTION"] => deleted _SERVER["KDEDIR"] => /usr _SERVER["LS_COLORS"] => no=00:fi=00:di=01;34:ln=01;36:pi=40;33:so=01;35:bd=40;33;01:cd=40;33;01:or=01;05;37;41:mi=01;05;37;41:ex=01;32:*.cmd=01;32:*.exe=01;32:*.com=01;32:*.btm=01;32:*.bat=01;32:*.sh=01;32:*.csh=01;32:*.tar=01;31:*.tgz=01;31:*.arj=01;31:*.taz=01;31:*.lzh=01;31:*.zip=01;31:*.z=01;31:*.Z=01;31:*.gz=01;31:*.bz2=01;31:*.bz=01;31:*.tz=01;31:*.rpm=01;31:*.cpio=01;31:*.jpg=01;35:*.gif=01;35:*.bmp=01;35:*.xbm=01;35:*.xpm=01;35:*.png=01;35:*.tif=01;35: _SERVER["USER"] => fredrik _SERVER["MACHTYPE"] => i386-redhat-linux-gnu _SERVER["TEST_PHP_SRCDIR"] => /home/fredrik/webserver/php-5.2.4 _SERVER["MAIL"] => /var/spool/mail/fredrik _SERVER["INPUTRC"] => /etc/inputrc _SERVER["LANG"] => sv_SE _SERVER["MAKELEVEL"] => 1 _SERVER["DISPLAY"] => einstein.designtech.se:10.0 _SERVER["SHLVL"] => 4 _SERVER["LOGNAME"] => fredrik _SERVER["TEST_PHP_EXECUTABLE"] => /home/fredrik/webserver/php-5.2.4/sapi/cli/php _SERVER["_"] => /home/fredrik/webserver/php-5.2.4/sapi/cli/php _SERVER["SHELL"] => /bin/sh _SERVER["HOSTTYPE"] => i386 _SERVER["HISTSIZE"] => 1000 _SERVER["OSTYPE"] => linux-gnu _SERVER["TERM"] => xterm _SERVER["HOME"] => /root _SERVER["SSH_AUTH_SOCK"] => deleted _SERVER["PATH"] => /usr/bin:/bin:/usr/sbin:/sbin:/usr/local/bin:/usr/local/j2sdk1.4.2_04/bin:/usr/X11R6/bin _SERVER["CFLAGS"] => -I/usr/include -O3 -fomit-frame-pointer -march=i686 -prefer-non-pic _SERVER["SSH_TTY"] => deleted _SERVER["PHP_SELF"] => _SERVER["SCRIPT_NAME"] => _SERVER["SCRIPT_FILENAME"] => _SERVER["PATH_TRANSLATED"] => _SERVER["DOCUMENT_ROOT"] => _SERVER["REQUEST_TIME"] => 1191486717 _SERVER["argv"] => Array ( ) _SERVER["argc"] => 0 _ENV["PWD"] => /home/fredrik/webserver/php-5.2.4 _ENV["XAUTHORITY"] => /root/.xauthxUZo1Z _ENV["MAKEFLAGS"] => _ENV["MFLAGS"] => _ENV["HOSTNAME"] => einstein.designtech.se _ENV["QTDIR"] => /usr/lib/qt-2.3.1 _ENV["LESSOPEN"] => |/usr/bin/lesspipe.sh %s _ENV["CC"] => gcc _ENV["SSH_CONNECTION"] => deleted _ENV["KDEDIR"] => /usr _ENV["LS_COLORS"] => no=00:fi=00:di=01;34:ln=01;36:pi=40;33:so=01;35:bd=40;33;01:cd=40;33;01:or=01;05;37;41:mi=01;05;37;41:ex=01;32:*.cmd=01;32:*.exe=01;32:*.com=01;32:*.btm=01;32:*.bat=01;32:*.sh=01;32:*.csh=01;32:*.tar=01;31:*.tgz=01;31:*.arj=01;31:*.taz=01;31:*.lzh=01;31:*.zip=01;31:*.z=01;31:*.Z=01;31:*.gz=01;31:*.bz2=01;31:*.bz=01;31:*.tz=01;31:*.rpm=01;31:*.cpio=01;31:*.jpg=01;35:*.gif=01;35:*.bmp=01;35:*.xbm=01;35:*.xpm=01;35:*.png=01;35:*.tif=01;35: _ENV["USER"] => fredrik _ENV["MACHTYPE"] => i386-redhat-linux-gnu _ENV["TEST_PHP_SRCDIR"] => /home/fredrik/webserver/php-5.2.4 _ENV["MAIL"] => /var/spool/mail/fredrik _ENV["INPUTRC"] => /etc/inputrc _ENV["LANG"] => sv_SE _ENV["MAKELEVEL"] => 1 _ENV["DISPLAY"] => einstein.designtech.se:10.0 _ENV["SHLVL"] => 4 _ENV["LOGNAME"] => fredrik _ENV["TEST_PHP_EXECUTABLE"] => /home/fredrik/webserver/php-5.2.4/sapi/cli/php _ENV["_"] => /home/fredrik/webserver/php-5.2.4/sapi/cli/php _ENV["SHELL"] => /bin/sh _ENV["HOSTTYPE"] => i386 _ENV["HISTSIZE"] => 1000 _ENV["OSTYPE"] => linux-gnu _ENV["TERM"] => xterm _ENV["HOME"] => /root _ENV["SSH_AUTH_SOCK"] => deleted _ENV["PATH"] => /usr/bin:/bin:/usr/sbin:/sbin:/usr/local/bin:/usr/local/j2sdk1.4.2_04/bin:/usr/X11R6/bin _ENV["CFLAGS"] => -I/usr/include -O3 -fomit-frame-pointer -march=i686 -prefer-non-pic _ENV["SSH_TTY"] => deleted PHP License This program is free software; you can redistribute it and/or modify it under the terms of the PHP License as published by the PHP Group and included in the distribution in the file: LICENSE This program is distributed in the hope that it will be useful, but WITHOUT ANY WARRANTY; without even the implied warranty of MERCHANTABILITY or FITNESS FOR A PARTICULAR PURPOSE. If you did not receive a copy of the PHP license, or have any questions about PHP licensing, please contact license@php.net.

« previous php.qa (#48984) next »