PHP Test results

From: Date: Sat, 06 Apr 2002 09:24:49 +0000
Subject: PHP Test results
Groups: php.qa 
Request: Send a blank email to php-qa+get-4907@lists.php.net to get a copy of this message
array ( 'user_name' => 'Sebastian Wolfgarten', 'email' => 'sebastian.wolfgarten@gmx.net', 'package' => '4.2.0-RC2', 'testcase' => '0', 'status' => 'Fail', 'os' => 'Linux i386', 'sapi' => 'Apache 2.x DSO', 'automake' => '14', 'autoconf' => '253', 'libtool' => '142', 'bison' => '132', 'bcmath' => 'on', 'ftp' => 'on', 'gd' => 'on', 'mcrypt' => 'on', 'mhash' => 'on', 'mysql' => 'on', 'pdf' => 'on', 'standard' => 'on', 'sysvshm' => 'on', 'test' => 'Hi, I tried to compile 4.2.0RC2 on Debian linux 3.0 with kernel 2.4.16. I already grepped the latest apache 2.0 cvs snapshot and compiled it without any problems. Now I tried to compile php and it fails with the following errors: make[2]: Entering directory `/home/sebastian/apachenew/php-4.2.0RC2/sapi/apache2filter\' make[3]: Entering directory `/home/sebastian/apachenew/php-4.2.0RC2/sapi/apache2filter\' /bin/sh /home/sebastian/apachenew/php-4.2.0RC2/libtool --silent --mode=compile gcc -I. -I/home/sebastian/apachenew/php-4.2.0RC2/sapi/apache2filter -I/home/sebastian/apachenew/php-4.2.0RC2/main -I/home/sebastian/apachenew/php-4.2.0RC2 -I/usr/local/apache2/include -I/home/sebastian/apachenew/php-4.2.0RC2/Zend -I/usr/local/include -I/usr/local/include/freetype -I/home/sebastian/apachenew/php-4.2.0RC2/ext/mysql/libmysql -I/home/sebastian/apachenew/php-4.2.0RC2/ext/xml/expat -D_REENTRANT -I/home/sebastian/apachenew/php-4.2.0RC2/TSRM -DTHREAD=1 -g -O2 -pthread -DZTS -prefer-pic -c sapi_apache2.c sapi_apache2.c: In function `php_apache_sapi_ub_write\': sapi_apache2.c:58: too few arguments to function `apr_brigade_create\' sapi_apache2.c:61: too few arguments to function `apr_bucket_transient_create\' sapi_apache2.c: In function `php_apache_sapi_flush\': sapi_apache2.c:174: too few arguments to function `apr_brigade_create\' sapi_apache2.c:175: too few arguments to function `apr_bucket_flush_create\' sapi_apache2.c: In function `php_input_filter\': sapi_apache2.c:257: too few arguments to function `apr_brigade_create\' sapi_apache2.c: In function `php_output_filter\': sapi_apache2.c:331: too few arguments to function `apr_brigade_create\' sapi_apache2.c:386: too few arguments to function `apr_bucket_transient_create\' sapi_apache2.c:395: too few arguments to function `apr_bucket_eos_create\' make[3]: *** [sapi_apache2.lo] Error 1 make[3]: Leaving directory `/home/sebastian/apachenew/php-4.2.0RC2/sapi/apache2filter\' make[2]: *** [all-recursive] Error 1 make[2]: Leaving directory `/home/sebastian/apachenew/php-4.2.0RC2/sapi/apache2filter\' make[1]: *** [all-recursive] Error 1 make[1]: Leaving directory `/home/sebastian/apachenew/php-4.2.0RC2/sapi\' make: *** [all-recursive] Error 1 ', 'problems' => 'compile error when \"making\" the source: make[2]: Entering directory `/home/sebastian/apachenew/php-4.2.0RC2/sapi/apache2filter\' make[3]: Entering directory `/home/sebastian/apachenew/php-4.2.0RC2/sapi/apache2filter\' /bin/sh /home/sebastian/apachenew/php-4.2.0RC2/libtool --silent --mode=compile gcc -I. -I/home/sebastian/apachenew/php-4.2.0RC2/sapi/apache2filter -I/home/sebastian/apachenew/php-4.2.0RC2/main -I/home/sebastian/apachenew/php-4.2.0RC2 -I/usr/local/apache2/include -I/home/sebastian/apachenew/php-4.2.0RC2/Zend -I/usr/local/include -I/usr/local/include/freetype -I/home/sebastian/apachenew/php-4.2.0RC2/ext/mysql/libmysql -I/home/sebastian/apachenew/php-4.2.0RC2/ext/xml/expat -D_REENTRANT -I/home/sebastian/apachenew/php-4.2.0RC2/TSRM -DTHREAD=1 -g -O2 -pthread -DZTS -prefer-pic -c sapi_apache2.c sapi_apache2.c: In function `php_apache_sapi_ub_write\': sapi_apache2.c:58: too few arguments to function `apr_brigade_create\' sapi_apache2.c:61: too few arguments to function `apr_bucket_transient_create\' sapi_apache2.c: In function `php_apache_sapi_flush\': sapi_apache2.c:174: too few arguments to function `apr_brigade_create\' sapi_apache2.c:175: too few arguments to function `apr_bucket_flush_create\' sapi_apache2.c: In function `php_input_filter\': sapi_apache2.c:257: too few arguments to function `apr_brigade_create\' sapi_apache2.c: In function `php_output_filter\': sapi_apache2.c:331: too few arguments to function `apr_brigade_create\' sapi_apache2.c:386: too few arguments to function `apr_bucket_transient_create\' sapi_apache2.c:395: too few arguments to function `apr_bucket_eos_create\' make[3]: *** [sapi_apache2.lo] Error 1 make[3]: Leaving directory `/home/sebastian/apachenew/php-4.2.0RC2/sapi/apache2filter\' make[2]: *** [all-recursive] Error 1 make[2]: Leaving directory `/home/sebastian/apachenew/php-4.2.0RC2/sapi/apache2filter\' make[1]: *** [all-recursive] Error 1 make[1]: Leaving directory `/home/sebastian/apachenew/php-4.2.0RC2/sapi\' make: *** [all-recursive] Error 1 ', 'bugids' => '', 'remarks' => '', )

« previous php.qa (#4907) next »