PHP Test results

From: Date: Mon, 08 Apr 2002 11:10:56 +0000
Subject: PHP Test results
Groups: php.qa 
Request: Send a blank email to php-qa+get-4941@lists.php.net to get a copy of this message
array ( 'user_name' => 'Martin Kellermann', 'email' => 'Kelma@sk-datentechnik.com', 'package' => '4.2.0-RC2', 'testcase' => '0', 'status' => 'Fail', 'os' => 'Linux i386', 'sapi' => 'Apache 2.x DSO', 'automake' => '15', 'autoconf' => '252', 'libtool' => '142', 'bison' => 'other', 'gd' => 'on', 'msql' => 'on', 'zlib' => 'on', 'test' => 'could not test. build failed', 'problems' => '\"./configure --prefix=/usr --with-mysql=/usr/local/mysql/ --with-t1lib=/usr/lib/ --with-zlib --with-gd=/usr/src/gd1.5/ --with-ttf --with-apxs2=/usr/local/apache2/bin/apxs\" runs fine. \"make\" fails with error: sapi_apache2.c: In function `php_apache_sapi_ub_write\': sapi_apache2.c:58: too few arguments to function `apr_brigade_create\' sapi_apache2.c:61: too few arguments to function `apr_bucket_transient_create\' sapi_apache2.c: In function `php_apache_sapi_flush\': sapi_apache2.c:174: too few arguments to function `apr_brigade_create\' sapi_apache2.c:175: too few arguments to function `apr_bucket_flush_create\' sapi_apache2.c: In function `php_input_filter\': sapi_apache2.c:257: too few arguments to function `apr_brigade_create\' sapi_apache2.c: In function `php_output_filter\': sapi_apache2.c:331: too few arguments to function `apr_brigade_create\' sapi_apache2.c:386: too few arguments to function `apr_bucket_transient_create\' sapi_apache2.c:395: too few arguments to function `apr_bucket_eos_create\' make[3]: *** [sapi_apache2.lo] Error 1 make[3]: Leaving directory `/usr/src/php-4.2.0RC2/sapi/apache2filter\' make[2]: *** [all-recursive] Error 1 make[2]: Leaving directory `/usr/src/php-4.2.0RC2/sapi/apache2filter\' make[1]: *** [all-recursive] Error 1 make[1]: Leaving directory `/usr/src/php-4.2.0RC2/sapi\' make: *** [all-recursive] Error 1 ', 'bugids' => '', 'remarks' => '', )

« previous php.qa (#4941) next »