Test results for 5.2.4 [failed]

From: Date: Thu, 11 Oct 2007 14:25:55 +0000
Subject: Test results for 5.2.4 [failed]
Groups: php.qa 
Request: Send a blank email to php-qa+get-50034@lists.php.net to get a copy of this message
===================================================================== FAILED TEST SUMMARY --------------------------------------------------------------------- idate() and invalid params [ext/date/tests/005.phpt] localtime() tests [ext/date/tests/007.phpt] getdate() tests [ext/date/tests/008.phpt] strftime() and gmstrftime() tests [ext/date/tests/009.phpt] timezone_offset_get() tests [ext/date/tests/014.phpt] Bug #32555 (strtotime("tomorrow") can return false) [ext/date/tests/bug32555.phpt] Bug #33532 (Different output for strftime() and date()) [ext/date/tests/bug33532.phpt] Bug #37368 (Incorrect timestamp returned for strtotime()). [ext/date/tests/bug37368.phpt] Bug #37514 (strtotime doesn't assume year correctly). [ext/date/tests/bug37514.phpt] date_default_timezone_get() function [1] [ext/date/tests/date_default_timezone_get-1.phpt] date_default_timezone_get() function [2] [ext/date/tests/date_default_timezone_get-2.phpt] date_default_timezone_set() function [1] [ext/date/tests/date_default_timezone_set-1.phpt] Test basic date_sun_info() [ext/date/tests/date_sun_info_001.phpt] Test fileperms() & chmod() functions: usage variation - misc. perms [ext/standard/tests/file/006_variation2.phpt] flock() tests [ext/standard/tests/file/flock.phpt] Test flock() function: Basic functionality [ext/standard/tests/file/flock_basic.phpt] Test flock() function: Variations [ext/standard/tests/file/flock_variation.phpt] Test glob() function: basic functions [ext/standard/tests/file/glob_basic.phpt] Test glob() function: usage variations [ext/standard/tests/file/glob_variation.phpt] Test is_dir() function: usage variations - links [ext/standard/tests/file/is_dir_variation2.phpt] Test popen() and pclose function: error conditions [ext/standard/tests/file/popen_pclose_error-sunos.phpt] proc_open [ext/standard/tests/general_functions/proc_open02.phpt] Bug #27646 (Cannot serialize/unserialize non-finite numeric values) [ext/standard/tests/math/bug27646.phpt] money_format test [ext/standard/tests/strings/moneyformat.phpt] ===================================================================== ===================================================================== TEST RESULT SUMMARY --------------------------------------------------------------------- Exts skipped : 49 Exts tested : 30 --------------------------------------------------------------------- Number of tests : 3973 2603 Tests skipped : 1370 ( 34.5%) -------- Tests warned : 0 ( 0.0%) ( 0.0%) Tests failed : 24 ( 0.6%) ( 0.9%) Tests passed : 2579 ( 64.9%) ( 99.1%) --------------------------------------------------------------------- Time taken : 419 seconds ===================================================================== ===================================================================== FAILED TEST SUMMARY --------------------------------------------------------------------- idate() and invalid params [ext/date/tests/005.phpt] localtime() tests [ext/date/tests/007.phpt] getdate() tests [ext/date/tests/008.phpt] strftime() and gmstrftime() tests [ext/date/tests/009.phpt] timezone_offset_get() tests [ext/date/tests/014.phpt] Bug #32555 (strtotime("tomorrow") can return false) [ext/date/tests/bug32555.phpt] Bug #33532 (Different output for strftime() and date()) [ext/date/tests/bug33532.phpt] Bug #37368 (Incorrect timestamp returned for strtotime()). [ext/date/tests/bug37368.phpt] Bug #37514 (strtotime doesn't assume year correctly). [ext/date/tests/bug37514.phpt] date_default_timezone_get() function [1] [ext/date/tests/date_default_timezone_get-1.phpt] date_default_timezone_get() function [2] [ext/date/tests/date_default_timezone_get-2.phpt] date_default_timezone_set() function [1] [ext/date/tests/date_default_timezone_set-1.phpt] Test basic date_sun_info() [ext/date/tests/date_sun_info_001.phpt] Test fileperms() & chmod() functions: usage variation - misc. perms [ext/standard/tests/file/006_variation2.phpt] flock() tests [ext/standard/tests/file/flock.phpt] Test flock() function: Basic functionality [ext/standard/tests/file/flock_basic.phpt] Test flock() function: Variations [ext/standard/tests/file/flock_variation.phpt] Test glob() function: basic functions [ext/standard/tests/file/glob_basic.phpt] Test glob() function: usage variations [ext/standard/tests/file/glob_variation.phpt] Test is_dir() function: usage variations - links [ext/standard/tests/file/is_dir_variation2.phpt] Test popen() and pclose function: error conditions [ext/standard/tests/file/popen_pclose_error-sunos.phpt] proc_open [ext/standard/tests/general_functions/proc_open02.phpt] Bug #27646 (Cannot serialize/unserialize non-finite numeric values) [ext/standard/tests/math/bug27646.phpt] money_format test [ext/standard/tests/strings/moneyformat.phpt] ===================================================================== ================================================================================ /usr/users/ck1/soft/php-5.2.4/ext/date/tests/005.phpt ================================================================================ Warning: idate() expects at least 1 parameter, 0 given in /usr/users/ck1/soft/php-5.2.4/ext/date/tests/005.php on line 5 bool(false) Warning: idate() expects at most 2 parameters, 3 given in /usr/users/ck1/soft/php-5.2.4/ext/date/tests/005.php on line 6 bool(false) Warning: idate(): Unrecognized date format token. in /usr/users/ck1/soft/php-5.2.4/ext/date/tests/005.php on line 8 bool(false) Warning: idate(): idate format is one char in /usr/users/ck1/soft/php-5.2.4/ext/date/tests/005.php on line 9 bool(false) Warning: idate(): Unrecognized date format token. in /usr/users/ck1/soft/php-5.2.4/ext/date/tests/005.php on line 10 bool(false) int(958) Warning: idate(): Unrecognized date format token. in /usr/users/ck1/soft/php-5.2.4/ext/date/tests/005.php on line 13 bool(false) Warning: idate(): Unrecognized date format token. in /usr/users/ck1/soft/php-5.2.4/ext/date/tests/005.php on line 14 bool(false) Done ================================================================================ 015+ int(958) 015- int(41) ================================================================================ ================================================================================ /usr/users/ck1/soft/php-5.2.4/ext/date/tests/007.phpt ================================================================================ Warning: localtime() expects at most 2 parameters, 3 given in /usr/users/ck1/soft/php-5.2.4/ext/date/tests/007.php on line 4 bool(false) array(9) { [0]=> int(50) [1]=> int(16) [2]=> int(16) [3]=> int(11) [4]=> int(9) [5]=> int(107) [6]=> int(4) [7]=> int(283) [8]=> int(1) } array(9) { [0]=> int(0) [1]=> int(0) [2]=> int(0) [3]=> int(27) [4]=> int(5) [5]=> int(106) [6]=> int(2) [7]=> int(177) [8]=> int(1) } array(9) { ["tm_sec"]=> int(0) ["tm_min"]=> int(0) ["tm_hour"]=> int(0) ["tm_mday"]=> int(27) ["tm_mon"]=> int(5) ["tm_year"]=> int(106) ["tm_wday"]=> int(2) ["tm_yday"]=> int(177) ["tm_isdst"]=> int(1) } array(9) { [0]=> int(0) [1]=> int(0) [2]=> int(0) [3]=> int(27) [4]=> int(5) [5]=> int(106) [6]=> int(2) [7]=> int(177) [8]=> int(1) } Done ================================================================================ 041+ int(1) 041- int(0) 061+ int(1) 061- int(0) 081+ int(1) 081- int(0) ================================================================================ ================================================================================ /usr/users/ck1/soft/php-5.2.4/ext/date/tests/008.phpt ================================================================================ Warning: getdate() expects at most 1 parameter, 2 given in /usr/users/ck1/soft/php-5.2.4/ext/date/tests/008.php on line 4 bool(false) array(11) { ["seconds"]=> int(0) ["minutes"]=> int(0) ["hours"]=> int(0) ["mday"]=> int(27) ["wday"]=> int(2) ["mon"]=> int(6) ["year"]=> int(2006) ["yday"]=> int(177) ["weekday"]=> string(7) "Tuesday" ["month"]=> string(4) "June" [0]=> int(1151359200) } array(11) { ["seconds"]=> int(50) ["minutes"]=> int(16) ["hours"]=> int(16) ["mday"]=> int(11) ["wday"]=> int(4) ["mon"]=> int(10) ["year"]=> int(2007) ["yday"]=> int(283) ["weekday"]=> string(8) "Thursday" ["month"]=> string(7) "October" [0]=> int(1192112210) } Done ================================================================================ 025+ int(1151359200) 025- int(1151366400) ================================================================================ ================================================================================ /usr/users/ck1/soft/php-5.2.4/ext/date/tests/009.phpt ================================================================================ Warning: strftime() expects at least 1 parameter, 0 given in /usr/users/ck1/soft/php-5.2.4/ext/date/tests/009.php on line 5 bool(false) bool(false) string(207) "Tue Tuesday Jun June Tue Jun 27 00:00:00 2006 Tue Jun 27 00:00:00 CEST 2006 27 06/27/06 27 06 2006 Jun 00 12 178 06 00 AM 12:00:00 AM 00:00 00 00:00:00 2 26 26 26 2 06/27/06 00:00:00 06 2006 CEST +0200 %" string(5) "%q %a" string(2) "%q" string(4) "blah" Warning: gmstrftime() expects at least 1 parameter, 0 given in /usr/users/ck1/soft/php-5.2.4/ext/date/tests/009.php on line 13 bool(false) bool(false) string(204) "Mon Monday Jun June Mon Jun 26 22:00:00 2006 Mon Jun 26 22:00:00 CET 2006 26 06/26/06 26 06 2006 Jun 22 10 177 06 00 PM 10:00:00 PM 22:00 00 22:00:00 1 26 26 26 1 06/26/06 22:00:00 06 2006 CET +0100 %" string(5) "%q %a" string(2) "%q" string(4) "blah" Done ================================================================================ 013+ string(204) "Mon Monday Jun June Mon Jun 26 22:00:00 2006 Mon Jun 26 22:00:00 CET 2006 26 06/26/06 26 06 2006 Jun 22 10 177 06 00 013- string(%d) "Mon Monday Jun June Mon Jun 26 21:00:00 2006 %s ================================================================================ ================================================================================ /usr/users/ck1/soft/php-5.2.4/ext/date/tests/014.phpt ================================================================================ object(DateTime)#1 (0) { } object(DateTimeZone)#2 (0) { } Warning: timezone_offset_get() expects exactly 2 parameters, 0 given in /usr/users/ck1/soft/php-5.2.4/ext/date/tests/014.php on line 9 bool(false) int(3600) Warning: timezone_offset_get() expects parameter 1 to be DateTimeZone, object given in /usr/users/ck1/soft/php-5.2.4/ext/date/tests/014.php on line 11 bool(false) Done ================================================================================ 008+ int(3600) 008- int(0) ================================================================================ ================================================================================ /usr/users/ck1/soft/php-5.2.4/ext/date/tests/bug32555.phpt ================================================================================ Sat Apr 02 02:30:00 2005 EST Sun Apr 03 00:00:00 2005 EST Sun Apr 03 03:30:00 2005 EDT Mon Apr 04 02:30:00 2005 EDT ================================================================================ 001+ Sat Apr 02 02:30:00 2005 EST 002+ Sun Apr 03 00:00:00 2005 EST 003+ Sun Apr 03 03:30:00 2005 EDT 004+ Mon Apr 04 02:30:00 2005 EDT 001- Sat Apr 2 02:30:00 2005 EST 002- Sun Apr 3 00:00:00 2005 EST 003- Sun Apr 3 03:30:00 2005 EDT 004- Mon Apr 4 02:30:00 2005 EDT ================================================================================ ================================================================================ /usr/users/ck1/soft/php-5.2.4/ext/date/tests/bug33532.phpt ================================================================================ TZ has NOT been set Should strftime==datestr? Strftime seems to assume GMT tStamp. input 10:00:00 AM July 1 2005 strftime 10:00:00 AM July 1 2005 CET +0100 datestr 10:00:00 AM July 1 2005 UTC Setting TZ input 10:00:00 AM July 1 2005 strftime 10:00:00 AM July 1 2005 EST +1000 datestr 10:00:00 AM July 1 2005 EST ================================================================================ 004+ strftime 10:00:00 AM July 1 2005 CET +0100 004- strftime 10:00:00 AM July 1 2005 UTC +0000 ================================================================================ ================================================================================ /usr/users/ck1/soft/php-5.2.4/ext/date/tests/bug37368.phpt ================================================================================ Wed, 07 Jun 2006 19:06:44 +0200 ================================================================================ 001+ Wed, 07 Jun 2006 19:06:44 +0200 001- Wed, 07 Jun 2006 17:06:44 +0000 ================================================================================ ================================================================================ /usr/users/ck1/soft/php-5.2.4/ext/date/tests/bug37514.phpt ================================================================================ Fri, 18 May 2007 05:05:00 +0200 Fri, 18 May 2007 17:05:00 +0200 Fri, 18 May 2007 17:05:00 +0200 Fri, 18 May 2007 05:05:00 +0200 Fri, 18 May 2007 05:05:00 +0200 Thu, 18 May 2006 17:05:00 +0200 ================================================================================ 001+ Fri, 18 May 2007 05:05:00 +0200 002+ Fri, 18 May 2007 17:05:00 +0200 003+ Fri, 18 May 2007 17:05:00 +0200 004+ Fri, 18 May 2007 05:05:00 +0200 005+ Fri, 18 May 2007 05:05:00 +0200 006+ Thu, 18 May 2006 17:05:00 +0200 001- Fri, 18 May 2007 05:05:00 +0000 002- Fri, 18 May 2007 17:05:00 +0000 003- Fri, 18 May 2007 17:05:00 +0000 004- Fri, 18 May 2007 05:05:00 +0000 005- Fri, 18 May 2007 05:05:00 +0000 006- Thu, 18 May 2006 17:05:00 +0000 ================================================================================ ================================================================================ /usr/users/ck1/soft/php-5.2.4/ext/date/tests/date_default_timezone_get-1.phpt ================================================================================ Warning: date_default_timezone_get(): It is not safe to rely on the system's timezone settings. Please use the date.timezone setting, the TZ environment variable or the date_default_timezone_set() function. In case you used any of those methods and you are still getting this warning, you most likely misspelled the timezone identifier. We had to select 'UTC' because your platform doesn't provide functionality for the guessing algorithm in /usr/users/ck1/soft/php-5.2.4/ext/date/tests/date_default_timezone_get-1.php on line 3 UTC Warning: date(): It is not safe to rely on the system's timezone settings. Please use the date.timezone setting, the TZ environment variable or the date_default_timezone_set() function. In case you used any of those methods and you are still getting this warning, you most likely misspelled the timezone identifier. We had to select 'UTC' because your platform doesn't provide functionality for the guessing algorithm in /usr/users/ck1/soft/php-5.2.4/ext/date/tests/date_default_timezone_get-1.php on line 4 UTC ================================================================================ 001+ Warning: date_default_timezone_get(): It is not safe to rely on the system's timezone settings. Please use the date.timezone setting, the TZ environment variable or the date_default_timezone_set() function. In case you used any of those methods and you are still getting this warning, you most likely misspelled the timezone identifier. We had to select 'UTC' because your platform doesn't provide functionality for the guessing algorithm in /usr/users/ck1/soft/php-5.2.4/ext/date/tests/date_default_timezone_get-1.php on line 3 001- Strict Standards: date_default_timezone_get(): It is not safe to rely on the system's timezone settings. Please use the date.timezone setting, the TZ environment variable or the date_default_timezone_set() function. In case you used any of those methods and you are still getting this warning, you most likely misspelled the timezone identifier. We selected 'UTC' for 'UTC/0.0/no DST' instead in %sdate_default_timezone_get-1.php on line 3 004+ Warning: date(): It is not safe to rely on the system's timezone settings. Please use the date.timezone setting, the TZ environment variable or the date_default_timezone_set() function. In case you used any of those methods and you are still getting this warning, you most likely misspelled the timezone identifier. We had to select 'UTC' because your platform doesn't provide functionality for the guessing algorithm in /usr/users/ck1/soft/php-5.2.4/ext/date/tests/date_default_timezone_get-1.php on line 4 004- Strict Standards: date(): It is not safe to rely on the system's timezone settings. Please use the date.timezone setting, the TZ environment variable or the date_default_timezone_set() function. In case you used any of those methods and you are still getting this warning, you most likely misspelled the timezone identifier. We selected 'UTC' for 'UTC/0.0/no DST' instead in %sdate_default_timezone_get-1.php on line 4 ================================================================================ ================================================================================ /usr/users/ck1/soft/php-5.2.4/ext/date/tests/date_default_timezone_get-2.phpt ================================================================================ Warning: date_default_timezone_get(): It is not safe to rely on the system's timezone settings. Please use the date.timezone setting, the TZ environment variable or the date_default_timezone_set() function. In case you used any of those methods and you are still getting this warning, you most likely misspelled the timezone identifier. We had to select 'UTC' because your platform doesn't provide functionality for the guessing algorithm in /usr/users/ck1/soft/php-5.2.4/ext/date/tests/date_default_timezone_get-2.php on line 3 UTC ================================================================================ 001+ Warning: date_default_timezone_get(): It is not safe to rely on the system's timezone settings. Please use the date.timezone setting, the TZ environment variable or the date_default_timezone_set() function. In case you used any of those methods and you are still getting this warning, you most likely misspelled the timezone identifier. We had to select 'UTC' because your platform doesn't provide functionality for the guessing algorithm in /usr/users/ck1/soft/php-5.2.4/ext/date/tests/date_default_timezone_get-2.php on line 3 001- Strict Standards: date_default_timezone_get(): It is not safe to rely on the system's timezone settings. Please use the date.timezone setting, the TZ environment variable or the date_default_timezone_set() function. In case you used any of those methods and you are still getting this warning, you most likely misspelled the timezone identifier. We selected 'UTC' for 'UTC/0.0/no DST' instead in %sdate_default_timezone_get-2.php on line 3 ================================================================================ ================================================================================ /usr/users/ck1/soft/php-5.2.4/ext/date/tests/date_default_timezone_set-1.phpt ================================================================================ Warning: strtotime(): It is not safe to rely on the system's timezone settings. Please use the date.timezone setting, the TZ environment variable or the date_default_timezone_set() function. In case you used any of those methods and you are still getting this warning, you most likely misspelled the timezone identifier. We had to select 'UTC' because your platform doesn't provide functionality for the guessing algorithm in /usr/users/ck1/soft/php-5.2.4/ext/date/tests/date_default_timezone_set-1.php on line 3 Warning: strtotime(): It is not safe to rely on the system's timezone settings. Please use the date.timezone setting, the TZ environment variable or the date_default_timezone_set() function. In case you used any of those methods and you are still getting this warning, you most likely misspelled the timezone identifier. We had to select 'UTC' because your platform doesn't provide functionality for the guessing algorithm in /usr/users/ck1/soft/php-5.2.4/ext/date/tests/date_default_timezone_set-1.php on line 4 America/Indiana/Knox 2005-01-12T03:00:00-0500 2005-07-12T03:00:00-0500 2005-01-12T08:00:00-0500 2005-07-12T08:00:00-0500 ================================================================================ 001+ Warning: strtotime(): It is not safe to rely on the system's timezone settings. Please use the date.timezone setting, the TZ environment variable or the date_default_timezone_set() function. In case you used any of those methods and you are still getting this warning, you most likely misspelled the timezone identifier. We had to select 'UTC' because your platform doesn't provide functionality for the guessing algorithm in /usr/users/ck1/soft/php-5.2.4/ext/date/tests/date_default_timezone_set-1.php on line 3 001- Strict Standards: strtotime(): It is not safe to rely on the system's timezone settings. Please use the date.timezone setting, the TZ environment variable or the date_default_timezone_set() function. In case you used any of those methods and you are still getting this warning, you most likely misspelled the timezone identifier. We selected 'UTC' for 'UTC/0.0/no DST' instead in %sdate_default_timezone_set-1.php on line 3 003+ Warning: strtotime(): It is not safe to rely on the system's timezone settings. Please use the date.timezone setting, the TZ environment variable or the date_default_timezone_set() function. In case you used any of those methods and you are still getting this warning, you most likely misspelled the timezone identifier. We had to select 'UTC' because your platform doesn't provide functionality for the guessing algorithm in /usr/users/ck1/soft/php-5.2.4/ext/date/tests/date_default_timezone_set-1.php on line 4 003- Strict Standards: strtotime(): It is not safe to rely on the system's timezone settings. Please use the date.timezone setting, the TZ environment variable or the date_default_timezone_set() function. In case you used any of those methods and you are still getting this warning, you most likely misspelled the timezone identifier. We selected 'UTC' for 'UTC/0.0/no DST' instead in %sdate_default_timezone_set-1.php on line 4 ================================================================================ ================================================================================ /usr/users/ck1/soft/php-5.2.4/ext/date/tests/date_sun_info_001.phpt ================================================================================ array(9) { ["sunrise"]=> int(1165897780) ["sunset"]=> int(1165934167) ["transit"]=> int(1165915974) ["civil_twilight_begin"]=> int(1165896175) ["civil_twilight_end"]=> int(1165935773) ["nautical_twilight_begin"]=> int(1165894351) ["nautical_twilight_end"]=> int(1165937596) ["astronomical_twilight_begin"]=> int(1165892568) ["astronomical_twilight_end"]=> int(1165939379) } Done ================================================================================ 003+ int(1165897780) 003- int(1165897782) 005+ int(1165934167) 005- int(1165934168) 007+ int(1165915974) 007- int(1165915975) 009+ int(1165896175) 009- int(1165896176) 013+ int(1165894351) 013- int(1165894353) 015+ int(1165937596) 015- int(1165937597) 017+ int(1165892568) 017- int(1165892570) 019+ int(1165939379) 019- int(1165939380) ================================================================================ ================================================================================ /usr/users/ck1/soft/php-5.2.4/ext/standard/tests/file/006_variation2.phpt ================================================================================ *** Testing fileperms() & chmod() : usage variations *** *** Testing fileperms(), chmod() with miscellaneous permissions *** -- Iteration 1 -- bool(true) 106777 bool(true) 47777 -- Iteration 2 -- bool(true) 100000 bool(true) 40000 -- Iteration 3 -- bool(true) 100000 bool(true) 41000 -- Iteration 4 -- bool(true) 100111 bool(true) 41111 -- Iteration 5 -- bool(true) 106001 bool(true) 47001 -- Iteration 6 -- bool(true) 100001 bool(true) 40001 -- Iteration 7 -- bool(true) 100411 bool(true) 41411 -- Iteration 8 -- bool(true) 106141 bool(true) 47141 -- Iteration 9 -- bool(true) 100637 bool(true) 40637 -- Iteration 10 -- bool(true) 102567 bool(true) 43567 -- Iteration 11 -- bool(true) 102567 bool(true) 43567 -- Iteration 12 -- bool(true) 100000 bool(true) 40000 -- Iteration 13 -- bool(true) 100000 bool(true) 40000 -- Iteration 14 -- bool(true) 100000 bool(true) 40000 -- Iteration 15 -- bool(true) 100000 bool(true) 40000 *** Done *** ================================================================================ 006+ 106777 006- 107777 016+ 100000 016- 101000 021+ 100111 021- 101111 026+ 106001 026- 107001 036+ 100411 036- 101411 041+ 106141 041- 107141 051+ 102567 051- 103567 056+ 102567 056- 103567 ================================================================================ ================================================================================ /usr/users/ck1/soft/php-5.2.4/ext/standard/tests/file/flock.phpt ================================================================================ Warning: flock() expects at least 2 parameters, 0 given in /usr/users/ck1/soft/php-5.2.4/ext/standard/tests/file/flock.php on line 5 NULL Warning: flock() expects parameter 1 to be resource, string given in /usr/users/ck1/soft/php-5.2.4/ext/standard/tests/file/flock.php on line 6 NULL Warning: flock(): 5 is not a valid stream resource in /usr/users/ck1/soft/php-5.2.4/ext/standard/tests/file/flock.php on line 11 bool(false) bool(false) bool(true) bool(true) bool(true) bool(false) int(0) bool(true) int(0) bool(true) int(0) bool(true) int(0) bool(true) Warning: flock(): Illegal operation argument in /usr/users/ck1/soft/php-5.2.4/ext/standard/tests/file/flock.php on line 31 bool(false) Done ================================================================================ 009+ bool(false) 012- bool(true) 013- bool(true) 013+ bool(false) ================================================================================ ================================================================================ /usr/users/ck1/soft/php-5.2.4/ext/standard/tests/file/flock_basic.phpt ================================================================================ *** Testing flock() fun with file and dir *** bool(false) bool(true) bool(true) bool(true) bool(false) bool(false) bool(false) bool(false) *** Done *** ================================================================================ 002+ bool(false) 005- bool(true) ================================================================================ ================================================================================ /usr/users/ck1/soft/php-5.2.4/ext/standard/tests/file/flock_variation.phpt ================================================================================ *** Testing flock() fun with the various operation and wouldblock values *** --- Outer iteration 0 --- bool(false) -- Inner iteration 0 in 0 -- bool(false) -- Inner iteration 1 in 0 -- bool(false) -- Inner iteration 2 in 0 -- bool(false) -- Inner iteration 3 in 0 -- bool(false) -- Inner iteration 4 in 0 -- bool(false) -- Inner iteration 5 in 0 -- bool(false) -- Inner iteration 6 in 0 -- bool(false) -- Inner iteration 7 in 0 -- bool(false) -- Inner iteration 8 in 0 -- bool(false) -- Inner iteration 9 in 0 -- bool(false) -- Inner iteration 10 in 0 -- bool(false) -- Inner iteration 11 in 0 -- bool(false) --- Outer iteration 1 --- bool(true) -- Inner iteration 0 in 1 -- bool(true) -- Inner iteration 1 in 1 -- bool(true) -- Inner iteration 2 in 1 -- bool(true) -- Inner iteration 3 in 1 -- bool(true) -- Inner iteration 4 in 1 -- bool(true) -- Inner iteration 5 in 1 -- bool(true) -- Inner iteration 6 in 1 -- bool(true) -- Inner iteration 7 in 1 -- bool(true) -- Inner iteration 8 in 1 -- bool(true) -- Inner iteration 9 in 1 -- bool(true) -- Inner iteration 10 in 1 -- bool(true) -- Inner iteration 11 in 1 -- bool(true) --- Outer iteration 2 --- bool(false) -- Inner iteration 0 in 2 -- bool(false) -- Inner iteration 1 in 2 -- bool(false) -- Inner iteration 2 in 2 -- bool(false) -- Inner iteration 3 in 2 -- bool(false) -- Inner iteration 4 in 2 -- bool(false) -- Inner iteration 5 in 2 -- bool(false) -- Inner iteration 6 in 2 -- bool(false) -- Inner iteration 7 in 2 -- bool(false) -- Inner iteration 8 in 2 -- bool(false) -- Inner iteration 9 in 2 -- bool(false) -- Inner iteration 10 in 2 -- bool(false) -- Inner iteration 11 in 2 -- bool(false) --- Outer iteration 3 --- bool(true) -- Inner iteration 0 in 3 -- bool(true) -- Inner iteration 1 in 3 -- bool(true) -- Inner iteration 2 in 3 -- bool(true) -- Inner iteration 3 in 3 -- bool(true) -- Inner iteration 4 in 3 -- bool(true) -- Inner iteration 5 in 3 -- bool(true) -- Inner iteration 6 in 3 -- bool(true) -- Inner iteration 7 in 3 -- bool(true) -- Inner iteration 8 in 3 -- bool(true) -- Inner iteration 9 in 3 -- bool(true) -- Inner iteration 10 in 3 -- bool(true) -- Inner iteration 11 in 3 -- bool(true) --- Outer iteration 4 --- bool(true) -- Inner iteration 0 in 4 -- bool(true) -- Inner iteration 1 in 4 -- bool(true) -- Inner iteration 2 in 4 -- bool(true) -- Inner iteration 3 in 4 -- bool(true) -- Inner iteration 4 in 4 -- bool(true) -- Inner iteration 5 in 4 -- bool(true) -- Inner iteration 6 in 4 -- bool(true) -- Inner iteration 7 in 4 -- bool(true) -- Inner iteration 8 in 4 -- bool(true) -- Inner iteration 9 in 4 -- bool(true) -- Inner iteration 10 in 4 -- bool(true) -- Inner iteration 11 in 4 -- bool(true) --- Outer iteration 5 --- bool(true) -- Inner iteration 0 in 5 -- bool(true) -- Inner iteration 1 in 5 -- bool(true) -- Inner iteration 2 in 5 -- bool(true) -- Inner iteration 3 in 5 -- bool(true) -- Inner iteration 4 in 5 -- bool(true) -- Inner iteration 5 in 5 -- bool(true) -- Inner iteration 6 in 5 -- bool(true) -- Inner iteration 7 in 5 -- bool(true) -- Inner iteration 8 in 5 -- bool(true) -- Inner iteration 9 in 5 -- bool(true) -- Inner iteration 10 in 5 -- bool(true) -- Inner iteration 11 in 5 -- bool(true) --- Outer iteration 6 --- bool(false) -- Inner iteration 0 in 6 -- bool(false) -- Inner iteration 1 in 6 -- bool(false) -- Inner iteration 2 in 6 -- bool(false) -- Inner iteration 3 in 6 -- bool(false) -- Inner iteration 4 in 6 -- bool(false) -- Inner iteration 5 in 6 -- bool(false) -- Inner iteration 6 in 6 -- bool(false) -- Inner iteration 7 in 6 -- bool(false) -- Inner iteration 8 in 6 -- bool(false) -- Inner iteration 9 in 6 -- bool(false) -- Inner iteration 10 in 6 -- bool(false) -- Inner iteration 11 in 6 -- bool(false) --- Outer iteration 7 --- bool(true) -- Inner iteration 0 in 7 -- bool(true) -- Inner iteration 1 in 7 -- bool(true) -- Inner iteration 2 in 7 -- bool(true) -- Inner iteration 3 in 7 -- bool(true) -- Inner iteration 4 in 7 -- bool(true) -- Inner iteration 5 in 7 -- bool(true) -- Inner iteration 6 in 7 -- bool(true) -- Inner iteration 7 in 7 -- bool(true) -- Inner iteration 8 in 7 -- bool(true) -- Inner iteration 9 in 7 -- bool(true) -- Inner iteration 10 in 7 -- bool(true) -- Inner iteration 11 in 7 -- bool(true) --- Outer iteration 8 --- bool(true) -- Inner iteration 0 in 8 -- bool(true) -- Inner iteration 1 in 8 -- bool(true) -- Inner iteration 2 in 8 -- bool(true) -- Inner iteration 3 in 8 -- bool(true) -- Inner iteration 4 in 8 -- bool(true) -- Inner iteration 5 in 8 -- bool(true) -- Inner iteration 6 in 8 -- bool(true) -- Inner iteration 7 in 8 -- bool(true) -- Inner iteration 8 in 8 -- bool(true) -- Inner iteration 9 in 8 -- bool(true) -- Inner iteration 10 in 8 -- bool(true) -- Inner iteration 11 in 8 -- bool(true) --- Outer iteration 9 --- bool(false) -- Inner iteration 0 in 9 -- bool(false) -- Inner iteration 1 in 9 -- bool(false) -- Inner iteration 2 in 9 -- bool(false) -- Inner iteration 3 in 9 -- bool(false) -- Inner iteration 4 in 9 -- bool(false) -- Inner iteration 5 in 9 -- bool(false) -- Inner iteration 6 in 9 -- bool(false) -- Inner iteration 7 in 9 -- bool(false) -- Inner iteration 8 in 9 -- bool(false) -- Inner iteration 9 in 9 -- bool(false) -- Inner iteration 10 in 9 -- bool(false) -- Inner iteration 11 in 9 -- bool(false) *** Done *** ================================================================================ 004+ bool(false) 004- bool(true) 006+ bool(false) 006- bool(true) 008+ bool(false) 008- bool(true) 010+ bool(false) 010- bool(true) 012+ bool(false) 012- bool(true) 014+ bool(false) 014- bool(true) 016+ bool(false) 016- bool(true) 018+ bool(false) 018- bool(true) 020+ bool(false) 020- bool(true) 022+ bool(false) 022- bool(true) 024+ bool(false) 024- bool(true) 026+ bool(false) 026- bool(true) 028+ bool(false) 028- bool(true) 056+ bool(false) 056- bool(true) 058+ bool(false) 058- bool(true) 060+ bool(false) 060- bool(true) 062+ bool(false) 062- bool(true) 064+ bool(false) 064- bool(true) 066+ bool(false) 066- bool(true) 068+ bool(false) 068- bool(true) 070+ bool(false) 070- bool(true) 072+ bool(false) 072- bool(true) 074+ bool(false) 074- bool(true) 076+ bool(false) 076- bool(true) 078+ bool(false) 078- bool(true) 080+ bool(false) 080- bool(true) 160+ bool(false) 160- bool(true) 162+ bool(false) 162- bool(true) 164+ bool(false) 164- bool(true) 166+ bool(false) 166- bool(true) 168+ bool(false) 168- bool(true) 170+ bool(false) 170- bool(true) 172+ bool(false) 172- bool(true) 174+ bool(false) 174- bool(true) 176+ bool(false) 176- bool(true) 178+ bool(false) 178- bool(true) 180+ bool(false) 180- bool(true) 182+ bool(false) 182- bool(true) 184+ bool(false) 184- bool(true) 238+ bool(false) 238- bool(true) 240+ bool(false) 240- bool(true) 242+ bool(false) 242- bool(true) 244+ bool(false) 244- bool(true) 246+ bool(false) 246- bool(true) 248+ bool(false) 248- bool(true) 250+ bool(false) 250- bool(true) 252+ bool(false) 252- bool(true) 254+ bool(false) 254- bool(true) 256+ bool(false) 256- bool(true) 258+ bool(false) 258- bool(true) 260+ bool(false) 260- bool(true) 262+ bool(false) 262- bool(true) ================================================================================ ================================================================================ /usr/users/ck1/soft/php-5.2.4/ext/standard/tests/file/glob_basic.phpt ================================================================================ *** Testing glob() : basic functions *** array(3) { [0]=> string(74) "/usr/users/ck1/soft/php-5.2.4/ext/standard/tests/file/glob_basic/file.text" [1]=> string(75) "/usr/users/ck1/soft/php-5.2.4/ext/standard/tests/file/glob_basic/wonder.txt" [2]=> string(76) "/usr/users/ck1/soft/php-5.2.4/ext/standard/tests/file/glob_basic/wonder12345" } array(1) { [0]=> string(75) "/usr/users/ck1/soft/php-5.2.4/ext/standard/tests/file/glob_basic/wonder.txt" } array(1) { [0]=> string(75) "/usr/users/ck1/soft/php-5.2.4/ext/standard/tests/file/glob_basic/wonder.txt" } array(2) { [0]=> string(74) "/usr/users/ck1/soft/php-5.2.4/ext/standard/tests/file/glob_basic/file.text" [1]=> string(75) "/usr/users/ck1/soft/php-5.2.4/ext/standard/tests/file/glob_basic/wonder.txt" } array(1) { [0]=> string(67) "/usr/users/ck1/soft/php-5.2.4/ext/standard/tests/file/glob_basic/.." } array(4) { [0]=> string(66) "/usr/users/ck1/soft/php-5.2.4/ext/standard/tests/file/glob_basic/." [1]=> string(67) "/usr/users/ck1/soft/php-5.2.4/ext/standard/tests/file/glob_basic/.." [2]=> string(74) "/usr/users/ck1/soft/php-5.2.4/ext/standard/tests/file/glob_basic/file.text" [3]=> string(75) "/usr/users/ck1/soft/php-5.2.4/ext/standard/tests/file/glob_basic/wonder.txt" } Done ================================================================================ 024+ array(1) { 025+ [0]=> 026+ string(67) "/usr/users/ck1/soft/php-5.2.4/ext/standard/tests/file/glob_basic/.." 024- array(0) { 026- array(2) { 028+ array(4) { 029- [1]=> 030+ string(66) "/usr/users/ck1/soft/php-5.2.4/ext/standard/tests/file/glob_basic/." 031+ [1]=> 032+ string(67) "/usr/users/ck1/soft/php-5.2.4/ext/standard/tests/file/glob_basic/.." 033+ [2]=> 035+ [3]=> ================================================================================ ================================================================================ /usr/users/ck1/soft/php-5.2.4/ext/standard/tests/file/glob_variation.phpt ================================================================================ *** Testing glob() : usage variations *** -- Iteration 1 -- array(3) { [0]=> string(75) "/usr/users/ck1/soft/php-5.2.4/ext/standard/tests/file/glob_variation/wonder" [1]=> string(80) "/usr/users/ck1/soft/php-5.2.4/ext/standard/tests/file/glob_variation/wonder12345" [2]=> string(82) "/usr/users/ck1/soft/php-5.2.4/ext/standard/tests/file/glob_variation/wonder;123456" } array(3) { [0]=> string(76) "/usr/users/ck1/soft/php-5.2.4/ext/standard/tests/file/glob_variation/wonder/" [1]=> string(80) "/usr/users/ck1/soft/php-5.2.4/ext/standard/tests/file/glob_variation/wonder12345" [2]=> string(82) "/usr/users/ck1/soft/php-5.2.4/ext/standard/tests/file/glob_variation/wonder;123456" } array(3) { [0]=> string(75) "/usr/users/ck1/soft/php-5.2.4/ext/standard/tests/file/glob_variation/wonder" [1]=> string(80) "/usr/users/ck1/soft/php-5.2.4/ext/standard/tests/file/glob_variation/wonder12345" [2]=> string(82) "/usr/users/ck1/soft/php-5.2.4/ext/standard/tests/file/glob_variation/wonder;123456" } array(3) { [0]=> string(75) "/usr/users/ck1/soft/php-5.2.4/ext/standard/tests/file/glob_variation/wonder" [1]=> string(80) "/usr/users/ck1/soft/php-5.2.4/ext/standard/tests/file/glob_variation/wonder12345" [2]=> string(82) "/usr/users/ck1/soft/php-5.2.4/ext/standard/tests/file/glob_variation/wonder;123456" } array(3) { [0]=> string(75) "/usr/users/ck1/soft/php-5.2.4/ext/standard/tests/file/glob_variation/wonder" [1]=> string(80) "/usr/users/ck1/soft/php-5.2.4/ext/standard/tests/file/glob_variation/wonder12345" [2]=> string(82) "/usr/users/ck1/soft/php-5.2.4/ext/standard/tests/file/glob_variation/wonder;123456" } array(3) { [0]=> string(75) "/usr/users/ck1/soft/php-5.2.4/ext/standard/tests/file/glob_variation/wonder" [1]=> string(80) "/usr/users/ck1/soft/php-5.2.4/ext/standard/tests/file/glob_variation/wonder12345" [2]=> string(82) "/usr/users/ck1/soft/php-5.2.4/ext/standard/tests/file/glob_variation/wonder;123456" } -- Iteration 2 -- array(3) { [0]=> string(75) "/usr/users/ck1/soft/php-5.2.4/ext/standard/tests/file/glob_variation/wonder" [1]=> string(80) "/usr/users/ck1/soft/php-5.2.4/ext/standard/tests/file/glob_variation/wonder12345" [2]=> string(82) "/usr/users/ck1/soft/php-5.2.4/ext/standard/tests/file/glob_variation/wonder;123456" } array(3) { [0]=> string(76) "/usr/users/ck1/soft/php-5.2.4/ext/standard/tests/file/glob_variation/wonder/" [1]=> string(80) "/usr/users/ck1/soft/php-5.2.4/ext/standard/tests/file/glob_variation/wonder12345" [2]=> string(82) "/usr/users/ck1/soft/php-5.2.4/ext/standard/tests/file/glob_variation/wonder;123456" } array(3) { [0]=> string(75) "/usr/users/ck1/soft/php-5.2.4/ext/standard/tests/file/glob_variation/wonder" [1]=> string(80) "/usr/users/ck1/soft/php-5.2.4/ext/standard/tests/file/glob_variation/wonder12345" [2]=> string(82) "/usr/users/ck1/soft/php-5.2.4/ext/standard/tests/file/glob_variation/wonder;123456" } array(3) { [0]=> string(75) "/usr/users/ck1/soft/php-5.2.4/ext/standard/tests/file/glob_variation/wonder" [1]=> string(80) "/usr/users/ck1/soft/php-5.2.4/ext/standard/tests/file/glob_variation/wonder12345" [2]=> string(82) "/usr/users/ck1/soft/php-5.2.4/ext/standard/tests/file/glob_variation/wonder;123456" } array(3) { [0]=> string(75) "/usr/users/ck1/soft/php-5.2.4/ext/standard/tests/file/glob_variation/wonder" [1]=> string(80) "/usr/users/ck1/soft/php-5.2.4/ext/standard/tests/file/glob_variation/wonder12345" [2]=> string(82) "/usr/users/ck1/soft/php-5.2.4/ext/standard/tests/file/glob_variation/wonder;123456" } array(3) { [0]=> string(75) "/usr/users/ck1/soft/php-5.2.4/ext/standard/tests/file/glob_variation/wonder" [1]=> string(80) "/usr/users/ck1/soft/php-5.2.4/ext/standard/tests/file/glob_variation/wonder12345" [2]=> string(82) "/usr/users/ck1/soft/php-5.2.4/ext/standard/tests/file/glob_variation/wonder;123456" } -- Iteration 3 -- array(2) { [0]=> string(80) "/usr/users/ck1/soft/php-5.2.4/ext/standard/tests/file/glob_variation/wonder12345" [1]=> string(82) "/usr/users/ck1/soft/php-5.2.4/ext/standard/tests/file/glob_variation/wonder;123456" } array(2) { [0]=> string(80) "/usr/users/ck1/soft/php-5.2.4/ext/standard/tests/file/glob_variation/wonder12345" [1]=> string(82) "/usr/users/ck1/soft/php-5.2.4/ext/standard/tests/file/glob_variation/wonder;123456" } array(2) { [0]=> string(80) "/usr/users/ck1/soft/php-5.2.4/ext/standard/tests/file/glob_variation/wonder12345" [1]=> string(82) "/usr/users/ck1/soft/php-5.2.4/ext/standard/tests/file/glob_variation/wonder;123456" } array(2) { [0]=> string(80) "/usr/users/ck1/soft/php-5.2.4/ext/standard/tests/file/glob_variation/wonder12345" [1]=> string(82) "/usr/users/ck1/soft/php-5.2.4/ext/standard/tests/file/glob_variation/wonder;123456" } array(2) { [0]=> string(80) "/usr/users/ck1/soft/php-5.2.4/ext/standard/tests/file/glob_variation/wonder12345" [1]=> string(82) "/usr/users/ck1/soft/php-5.2.4/ext/standard/tests/file/glob_variation/wonder;123456" } array(2) { [0]=> string(80) "/usr/users/ck1/soft/php-5.2.4/ext/standard/tests/file/glob_variation/wonder12345" [1]=> string(82) "/usr/users/ck1/soft/php-5.2.4/ext/standard/tests/file/glob_variation/wonder;123456" } -- Iteration 4 -- array(0) { } array(0) { } array(0) { } array(1) { [0]=> string(74) "/usr/users/ck1/soft/php-5.2.4/ext/standard/tests/file/glob_variation/*der5" } array(0) { } array(0) { } -- Iteration 5 -- array(0) { } array(0) { } array(0) { } array(1) { [0]=> string(77) "/usr/users/ck1/soft/php-5.2.4/ext/standard/tests/file/glob_variation/??onder*" } array(0) { } array(0) { } -- Iteration 6 -- array(3) { [0]=> string(75) "/usr/users/ck1/soft/php-5.2.4/ext/standard/tests/file/glob_variation/wonder" [1]=> string(80) "/usr/users/ck1/soft/php-5.2.4/ext/standard/tests/file/glob_variation/wonder12345" [2]=> string(82) "/usr/users/ck1/soft/php-5.2.4/ext/standard/tests/file/glob_variation/wonder;123456" } array(3) { [0]=> string(76) "/usr/users/ck1/soft/php-5.2.4/ext/standard/tests/file/glob_variation/wonder/" [1]=> string(80) "/usr/users/ck1/soft/php-5.2.4/ext/standard/tests/file/glob_variation/wonder12345" [2]=> string(82) "/usr/users/ck1/soft/php-5.2.4/ext/standard/tests/file/glob_variation/wonder;123456" } array(3) { [0]=> string(75) "/usr/users/ck1/soft/php-5.2.4/ext/standard/tests/file/glob_variation/wonder" [1]=> string(80) "/usr/users/ck1/soft/php-5.2.4/ext/standard/tests/file/glob_variation/wonder12345" [2]=> string(82) "/usr/users/ck1/soft/php-5.2.4/ext/standard/tests/file/glob_variation/wonder;123456" } array(3) { [0]=> string(75) "/usr/users/ck1/soft/php-5.2.4/ext/standard/tests/file/glob_variation/wonder" [1]=> string(80) "/usr/users/ck1/soft/php-5.2.4/ext/standard/tests/file/glob_variation/wonder12345" [2]=> string(82) "/usr/users/ck1/soft/php-5.2.4/ext/standard/tests/file/glob_variation/wonder;123456" } array(3) { [0]=> string(75) "/usr/users/ck1/soft/php-5.2.4/ext/standard/tests/file/glob_variation/wonder" [1]=> string(80) "/usr/users/ck1/soft/php-5.2.4/ext/standard/tests/file/glob_variation/wonder12345" [2]=> string(82) "/usr/users/ck1/soft/php-5.2.4/ext/standard/tests/file/glob_variation/wonder;123456" } array(3) { [0]=> string(75) "/usr/users/ck1/soft/php-5.2.4/ext/standard/tests/file/glob_variation/wonder" [1]=> string(80) "/usr/users/ck1/soft/php-5.2.4/ext/standard/tests/file/glob_variation/wonder12345" [2]=> string(82) "/usr/users/ck1/soft/php-5.2.4/ext/standard/tests/file/glob_variation/wonder;123456" } -- Iteration 7 -- array(0) { } array(0) { } array(0) { } array(1) { [0]=> string(77) "/usr/users/ck1/soft/php-5.2.4/ext/standard/tests/file/glob_variation/++onder*" } array(0) { } array(0) { } -- Iteration 8 -- array(0) { } array(0) { } array(0) { } array(1) { [0]=> string(76) "/usr/users/ck1/soft/php-5.2.4/ext/standard/tests/file/glob_variation/WONDER5" } array(0) { } array(0) { } -- Iteration 9 -- array(0) { } array(0) { } array(0) { } array(1) { [0]=> string(33) "$file_path/glob_variation/wonder5" } array(0) { } array(0) { } -- Iteration 10 -- array(0) { } array(0) { } array(0) { } array(1) { [0]=> string(77) "/usr/users/ck1/soft/php-5.2.4/ext/standard/tests/file/glob_variation/?wonder?" } array(0) { } array(0) { } -- Iteration 11 -- array(0) { } array(0) { } array(0) { } array(1) { [0]=> string(76) "/usr/users/ck1/soft/php-5.2.4/ext/standard/tests/file/glob_variation/wonder?" } array(0) { } array(0) { } -- Iteration 12 -- array(0) { } array(0) { } array(0) { } array(1) { [0]=> string(1) "1" } array(0) { } array(0) { } *** Testing glob() with pattern within braces *** Notice: Use of undefined constant GLOB_BRACE - assumed 'GLOB_BRACE' in /usr/users/ck1/soft/php-5.2.4/ext/standard/tests/file/glob_variation.php on line 49 Warning: glob() expects parameter 2 to be long, string given in /usr/users/ck1/soft/php-5.2.4/ext/standard/tests/file/glob_variation.php on line 49 NULL *** Testing glob() on directories *** -- Iteration 1 -- array(1) { [0]=> string(76) "/usr/users/ck1/soft/php-5.2.4/ext/standard/tests/file/glob_variation/wonder1" } -- Iteration 2 -- array(1) { [0]=> string(76) "/usr/users/ck1/soft/php-5.2.4/ext/standard/tests/file/glob_variation/wonder1" } -- Iteration 3 -- array(1) { [0]=> string(76) "/usr/users/ck1/soft/php-5.2.4/ext/standard/tests/file/glob_variation/wonder1" } -- Iteration 4 -- array(0) { } -- Iteration 5 -- array(0) { } -- Iteration 6 -- array(1) { [0]=> string(76) "/usr/users/ck1/soft/php-5.2.4/ext/standard/tests/file/glob_variation/wonder1" } -- Iteration 7 -- array(0) { } -- Iteration 8 -- array(0) { } -- Iteration 9 -- array(0) { } -- Iteration 10 -- array(0) { } -- Iteration 11 -- array(1) { [0]=> string(76) "/usr/users/ck1/soft/php-5.2.4/ext/standard/tests/file/glob_variation/wonder1" } -- Iteration 12 -- array(0) { } Done ================================================================================ 320+ 321+ Notice: Use of undefined constant GLOB_BRACE - assumed 'GLOB_BRACE' in /usr/users/ck1/soft/php-5.2.4/ext/standard/tests/file/glob_variation.php on line 49 322+ 323+ Warning: glob() expects parameter 2 to be long, string given in /usr/users/ck1/soft/php-5.2.4/ext/standard/tests/file/glob_variation.php on line 49 324+ NULL 320- array(1) { 321- [0]=> 322- string(%d) "%s/glob_variation/wonder12345" 323- } ================================================================================ ================================================================================ /usr/users/ck1/soft/php-5.2.4/ext/standard/tests/file/is_dir_variation2.phpt ================================================================================ *** Testing is_dir() with dir and links to dir *** -- With dir -- bool(true) -- With symlink -- bool(true) -- With hardlink -- Warning: link(): Not owner in /usr/users/ck1/soft/php-5.2.4/ext/standard/tests/file/is_dir_variation2.php on line 25 bool(false) *** Testing is_dir() with file and links to a file *** -- With file -- bool(false) -- With symlink -- bool(false) -- With hardlink -- bool(false) *** Done *** ================================================================================ 007+ Warning: link(): Not owner in /usr/users/ck1/soft/php-5.2.4/ext/standard/tests/file/is_dir_variation2.php on line 25 007- Warning: link(): Operation not permitted in %s on line %d ================================================================================ ================================================================================ /usr/users/ck1/soft/php-5.2.4/ext/standard/tests/file/popen_pclose_error-sunos.phpt ================================================================================ *** Testing for error conditions *** Warning: Wrong parameter count for popen() in /usr/users/ck1/soft/php-5.2.4/ext/standard/tests/file/popen_pclose_error-sunos.php on line 11 NULL Warning: Wrong parameter count for popen() in /usr/users/ck1/soft/php-5.2.4/ext/standard/tests/file/popen_pclose_error-sunos.php on line 12 NULL sh: abc.txt: not found resource(4) of type (stream) Warning: Wrong parameter count for pclose() in /usr/users/ck1/soft/php-5.2.4/ext/standard/tests/file/popen_pclose_error-sunos.php on line 14 NULL Warning: Wrong parameter count for pclose() in /usr/users/ck1/soft/php-5.2.4/ext/standard/tests/file/popen_pclose_error-sunos.php on line 16 NULL Warning: pclose(): supplied argument is not a valid stream resource in /usr/users/ck1/soft/php-5.2.4/ext/standard/tests/file/popen_pclose_error-sunos.php on line 18 bool(false) --- Done --- ================================================================================ 008+ sh: abc.txt: not found 009- sh: abc.txt: not found ================================================================================ ================================================================================ /usr/users/ck1/soft/php-5.2.4/ext/standard/tests/general_functions/proc_open02.phpt ================================================================================ bool(true) array(8) { ["command"]=> string(28) "/usr/bin/nohup /bin/sleep 50" ["pid"]=> int(21204) ["running"]=> bool(false) ["signaled"]=> bool(true) ["stopped"]=> bool(false) ["exitcode"]=> int(-1) ["termsig"]=> int(1) ["stopsig"]=> int(0) } bool(false) array(8) { ["command"]=> string(28) "/usr/bin/nohup /bin/sleep 50" ["pid"]=> int(21204) ["running"]=> bool(false) ["signaled"]=> bool(false) ["stopped"]=> bool(false) ["exitcode"]=> int(-1) ["termsig"]=> int(0) ["stopsig"]=> int(0) } Done! ================================================================================ 008+ bool(false) 009+ ["signaled"]=> 009- ["signaled"]=> 010- bool(false) 016+ int(1) 016- int(0) 020+ bool(false) 020- bool(true) 029+ bool(false) 029- bool(true) 035+ int(0) 035- int(15) ================================================================================ ================================================================================ /usr/users/ck1/soft/php-5.2.4/ext/standard/tests/math/bug27646.phpt ================================================================================ float(12.3) string(54) "d:12.300000000000000710542735760100185871124267578125;" float(12.3) float(-12.3) string(55) "d:-12.300000000000000710542735760100185871124267578125;" float(-12.3) float(0) string(4) "d:0;" float(0) float(0) string(4) "d:0;" float(0) float(NAN) string(6) "d:NAN;" float(NAN) ================================================================================ 007+ float(0) 008+ string(4) "d:0;" 009+ float(0) 010+ float(0) 011+ string(4) "d:0;" 012+ float(0) 007- float(-INF) 008- string(7) "d:-INF;" 009- float(-INF) 010- float(INF) 011- string(6) "d:INF;" 012- float(INF) ================================================================================ ================================================================================ /usr/users/ck1/soft/php-5.2.4/ext/standard/tests/strings/moneyformat.phpt ================================================================================ string(6) "X3.14Y" Warning: money_format(): Only a single %i or %n token can be used in /usr/users/ck1/soft/php-5.2.4/ext/standard/tests/strings/moneyformat.php on line 4 bool(false) ================================================================================ 001+ string(6) "X3.14Y" 001- string(7) "X$3.14Y" ================================================================================ ================================================================================ BUILD ENVIRONMENT ================================================================================ OS: SunOS - SunOS opal 5.10 Generic_120012-14 i86pc Autoconf: autoconf (GNU Autoconf) 2.59 Written by David J. MacKenzie and Akim Demaille. Copyright (C) 2003 Free Software Foundation, Inc. This is free software; see the source for copying conditions. There is NO warranty; not even for MERCHANTABILITY or FITNESS FOR A PARTICULAR PURPOSE. Bundled Libtool: ltmain.sh (GNU libtool) 1.5.20 (1.1220.2.287 2005/08/31 18:54:15) Copyright (C) 2005 Free Software Foundation, Inc. This is free software; see the source for copying conditions. There is NO warranty; not even for MERCHANTABILITY or FITNESS FOR A PARTICULAR PURPOSE. System Libtool: ltmain.sh (GNU libtool) 1.5.2 (1.1220.2.60 2004/01/25 12:25:08) Copyright (C) 2003 Free Software Foundation, Inc. This is free software; see the source for copying conditions. There is NO warranty; not even for MERCHANTABILITY or FITNESS FOR A PARTICULAR PURPOSE. Compiler: Reading specs from /usr/local/lib/gcc/i386-pc-solaris2.10/3.4.6/specs Configured with: ../configure --with-as=/usr/ccs/bin/as --with-ld=/usr/ccs/bin/ld --enable-shared --enable-languages=c,c++,f77 Thread model: posix gcc version 3.4.6 Bison: bison (GNU Bison) 1.875 Written by Robert Corbett and Richard Stallman. Copyright (C) 2002 Free Software Foundation, Inc. This is free software; see the source for copying conditions. There is NO warranty; not even for MERCHANTABILITY or FITNESS FOR A PARTICULAR PURPOSE. Libraries: libcrypt_d.so.1 => /usr/lib/libcrypt_d.so.1 libc-client.so => /usr/local/lib/libc-client.so libmysqlclient.so.15 => /usr/local/lib/mysql/libmysqlclient.so.15 librt.so.1 => /usr/lib/librt.so.1 libgen.so.1 => /usr/lib/libgen.so.1 libsocket.so.1 => /usr/lib/libsocket.so.1 libnsl.so.1 => /usr/lib/libnsl.so.1 libm.so.2 => /usr/lib/libm.so.2 libz.so => /usr/local/lib/libz.so libmcrypt.so.4 => /usr/local/lib/libmcrypt.so.4 libltdl.so.3 => /usr/local/lib/libltdl.so.3 libdl.so.1 => /usr/lib/libdl.so.1 libssl.so.0.9.8 => /usr/local/ssl/lib/libssl.so.0.9.8 libcrypto.so.0.9.8 => /usr/local/ssl/lib/libcrypto.so.0.9.8 libpam.so.1 => /usr/dt/lib/libpam.so.1 libintl.so.1 => /usr/lib/libintl.so.1 libdb-4.4.so => /usr/local/BerkeleyDB/lib/libdb-4.4.so libresolv.so.2 => /usr/lib/libresolv.so.2 libxml2.so.2 => /usr/local/lib/libxml2.so.2 libpthread.so.1 => /usr/lib/libpthread.so.1 libiconv.so.2 => /usr/local/lib/libiconv.so.2 libc.so.1 => /usr/lib/libc.so.1 libgcc_s.so.1 => /usr/local/lib/libgcc_s.so.1 libz.so.1 (SUNW_1.1) => (version not found) libaio.so.1 => /usr/lib/libaio.so.1 libmd.so.1 => /usr/lib/libmd.so.1 libmp.so.2 => /usr/lib/libmp.so.2 libscf.so.1 => /usr/lib/libscf.so.1 libcmd.so.1 => /usr/lib/libcmd.so.1 libdoor.so.1 => /usr/lib/libdoor.so.1 libuutil.so.1 => /usr/lib/libuutil.so.1 User's E-mail: ck1 at inf dot tu-dresden dot de ================================================================================ PHPINFO ================================================================================ phpinfo() PHP Version => 5.2.4 System => SunOS opal 5.10 Generic_120012-14 i86pc Build Date => Oct 11 2007 16:09:17 Configure Command => './configure' '--with-config-file-path=/etc/apache2' '--with-apxs2=/usr/apache2/bin/apxs' '--with-openssl=/usr/local/ssl' '--with-db4=/usr/local/BerkeleyDB.4.4' '--with-imap=/usr/local/c-client' '--with-imap-ssl=/usr/local/ssl' '--with-mcrypt=/usr/local' '--with-iconv' '--enable-mbstring=all' '--enable-mbregex' '--with-gettext' '--with-mysql=/usr/local' '--with-zlib' '--with-zlib-dir=/usr/local' '--with-libxml-dir=/usr/local' '--disable-static' '--enable-shared' '--with-pic' Server API => Command Line Interface Virtual Directory Support => disabled Configuration File (php.ini) Path => /etc/apache2 Loaded Configuration File => (none) PHP API => 20041225 PHP Extension => 20060613 Zend Extension => 220060519 Debug Build => no Thread Safety => disabled Zend Memory Manager => enabled IPv6 Support => enabled Registered PHP Streams => php, file, data, http, ftp, compress.zlib, https, ftps Registered Stream Socket Transports => tcp, udp, unix, udg, ssl, sslv3, sslv2, tls Registered Stream Filters => string.rot13, string.toupper, string.tolower, string.strip_tags, convert.*, consumed, convert.iconv.*, zlib.* This program makes use of the Zend Scripting Language Engine: Zend Engine v2.2.0, Copyright (c) 1998-2007 Zend Technologies _______________________________________________________________________ Configuration PHP Core Directive => Local Value => Master Value allow_call_time_pass_reference => On => On allow_url_fopen => On => On allow_url_include => Off => Off always_populate_raw_post_data => Off => Off arg_separator.input => & => & arg_separator.output => & => & asp_tags => Off => Off auto_append_file => no value => no value auto_globals_jit => On => On auto_prepend_file => no value => no value browscap => no value => no value default_charset => no value => no value default_mimetype => text/html => text/html define_syslog_variables => Off => Off disable_classes => no value => no value disable_functions => no value => no value display_errors => STDOUT => STDOUT display_startup_errors => Off => Off doc_root => no value => no value docref_ext => no value => no value docref_root => no value => no value enable_dl => On => On error_append_string => no value => no value error_log => no value => no value error_prepend_string => no value => no value error_reporting => no value => no value expose_php => On => On extension_dir => /usr/local/lib/php/extensions/no-debug-non-zts-20060613 => /usr/local/lib/php/extensions/no-debug-non-zts-20060613 file_uploads => On => On highlight.bg => <font style="color: #FFFFFF">#FFFFFF</font> => <font style="color: #FFFFFF">#FFFFFF</font> highlight.comment => <font style="color: #FF8000">#FF8000</font> => <font style="color: #FF8000">#FF8000</font> highlight.default => <font style="color: #0000BB">#0000BB</font> => <font style="color: #0000BB">#0000BB</font> highlight.html => <font style="color: #000000">#000000</font> => <font style="color: #000000">#000000</font> highlight.keyword => <font style="color: #007700">#007700</font> => <font style="color: #007700">#007700</font> highlight.string => <font style="color: #DD0000">#DD0000</font> => <font style="color: #DD0000">#DD0000</font> html_errors => Off => Off ignore_repeated_errors => Off => Off ignore_repeated_source => Off => Off ignore_user_abort => Off => Off implicit_flush => On => On include_path => .:/usr/local/lib/php => .:/usr/local/lib/php log_errors => Off => Off log_errors_max_len => 1024 => 1024 magic_quotes_gpc => On => On magic_quotes_runtime => Off => Off magic_quotes_sybase => Off => Off mail.force_extra_parameters => no value => no value max_execution_time => 0 => 0 max_input_nesting_level => 64 => 64 max_input_time => -1 => -1 memory_limit => 128M => 128M open_basedir => no value => no value output_buffering => 0 => 0 output_handler => no value => no value post_max_size => 8M => 8M precision => 14 => 14 realpath_cache_size => 16K => 16K realpath_cache_ttl => 120 => 120 register_argc_argv => On => On register_globals => Off => Off register_long_arrays => On => On report_memleaks => On => On report_zend_debug => Off => Off safe_mode => Off => Off safe_mode_exec_dir => /usr/local/php/bin => /usr/local/php/bin safe_mode_gid => Off => Off safe_mode_include_dir => no value => no value sendmail_from => no value => no value sendmail_path => /usr/sbin/sendmail -t -i => /usr/sbin/sendmail -t -i serialize_precision => 100 => 100 short_open_tag => On => On SMTP => localhost => localhost smtp_port => 25 => 25 sql.safe_mode => Off => Off track_errors => Off => Off unserialize_callback_func => no value => no value upload_max_filesize => 2M => 2M upload_tmp_dir => no value => no value user_dir => no value => no value variables_order => EGPCS => EGPCS xmlrpc_error_number => 0 => 0 xmlrpc_errors => Off => Off y2k_compliance => On => On zend.ze1_compatibility_mode => Off => Off ctype ctype functions => enabled date date/time support => enabled "Olson" Timezone Database Version => 2007.6 Timezone Database => internal Default timezone => Europe/Berlin Directive => Local Value => Master Value date.default_latitude => 31.7667 => 31.7667 date.default_longitude => 35.2333 => 35.2333 date.sunrise_zenith => 90.583333 => 90.583333 date.sunset_zenith => 90.583333 => 90.583333 date.timezone => no value => no value dba DBA support => enabled Supported handlers => cdb cdb_make db4 inifile flatfile dom DOM/XML => enabled DOM/XML API Version => 20031129 libxml Version => 2.6.26 HTML Support => enabled XPath Support => enabled XPointer Support => enabled Schema Support => enabled RelaxNG Support => enabled filter Input Validation and Filtering => enabled Revision => $Revision: 1.52.2.39 $ Directive => Local Value => Master Value filter.default => unsafe_raw => unsafe_raw filter.default_flags => no value => no value gettext GetText Support => enabled hash hash support => enabled Hashing Engines => md2 md4 md5 sha1 sha256 sha384 sha512 ripemd128 ripemd160 ripemd256 ripemd320 whirlpool tiger128,3 tiger160,3 tiger192,3 tiger128,4 tiger160,4 tiger192,4 snefru gost adler32 crc32 crc32b haval128,3 haval160,3 haval192,3 haval224,3 haval256,3 haval128,4 haval160,4 haval192,4 haval224,4 haval256,4 haval128,5 haval160,5 haval192,5 haval224,5 haval256,5 iconv iconv support => enabled iconv implementation => libiconv iconv library version => 1.11 Directive => Local Value => Master Value iconv.input_encoding => ISO-8859-1 => ISO-8859-1 iconv.internal_encoding => ISO-8859-1 => ISO-8859-1 iconv.output_encoding => ISO-8859-1 => ISO-8859-1 imap IMAP c-Client Version => 2004 SSL Support => enabled json json support => enabled json version => 1.2.1 libxml libXML support => active libXML Version => 2.6.26 libXML streams => enabled mbstring Multibyte Support => enabled Multibyte string engine => libmbfl Multibyte (japanese) regex support => enabled Multibyte regex (oniguruma) version => 4.4.4 Multibyte regex (oniguruma) backtrack check => On mbstring extension makes use of "streamable kanji code filter and converter", which is distributed under the GNU Lesser General Public License version 2.1. Directive => Local Value => Master Value mbstring.detect_order => no value => no value mbstring.encoding_translation => Off => Off mbstring.func_overload => 0 => 0 mbstring.http_input => pass => pass mbstring.http_output => pass => pass mbstring.internal_encoding => ISO-8859-1 => no value mbstring.language => neutral => neutral mbstring.strict_detection => Off => Off mbstring.substitute_character => no value => no value mcrypt mcrypt support => enabled Version => 2.5.8 Api No => 20021217 Supported ciphers => twofish rijndael-128 rijndael-192 rijndael-256 saferplus rc2 xtea serpent safer-sk64 safer-sk128 cast-256 loki97 gost threeway cast-128 blowfish des blowfish-compat tripledes enigma arcfour wake Supported modes => ofb cfb nofb cbc ecb stream ncfb ctr Directive => Local Value => Master Value mcrypt.algorithms_dir => no value => no value mcrypt.modes_dir => no value => no value mysql MySQL Support => enabled Active Persistent Links => 0 Active Links => 0 Client API version => 5.0.41 MYSQL_MODULE_TYPE => external MYSQL_SOCKET => /tmp/mysql.sock MYSQL_INCLUDE => -I/usr/local/include/mysql MYSQL_LIBS => -L/usr/local/lib/mysql -lmysqlclient Directive => Local Value => Master Value mysql.allow_persistent => On => On mysql.connect_timeout => 60 => 60 mysql.default_host => no value => no value mysql.default_password => no value => no value mysql.default_port => no value => no value mysql.default_socket => no value => no value mysql.default_user => no value => no value mysql.max_links => Unlimited => Unlimited mysql.max_persistent => Unlimited => Unlimited mysql.trace_mode => Off => Off openssl OpenSSL support => enabled OpenSSL Version => OpenSSL 0.9.8e 23 Feb 2007 pcre PCRE (Perl Compatible Regular Expressions) Support => enabled PCRE Library Version => 7.2 2007-06-19 Directive => Local Value => Master Value pcre.backtrack_limit => 100000 => 100000 pcre.recursion_limit => 100000 => 100000 PDO PDO support => enabled PDO drivers => sqlite2, sqlite pdo_sqlite PDO Driver for SQLite 3.x => enabled PECL Module version => (bundled) 1.0.1 $Id: pdo_sqlite.c,v 1.10.2.6.2.2 2007/03/23 14:30:00 wez Exp $ SQLite Library => 3.3.17 posix Revision => $Revision: 1.70.2.3.2.16 $ Reflection Reflection => enabled Version => $Id: php_reflection.c,v 1.164.2.33.2.45 2007/08/20 17:01:22 sebastian Exp $ session Session Support => enabled Registered save handlers => files user sqlite Registered serializer handlers => php php_binary Directive => Local Value => Master Value session.auto_start => Off => Off session.bug_compat_42 => On => On session.bug_compat_warn => On => On session.cache_expire => 180 => 180 session.cache_limiter => nocache => nocache session.cookie_domain => no value => no value session.cookie_httponly => Off => Off session.cookie_lifetime => 0 => 0 session.cookie_path => / => / session.cookie_secure => Off => Off session.entropy_file => no value => no value session.entropy_length => 0 => 0 session.gc_divisor => 100 => 100 session.gc_maxlifetime => 1440 => 1440 session.gc_probability => 1 => 1 session.hash_bits_per_character => 4 => 4 session.hash_function => 0 => 0 session.name => PHPSESSID => PHPSESSID session.referer_check => no value => no value session.save_handler => files => files session.save_path => no value => no value session.serialize_handler => php => php session.use_cookies => On => On session.use_only_cookies => Off => Off session.use_trans_sid => 0 => 0 SimpleXML Simplexml support => enabled Revision => $Revision: 1.151.2.22.2.35 $ Schema support => enabled SPL SPL support => enabled Interfaces => Countable, OuterIterator, RecursiveIterator, SeekableIterator, SplObserver, SplSubject Classes => AppendIterator, ArrayIterator, ArrayObject, BadFunctionCallException, BadMethodCallException, CachingIterator, DirectoryIterator, DomainException, EmptyIterator, FilterIterator, InfiniteIterator, InvalidArgumentException, IteratorIterator, LengthException, LimitIterator, LogicException, NoRewindIterator, OutOfBoundsException, OutOfRangeException, OverflowException, ParentIterator, RangeException, RecursiveArrayIterator, RecursiveCachingIterator, RecursiveDirectoryIterator, RecursiveFilterIterator, RecursiveIteratorIterator, RecursiveRegexIterator, RegexIterator, RuntimeException, SimpleXMLIterator, SplFileInfo, SplFileObject, SplObjectStorage, SplTempFileObject, UnderflowException, UnexpectedValueException SQLite SQLite support => enabled PECL Module version => 2.0-dev $Id: sqlite.c,v 1.166.2.13.2.9 2007/05/19 17:58:22 iliaa Exp $ SQLite Library => 2.8.17 SQLite Encoding => iso8859 Directive => Local Value => Master Value sqlite.assoc_case => 0 => 0 standard Regex Library => Bundled library enabled Dynamic Library Support => enabled Path to sendmail => /usr/sbin/sendmail -t -i Directive => Local Value => Master Value assert.active => 1 => 1 assert.bail => 0 => 0 assert.callback => no value => no value assert.quiet_eval => 0 => 0 assert.warning => 1 => 1 auto_detect_line_endings => 0 => 0 default_socket_timeout => 60 => 60 safe_mode_allowed_env_vars => PHP_ => PHP_ safe_mode_protected_env_vars => LD_LIBRARY_PATH => LD_LIBRARY_PATH url_rewriter.tags => a=href,area=href,frame=src,form=,fieldset= => a=href,area=href,frame=src,form=,fieldset= user_agent => no value => no value tokenizer Tokenizer Support => enabled xml XML Support => active XML Namespace Support => active libxml2 Version => 2.6.26 xmlreader XMLReader => enabled xmlwriter XMLWriter => enabled zlib ZLib Support => enabled Stream Wrapper support => compress.zlib:// Stream Filter support => zlib.inflate, zlib.deflate Compiled Version => 1.2.3 Linked Version => 1.2.3 Directive => Local Value => Master Value zlib.output_compression => Off => Off zlib.output_compression_level => -1 => -1 zlib.output_handler => no value => no value Additional Modules Module Name Environment Variable => Value CC => gcc DISPLAY => localhost:11.0 EXINIT => set redraw wm=0 GROUP => irz HELPPATH => /usr/openwin/lib/locale:/usr/openwin/lib/help HOME => /usr/users/ck1 HOST => opal HOSTTYPE => i86pc LANG => C LC_MESSAGES => C LC_TIME => C LD_LIBRARY_PATH => /usr/dt/lib:/usr/local/lib:/usr/local/lib/mysql:/usr/lib:/usr/local/BerkeleyDB/lib:/opt/sfw/lib:/usr/sfw/lib:/usr/X11R6/lib:/usr/local/ssl/lib LM_LICENSE_FILE => /opt/SUNWspro/license_dir LOGNAME => ck1 MACHTYPE => i386 MAIL => /var/mail/ck1 MAKEFLAGS => MAKELEVEL => 1 MANPATH => /usr/local/man:/usr/local/share/man:/usr/man:/usr/sfw/man:/opt/sfw/man:/usr/openwin/man:/usr/dt/man:/usr/local/ssl/man:~/man MFLAGS => OPENWINHOME => /usr/openwin OSTYPE => solaris PATH => /usr/users/ck1/bin:/usr/local/bin:/usr/local/cyrus/bin:/usr/local/BerkeleyDB/bin:/opt/sfw/bin:/usr/sfw/bin:/bin:/usr/xpg4/bin:/opt/sfw/gcc-2/bin:/usr/dt/bin:/usr/openwin/bin:/usr/local/ssl/bin:/usr/sfw/i386-sun-solaris2.10/bin:/usr/ccs/bin:/usr/sbin:/usr/ucb:. PWD => /usr/users/ck1/soft/php-5.2.4 REMOTEHOST => onyx.inf.tu-dresden.de SHELL => /usr/bin/tcsh SHLVL => 2 SSH_AUTH_SOCK => deleted SSH_CLIENT => deleted SSH_CONNECTION => deleted SSH_TTY => deleted TERM => vt100 TEST_PHP_EXECUTABLE => /usr/users/ck1/soft/php-5.2.4/sapi/cli/php TEST_PHP_SRCDIR => /usr/users/ck1/soft/php-5.2.4 TZ => Europe/Berlin USER => ck1 VENDOR => sun PHP Variables Variable => Value _SERVER["CC"] => gcc _SERVER["DISPLAY"] => localhost:11.0 _SERVER["EXINIT"] => set redraw wm=0 _SERVER["GROUP"] => irz _SERVER["HELPPATH"] => /usr/openwin/lib/locale:/usr/openwin/lib/help _SERVER["HOME"] => /usr/users/ck1 _SERVER["HOST"] => opal _SERVER["HOSTTYPE"] => i86pc _SERVER["LANG"] => C _SERVER["LC_MESSAGES"] => C _SERVER["LC_TIME"] => C _SERVER["LD_LIBRARY_PATH"] => /usr/dt/lib:/usr/local/lib:/usr/local/lib/mysql:/usr/lib:/usr/local/BerkeleyDB/lib:/opt/sfw/lib:/usr/sfw/lib:/usr/X11R6/lib:/usr/local/ssl/lib _SERVER["LM_LICENSE_FILE"] => /opt/SUNWspro/license_dir _SERVER["LOGNAME"] => ck1 _SERVER["MACHTYPE"] => i386 _SERVER["MAIL"] => /var/mail/ck1 _SERVER["MAKEFLAGS"] => _SERVER["MAKELEVEL"] => 1 _SERVER["MANPATH"] => /usr/local/man:/usr/local/share/man:/usr/man:/usr/sfw/man:/opt/sfw/man:/usr/openwin/man:/usr/dt/man:/usr/local/ssl/man:~/man _SERVER["MFLAGS"] => _SERVER["OPENWINHOME"] => /usr/openwin _SERVER["OSTYPE"] => solaris _SERVER["PATH"] => /usr/users/ck1/bin:/usr/local/bin:/usr/local/cyrus/bin:/usr/local/BerkeleyDB/bin:/opt/sfw/bin:/usr/sfw/bin:/bin:/usr/xpg4/bin:/opt/sfw/gcc-2/bin:/usr/dt/bin:/usr/openwin/bin:/usr/local/ssl/bin:/usr/sfw/i386-sun-solaris2.10/bin:/usr/ccs/bin:/usr/sbin:/usr/ucb:. _SERVER["PWD"] => /usr/users/ck1/soft/php-5.2.4 _SERVER["REMOTEHOST"] => onyx.inf.tu-dresden.de _SERVER["SHELL"] => /usr/bin/tcsh _SERVER["SHLVL"] => 2 _SERVER["SSH_AUTH_SOCK"] => deleted _SERVER["SSH_CLIENT"] => deleted _SERVER["SSH_CONNECTION"] => deleted _SERVER["SSH_TTY"] => deleted _SERVER["TERM"] => vt100 _SERVER["TEST_PHP_EXECUTABLE"] => /usr/users/ck1/soft/php-5.2.4/sapi/cli/php _SERVER["TEST_PHP_SRCDIR"] => /usr/users/ck1/soft/php-5.2.4 _SERVER["TZ"] => Europe/Berlin _SERVER["USER"] => ck1 _SERVER["VENDOR"] => sun _SERVER["PHP_SELF"] => _SERVER["SCRIPT_NAME"] => _SERVER["SCRIPT_FILENAME"] => _SERVER["PATH_TRANSLATED"] => _SERVER["DOCUMENT_ROOT"] => _SERVER["REQUEST_TIME"] => 1192112754 _SERVER["argv"] => Array ( ) _SERVER["argc"] => 0 _ENV["CC"] => gcc _ENV["DISPLAY"] => localhost:11.0 _ENV["EXINIT"] => set redraw wm=0 _ENV["GROUP"] => irz _ENV["HELPPATH"] => /usr/openwin/lib/locale:/usr/openwin/lib/help _ENV["HOME"] => /usr/users/ck1 _ENV["HOST"] => opal _ENV["HOSTTYPE"] => i86pc _ENV["LANG"] => C _ENV["LC_MESSAGES"] => C _ENV["LC_TIME"] => C _ENV["LD_LIBRARY_PATH"] => /usr/dt/lib:/usr/local/lib:/usr/local/lib/mysql:/usr/lib:/usr/local/BerkeleyDB/lib:/opt/sfw/lib:/usr/sfw/lib:/usr/X11R6/lib:/usr/local/ssl/lib _ENV["LM_LICENSE_FILE"] => /opt/SUNWspro/license_dir _ENV["LOGNAME"] => ck1 _ENV["MACHTYPE"] => i386 _ENV["MAIL"] => /var/mail/ck1 _ENV["MAKEFLAGS"] => _ENV["MAKELEVEL"] => 1 _ENV["MANPATH"] => /usr/local/man:/usr/local/share/man:/usr/man:/usr/sfw/man:/opt/sfw/man:/usr/openwin/man:/usr/dt/man:/usr/local/ssl/man:~/man _ENV["MFLAGS"] => _ENV["OPENWINHOME"] => /usr/openwin _ENV["OSTYPE"] => solaris _ENV["PATH"] => /usr/users/ck1/bin:/usr/local/bin:/usr/local/cyrus/bin:/usr/local/BerkeleyDB/bin:/opt/sfw/bin:/usr/sfw/bin:/bin:/usr/xpg4/bin:/opt/sfw/gcc-2/bin:/usr/dt/bin:/usr/openwin/bin:/usr/local/ssl/bin:/usr/sfw/i386-sun-solaris2.10/bin:/usr/ccs/bin:/usr/sbin:/usr/ucb:. _ENV["PWD"] => /usr/users/ck1/soft/php-5.2.4 _ENV["REMOTEHOST"] => onyx.inf.tu-dresden.de _ENV["SHELL"] => /usr/bin/tcsh _ENV["SHLVL"] => 2 _ENV["SSH_AUTH_SOCK"] => deleted _ENV["SSH_CLIENT"] => deleted _ENV["SSH_CONNECTION"] => deleted _ENV["SSH_TTY"] => deleted _ENV["TERM"] => vt100 _ENV["TEST_PHP_EXECUTABLE"] => /usr/users/ck1/soft/php-5.2.4/sapi/cli/php _ENV["TEST_PHP_SRCDIR"] => /usr/users/ck1/soft/php-5.2.4 _ENV["TZ"] => Europe/Berlin _ENV["USER"] => ck1 _ENV["VENDOR"] => sun PHP License This program is free software; you can redistribute it and/or modify it under the terms of the PHP License as published by the PHP Group and included in the distribution in the file: LICENSE This program is distributed in the hope that it will be useful, but WITHOUT ANY WARRANTY; without even the implied warranty of MERCHANTABILITY or FITNESS FOR A PARTICULAR PURPOSE. If you did not receive a copy of the PHP license, or have any questions about PHP licensing, please contact license@php.net.

« previous php.qa (#50034) next »