Test results for 5.2.4 [failed]

From: Date: Tue, 16 Oct 2007 07:31:57 +0000
Subject: Test results for 5.2.4 [failed]
Groups: php.qa 
Request: Send a blank email to php-qa+get-50637@lists.php.net to get a copy of this message
===================================================================== FAILED TEST SUMMARY --------------------------------------------------------------------- Error message handling (with ZendOptimizer) [tests/run-test/test008.phpt] Convert warnings to exceptions [tests/lang/038.phpt] Bug #32828 (Throwing exception in output_callback function with ob_start and ob_end_clean leads to segfault) [tests/lang/bug32828.phpt] Bug #36268 (Object destructors called even after fatal errors) [Zend/tests/bug36268.phpt] Bug #41421 (Uncaught exception from a stream wrapper segfaults) [Zend/tests/bug41421.phpt] Bug #41567 (json_encode() double conversion is inconsistent with PHP) [ext/json/tests/bug41567.phpt] SPL: spl_autoload() with methods [ext/spl/tests/spl_autoload_005.phpt] SPL: spl_autoload() with inaccessible methods [ext/spl/tests/spl_autoload_007.phpt] SPL: spl_autoload() with exceptions [ext/spl/tests/spl_autoload_008.phpt] Bug #35821 (array_map() segfaults when exception is throwed from the callback) [ext/standard/tests/array/bug35821.phpt] Bug #38450 (constructor is not called for classes used in userspace stream wrappers) [ext/standard/tests/file/bug38450_2.phpt] proc_open() regression test 1 (proc_open() leak) [ext/standard/tests/file/proc_open01.phpt] Bug #39322 (proc_terminate() loosing process resource) [ext/standard/tests/general_functions/bug39322.phpt] Test is_callable() function [ext/standard/tests/general_functions/is_callable.phpt] proc_open [ext/standard/tests/general_functions/proc_open02.phpt] htmlentities() test 2 (setlocale / fr_FR.ISO-8859-15) [ext/standard/tests/strings/htmlentities02.phpt] (warn: possibly braindead libc) htmlentities() test 4 (setlocale / ja_JP.EUC-JP) [ext/standard/tests/strings/htmlentities04.phpt] htmlentities() test 15 (setlocale / KOI8-R) [ext/standard/tests/strings/htmlentities15.phpt] Bug #32001 (xml_parse*() goes into infinite loop when autodetection in effect), using UTF-* [ext/xml/tests/bug32001.phpt] CLI long options [sapi/cli/tests/015.phpt] ===================================================================== ===================================================================== TEST RESULT SUMMARY --------------------------------------------------------------------- Exts skipped : 54 Exts tested : 26 --------------------------------------------------------------------- Number of tests : 3973 2552 Tests skipped : 1421 ( 35.8%) -------- Tests warned : 1 ( 0.0%) ( 0.0%) Tests failed : 19 ( 0.5%) ( 0.7%) Tests passed : 2532 ( 63.7%) ( 99.2%) --------------------------------------------------------------------- Time taken : 166 seconds ===================================================================== ===================================================================== FAILED TEST SUMMARY --------------------------------------------------------------------- Error message handling (with ZendOptimizer) [tests/run-test/test008.phpt] Convert warnings to exceptions [tests/lang/038.phpt] Bug #32828 (Throwing exception in output_callback function with ob_start and ob_end_clean leads to segfault) [tests/lang/bug32828.phpt] Bug #36268 (Object destructors called even after fatal errors) [Zend/tests/bug36268.phpt] Bug #41421 (Uncaught exception from a stream wrapper segfaults) [Zend/tests/bug41421.phpt] Bug #41567 (json_encode() double conversion is inconsistent with PHP) [ext/json/tests/bug41567.phpt] SPL: spl_autoload() with methods [ext/spl/tests/spl_autoload_005.phpt] SPL: spl_autoload() with inaccessible methods [ext/spl/tests/spl_autoload_007.phpt] SPL: spl_autoload() with exceptions [ext/spl/tests/spl_autoload_008.phpt] Bug #35821 (array_map() segfaults when exception is throwed from the callback) [ext/standard/tests/array/bug35821.phpt] Bug #38450 (constructor is not called for classes used in userspace stream wrappers) [ext/standard/tests/file/bug38450_2.phpt] proc_open() regression test 1 (proc_open() leak) [ext/standard/tests/file/proc_open01.phpt] Bug #39322 (proc_terminate() loosing process resource) [ext/standard/tests/general_functions/bug39322.phpt] Test is_callable() function [ext/standard/tests/general_functions/is_callable.phpt] proc_open [ext/standard/tests/general_functions/proc_open02.phpt] htmlentities() test 2 (setlocale / fr_FR.ISO-8859-15) [ext/standard/tests/strings/htmlentities02.phpt] (warn: possibly braindead libc) htmlentities() test 4 (setlocale / ja_JP.EUC-JP) [ext/standard/tests/strings/htmlentities04.phpt] htmlentities() test 15 (setlocale / KOI8-R) [ext/standard/tests/strings/htmlentities15.phpt] Bug #32001 (xml_parse*() goes into infinite loop when autodetection in effect), using UTF-* [ext/xml/tests/bug32001.phpt] CLI long options [sapi/cli/tests/015.phpt] ===================================================================== ================================================================================ /var/work/php-5.2.4/tests/run-test/test008.phpt ================================================================================ string(1) "1" string(4) "8191" string(1) "0" string(1) "1" string(1) "0" NULL string(16) "Division by zero" ================================================================================ 001- %s: %sivision by zero in %s on line %d 006+ NULL 008- string(%d) "%sivision by zer%s" ================================================================================ ================================================================================ /var/work/php-5.2.4/tests/lang/038.phpt ================================================================================ string(15) "Error2Exception" Fatal error: Uncaught exception 'MyException' with message 'Undefined offset: 1' in :0 Stack trace: #0 /var/work/php-5.2.4/tests/lang/038.php(29): Error2Exception(8, 'Undefined offse...', '/var/work/php-5...', 29, Array) #1 {main} thrown in on line 141277024 ================================================================================ 002+ 003+ Fatal error: Uncaught exception 'MyException' with message 'Undefined offset: 1' in :0 002- string(5) "fopen" 003- ===DONE=== 004+ Stack trace: 005+ #0 /var/work/php-5.2.4/tests/lang/038.php(29): Error2Exception(8, 'Undefined offse...', '/var/work/php-5...', 29, Array) 006+ #1 {main} 007+ thrown in on line 141277024 ================================================================================ ================================================================================ /var/work/php-5.2.4/tests/lang/bug32828.phpt ================================================================================ Fatal error: Uncaught exception 'Exception' in /var/work/php-5.2.4/tests/lang/bug32828.php:5 Stack trace: #0 /var/work/php-5.2.4/tests/lang/bug32828.php(10): output_handler('', 5) #1 {main} thrown in /var/work/php-5.2.4/tests/lang/bug32828.php on line 5 ================================================================================ 003+ #0 /var/work/php-5.2.4/tests/lang/bug32828.php(10): output_handler('', 5) 004+ #1 {main} 003- #0 [internal function]: output_handler('', %d) 004- #1 %s(%d): ob_end_clean() 005- #2 {main} ================================================================================ ================================================================================ /var/work/php-5.2.4/Zend/tests/bug36268.phpt ================================================================================ Fatal error: Call to undefined function bar() in /var/work/php-5.2.4/Zend/tests/bug36268.php on line 8 ================================================================================ 001+ Fatal error: Call to undefined function bar() in /var/work/php-5.2.4/Zend/tests/bug36268.php on line 8 001- Fatal error: Call to undefined function bar() in %sbug36268.php on line 8 ================================================================================ ================================================================================ /var/work/php-5.2.4/Zend/tests/bug41421.phpt ================================================================================ Warning: feof(): wrapper::stream_eof is not implemented! Assuming EOF in /var/work/php-5.2.4/Zend/tests/bug41421.php on line 18 Fatal error: Uncaught exception 'Exception' in /var/work/php-5.2.4/Zend/tests/bug41421.php:8 Stack trace: #0 /var/work/php-5.2.4/Zend/tests/bug41421.php(14): wrapper->stream_eof() #1 {main} thrown in /var/work/php-5.2.4/Zend/tests/bug41421.php on line 8 ================================================================================ 005+ #0 /var/work/php-5.2.4/Zend/tests/bug41421.php(14): wrapper->stream_eof() 006+ #1 {main} 005- #0 [internal function]: wrapper->stream_eof() 006- #1 %s(%d): feof(Resource id #6) 007- #2 {main} ================================================================================ ================================================================================ /var/work/php-5.2.4/ext/json/tests/bug41567.phpt ================================================================================ float(123456789.123) Done ================================================================================ 001+ float(123456789.123) 001- float(123456789.12345) ================================================================================ ================================================================================ /var/work/php-5.2.4/ext/spl/tests/spl_autoload_005.phpt ================================================================================ Strict Standards: Non-static method MyAutoLoader::autoLoad() cannot be called statically in /var/work/php-5.2.4/ext/spl/tests/spl_autoload_005.php on line 19 Exception: Passed array specifies a non static method but no object MyAutoLoader::autoLoad(TestClass) MyAutoLoader::autoThrow(TestClass) Exception: Unavailable ===DONE=== ================================================================================ 001+ Strict Standards: Non-static method MyAutoLoader::autoLoad() cannot be called statically in /var/work/php-5.2.4/ext/spl/tests/spl_autoload_005.php on line 19 ================================================================================ ================================================================================ /var/work/php-5.2.4/ext/spl/tests/spl_autoload_007.phpt ================================================================================ string(22) "MyAutoLoader::notExist" Function 'MyAutoLoader::notExist' not found string(22) "MyAutoLoader::noAccess" Function 'MyAutoLoader::noAccess' not callable string(22) "MyAutoLoader::autoLoad" ok string(22) "MyAutoLoader::dynaLoad" Function 'MyAutoLoader::dynaLoad' not callable array(2) { [0]=> string(12) "MyAutoLoader" [1]=> string(8) "notExist" } MyAutoLoader::autoLoad(321o67vfigy0) MyAutoLoader::autoLoad(321o67vfigy0) Passed array does not specify an existing static method array(2) { [0]=> string(12) "MyAutoLoader" [1]=> string(8) "noAccess" } Passed array does not specify a callable static method array(2) { [0]=> string(12) "MyAutoLoader" [1]=> string(8) "autoLoad" } ok array(2) { [0]=> string(12) "MyAutoLoader" [1]=> string(8) "dynaLoad" } Strict Standards: Non-static method MyAutoLoader::dynaLoad() cannot be called statically in /var/work/php-5.2.4/ext/spl/tests/spl_autoload_007.php on line 41 Passed array specifies a non static method but no object array(2) { [0]=> object(MyAutoLoader)#1 (0) { } [1]=> string(8) "notExist" } Passed array does not specify an existing method array(2) { [0]=> object(MyAutoLoader)#1 (0) { } [1]=> string(8) "noAccess" } Passed array does not specify a callable method array(2) { [0]=> object(MyAutoLoader)#1 (0) { } [1]=> string(8) "autoLoad" } ok array(2) { [0]=> object(MyAutoLoader)#1 (0) { } [1]=> string(8) "dynaLoad" } ok ===DONE=== ================================================================================ 019+ MyAutoLoader::autoLoad(321o67vfigy0) 020+ MyAutoLoader::autoLoad(321o67vfigy0) 045+ 046+ Strict Standards: Non-static method MyAutoLoader::dynaLoad() cannot be called statically in /var/work/php-5.2.4/ext/spl/tests/spl_autoload_007.php on line 41 ================================================================================ ================================================================================ /var/work/php-5.2.4/ext/spl/tests/spl_autoload_008.phpt ================================================================================ ====0==== string(10) "MyAutoLoad" registered MyAutoLoad(NoExistingTestClass) Exception: Bla int(0) ====1==== string(22) "MyAutoLoader::autoLoad" registered MyAutoLoader::autoLoad(NoExistingTestClass) Exception: Bla int(0) ====2==== string(22) "MyAutoLoader::dynaLoad" LogicException: Function 'MyAutoLoader::dynaLoad' not callable int(0) ====3==== array(2) { [0]=> string(12) "MyAutoLoader" [1]=> string(8) "autoLoad" } registered MyAutoLoader::autoLoad(NoExistingTestClass) Exception: Bla int(0) ====4==== array(2) { [0]=> string(12) "MyAutoLoader" [1]=> string(8) "dynaLoad" } Strict Standards: Non-static method MyAutoLoader::dynaLoad() cannot be called statically in /var/work/php-5.2.4/ext/spl/tests/spl_autoload_008.php on line 43 LogicException: Passed array specifies a non static method but no object int(0) ====5==== array(2) { [0]=> object(MyAutoLoader)#1 (0) { } [1]=> string(8) "autoLoad" } registered MyAutoLoader::autoLoad(NoExistingTestClass) Exception: Bla int(0) ====6==== array(2) { [0]=> object(MyAutoLoader)#1 (0) { } [1]=> string(8) "dynaLoad" } registered MyAutoLoader::dynaLoad(NoExistingTestClass) Exception: Bla int(0) ===DONE=== ================================================================================ 035+ 036+ Strict Standards: Non-static method MyAutoLoader::dynaLoad() cannot be called statically in /var/work/php-5.2.4/ext/spl/tests/spl_autoload_008.php on line 43 ================================================================================ ================================================================================ /var/work/php-5.2.4/ext/standard/tests/array/bug35821.phpt ================================================================================ Warning: array_map(): An error occurred while invoking the map callback in /var/work/php-5.2.4/ext/standard/tests/array/bug35821.php on line 21 Fatal error: Uncaught exception 'Exception' in /var/work/php-5.2.4/ext/standard/tests/array/bug35821.php:7 Stack trace: #0 /var/work/php-5.2.4/ext/standard/tests/array/bug35821.php(12): Element->ThrowException() #1 /var/work/php-5.2.4/ext/standard/tests/array/bug35821.php(17): Element::CallBack(Object(Element)) #2 {main} thrown in /var/work/php-5.2.4/ext/standard/tests/array/bug35821.php on line 7 ================================================================================ 006+ #1 /var/work/php-5.2.4/ext/standard/tests/array/bug35821.php(17): Element::CallBack(Object(Element)) 007+ #2 {main} 006- #1 [internal function]: Element::CallBack(Object(Element)) 007- #2 %s(%d): array_map(Array, Array) 008- #3 {main} ================================================================================ ================================================================================ /var/work/php-5.2.4/ext/standard/tests/file/bug38450_2.phpt ================================================================================ Warning: Missing argument 1 for VariableStream::__construct() in /var/work/php-5.2.4/ext/standard/tests/file/bug38450_2.php on line 7 Warning: fopen(var://myvar): failed to open stream: "VariableStream::stream_open" call failed in /var/work/php-5.2.4/ext/standard/tests/file/bug38450_2.php on line 101 Fatal error: Uncaught exception 'Exception' with message 'constructor' in /var/work/php-5.2.4/ext/standard/tests/file/bug38450_2.php:8 Stack trace: #0 /var/work/php-5.2.4/ext/standard/tests/file/bug38450_2.php(86): VariableStream->__construct() #1 {main} thrown in /var/work/php-5.2.4/ext/standard/tests/file/bug38450_2.php on line 8 ================================================================================ 007+ #0 /var/work/php-5.2.4/ext/standard/tests/file/bug38450_2.php(86): VariableStream->__construct() 008+ #1 {main} 007- #0 [internal function]: VariableStream->__construct() 008- #1 %s(%d): fopen('var://myvar', 'r+') 009- #2 {main} ================================================================================ ================================================================================ /var/work/php-5.2.4/ext/standard/tests/file/proc_open01.phpt ================================================================================ array(2) { [0]=> resource(4) of type (stream) [1]=> resource(5) of type (stream) } terminated after 1000 iterations string(0) "" array(3) { [0]=> int(1) [1]=> int(2) [2]=> int(3) } ================================================================================ 007+ terminated after 1000 iterations 008+ string(0) "" 007- string(5) "yay! 008- " ================================================================================ ================================================================================ /var/work/php-5.2.4/ext/standard/tests/general_functions/bug39322.phpt ================================================================================ array(8) { ["command"]=> string(14) "/bin/sleep 120" ["pid"]=> int(10984) ["running"]=> bool(false) ["signaled"]=> bool(false) ["stopped"]=> bool(false) ["exitcode"]=> int(-1) ["termsig"]=> int(0) ["stopsig"]=> int(0) } Done! ================================================================================ 009+ bool(false) 009- bool(true) 015+ int(0) 015- int(15) ================================================================================ ================================================================================ /var/work/php-5.2.4/ext/standard/tests/general_functions/is_callable.phpt ================================================================================ *** Testing is_callable() on defined functions *** -- Iteration 1 -- bool(true) bool(true) bool(true) bool(true) bool(true) someFunction -- Iteration 2 -- bool(true) bool(true) bool(true) bool(true) bool(true) x123 -- Iteration 3 -- bool(true) bool(true) bool(true) bool(true) bool(true) NULL -- Iteration 4 -- bool(true) bool(true) bool(true) bool(true) bool(true) false -- Iteration 5 -- bool(true) bool(true) bool(true) bool(true) bool(true) Hello_World *** Testing is_callable() on undefined functions *** -- Iteration 1 -- bool(false) bool(true) bool(true) bool(false) bool(false) -- Iteration 2 -- bool(false) bool(true) bool(true) bool(false) bool(false) -- Iteration 3 -- bool(false) bool(true) bool(true) bool(false) bool(false) -- Iteration 4 -- bool(false) bool(true) bool(true) bool(false) bool(false) -- Iteration 5 -- bool(false) bool(true) bool(true) bool(false) bool(false) 12356 -- Iteration 6 -- bool(false) bool(true) bool(true) bool(false) bool(false) -- Iteration 7 -- bool(false) bool(true) bool(true) bool(false) bool(false) \0 -- Iteration 8 -- bool(false) bool(true) bool(true) bool(false) bool(false) hello world -- Iteration 9 -- bool(false) bool(true) bool(true) bool(false) bool(false) hello world -- Iteration 10 -- bool(false) bool(true) bool(true) bool(false) bool(false) welcome -- Iteration 11 -- bool(false) bool(true) bool(true) bool(false) bool(false) welcome\0 -- Iteration 12 -- bool(false) bool(true) bool(true) bool(false) bool(false) ==%%%***$$$@@@!! -- Iteration 13 -- bool(true) bool(true) bool(true) bool(true) bool(true) false -- Iteration 14 -- bool(false) bool(true) bool(true) bool(false) bool(false) 8 -- Iteration 15 -- bool(false) bool(true) bool(true) bool(false) bool(false) \t -- Iteration 16 -- bool(false) bool(true) bool(true) bool(false) bool(false) \007 -- Iteration 17 -- bool(false) bool(true) bool(true) bool(false) bool(false) 123 -- Iteration 18 -- bool(false) bool(true) bool(true) bool(false) bool(false) echo() *** Testing is_callable() on objects *** ** Testing behavior of is_callable() on static methods ** bool(true) bool(false) ** Testing normal operations of is_callable() on objects ** --- Outerloop iteration 1 --- -- Innerloop iteration 1 of Outerloop iteration 1 -- bool(true) bool(true) bool(true) bool(true) bool(true) object_class::foo1 -- Innerloop iteration 2 of Outerloop iteration 1 -- bool(false) bool(true) bool(false) bool(true) bool(false) object_class::foo2 -- Innerloop iteration 3 of Outerloop iteration 1 -- bool(false) bool(true) bool(false) bool(true) bool(false) object_class::foo3 -- Innerloop iteration 4 of Outerloop iteration 1 -- bool(true) bool(true) bool(true) bool(true) bool(true) object_class::x123 -- Innerloop iteration 5 of Outerloop iteration 1 -- bool(true) bool(true) bool(true) bool(true) bool(true) object_class::null -- Innerloop iteration 6 of Outerloop iteration 1 -- bool(true) bool(true) bool(true) bool(true) bool(true) object_class::TRUE -- Innerloop iteration 7 of Outerloop iteration 1 -- bool(false) bool(true) bool(false) bool(true) bool(false) object_class::123 -- Innerloop iteration 8 of Outerloop iteration 1 -- bool(false) bool(false) bool(false) bool(false) bool(false) Array -- Innerloop iteration 9 of Outerloop iteration 1 -- bool(false) bool(true) bool(false) bool(true) bool(false) object_class::func -- Innerloop iteration 10 of Outerloop iteration 1 -- Strict Standards: Non-static method object_class::foo1() cannot be called statically in /var/work/php-5.2.4/ext/standard/tests/general_functions/is_callable.php on line 35 Strict Standards: Non-static method object_class::foo1() cannot be called statically in /var/work/php-5.2.4/ext/standard/tests/general_functions/is_callable.php on line 35 bool(true) Strict Standards: Non-static method object_class::foo1() cannot be called statically in /var/work/php-5.2.4/ext/standard/tests/general_functions/is_callable.php on line 36 bool(true) Strict Standards: Non-static method object_class::foo1() cannot be called statically in /var/work/php-5.2.4/ext/standard/tests/general_functions/is_callable.php on line 37 Strict Standards: Non-static method object_class::foo1() cannot be called statically in /var/work/php-5.2.4/ext/standard/tests/general_functions/is_callable.php on line 37 bool(true) Strict Standards: Non-static method object_class::foo1() cannot be called statically in /var/work/php-5.2.4/ext/standard/tests/general_functions/is_callable.php on line 38 bool(true) Strict Standards: Non-static method object_class::foo1() cannot be called statically in /var/work/php-5.2.4/ext/standard/tests/general_functions/is_callable.php on line 39 Strict Standards: Non-static method object_class::foo1() cannot be called statically in /var/work/php-5.2.4/ext/standard/tests/general_functions/is_callable.php on line 39 bool(true) object_class::foo1 --- Outerloop iteration 2 --- -- Innerloop iteration 1 of Outerloop iteration 2 -- bool(false) bool(true) bool(false) bool(true) bool(false) no_member_class::foo1 -- Innerloop iteration 2 of Outerloop iteration 2 -- bool(false) bool(true) bool(false) bool(true) bool(false) no_member_class::foo2 -- Innerloop iteration 3 of Outerloop iteration 2 -- bool(false) bool(true) bool(false) bool(true) bool(false) no_member_class::foo3 -- Innerloop iteration 4 of Outerloop iteration 2 -- bool(false) bool(true) bool(false) bool(true) bool(false) no_member_class::x123 -- Innerloop iteration 5 of Outerloop iteration 2 -- bool(false) bool(true) bool(false) bool(true) bool(false) no_member_class::null -- Innerloop iteration 6 of Outerloop iteration 2 -- bool(false) bool(true) bool(false) bool(true) bool(false) no_member_class::TRUE -- Innerloop iteration 7 of Outerloop iteration 2 -- bool(false) bool(true) bool(false) bool(true) bool(false) no_member_class::123 -- Innerloop iteration 8 of Outerloop iteration 2 -- bool(false) bool(false) bool(false) bool(false) bool(false) Array -- Innerloop iteration 9 of Outerloop iteration 2 -- bool(false) bool(true) bool(false) bool(true) bool(false) no_member_class::func -- Innerloop iteration 10 of Outerloop iteration 2 -- Strict Standards: Non-static method object_class::foo1() cannot be called statically in /var/work/php-5.2.4/ext/standard/tests/general_functions/is_callable.php on line 35 Strict Standards: Non-static method object_class::foo1() cannot be called statically in /var/work/php-5.2.4/ext/standard/tests/general_functions/is_callable.php on line 35 bool(true) Strict Standards: Non-static method object_class::foo1() cannot be called statically in /var/work/php-5.2.4/ext/standard/tests/general_functions/is_callable.php on line 36 bool(true) Strict Standards: Non-static method object_class::foo1() cannot be called statically in /var/work/php-5.2.4/ext/standard/tests/general_functions/is_callable.php on line 37 Strict Standards: Non-static method object_class::foo1() cannot be called statically in /var/work/php-5.2.4/ext/standard/tests/general_functions/is_callable.php on line 37 bool(true) Strict Standards: Non-static method object_class::foo1() cannot be called statically in /var/work/php-5.2.4/ext/standard/tests/general_functions/is_callable.php on line 38 bool(true) Strict Standards: Non-static method object_class::foo1() cannot be called statically in /var/work/php-5.2.4/ext/standard/tests/general_functions/is_callable.php on line 39 Strict Standards: Non-static method object_class::foo1() cannot be called statically in /var/work/php-5.2.4/ext/standard/tests/general_functions/is_callable.php on line 39 bool(true) object_class::foo1 --- Outerloop iteration 3 --- -- Innerloop iteration 1 of Outerloop iteration 3 -- bool(false) bool(true) bool(false) bool(true) bool(false) contains_object_class::foo1 -- Innerloop iteration 2 of Outerloop iteration 3 -- bool(false) bool(true) bool(false) bool(true) bool(false) contains_object_class::foo2 -- Innerloop iteration 3 of Outerloop iteration 3 -- bool(false) bool(true) bool(false) bool(true) bool(false) contains_object_class::foo3 -- Innerloop iteration 4 of Outerloop iteration 3 -- bool(false) bool(true) bool(false) bool(true) bool(false) contains_object_class::x123 -- Innerloop iteration 5 of Outerloop iteration 3 -- bool(false) bool(true) bool(false) bool(true) bool(false) contains_object_class::null -- Innerloop iteration 6 of Outerloop iteration 3 -- bool(false) bool(true) bool(false) bool(true) bool(false) contains_object_class::TRUE -- Innerloop iteration 7 of Outerloop iteration 3 -- bool(false) bool(true) bool(false) bool(true) bool(false) contains_object_class::123 -- Innerloop iteration 8 of Outerloop iteration 3 -- bool(false) bool(false) bool(false) bool(false) bool(false) Array -- Innerloop iteration 9 of Outerloop iteration 3 -- bool(true) bool(true) bool(true) bool(true) bool(true) contains_object_class::func -- Innerloop iteration 10 of Outerloop iteration 3 -- Strict Standards: Non-static method object_class::foo1() cannot be called statically in /var/work/php-5.2.4/ext/standard/tests/general_functions/is_callable.php on line 35 Strict Standards: Non-static method object_class::foo1() cannot be called statically in /var/work/php-5.2.4/ext/standard/tests/general_functions/is_callable.php on line 35 bool(true) Strict Standards: Non-static method object_class::foo1() cannot be called statically in /var/work/php-5.2.4/ext/standard/tests/general_functions/is_callable.php on line 36 bool(true) Strict Standards: Non-static method object_class::foo1() cannot be called statically in /var/work/php-5.2.4/ext/standard/tests/general_functions/is_callable.php on line 37 Strict Standards: Non-static method object_class::foo1() cannot be called statically in /var/work/php-5.2.4/ext/standard/tests/general_functions/is_callable.php on line 37 bool(true) Strict Standards: Non-static method object_class::foo1() cannot be called statically in /var/work/php-5.2.4/ext/standard/tests/general_functions/is_callable.php on line 38 bool(true) Strict Standards: Non-static method object_class::foo1() cannot be called statically in /var/work/php-5.2.4/ext/standard/tests/general_functions/is_callable.php on line 39 Strict Standards: Non-static method object_class::foo1() cannot be called statically in /var/work/php-5.2.4/ext/standard/tests/general_functions/is_callable.php on line 39 bool(true) object_class::foo1 --- Outerloop iteration 4 --- -- Innerloop iteration 1 of Outerloop iteration 4 -- bool(false) bool(true) bool(false) bool(true) bool(false) contains_object_class::foo1 -- Innerloop iteration 2 of Outerloop iteration 4 -- bool(false) bool(true) bool(false) bool(true) bool(false) contains_object_class::foo2 -- Innerloop iteration 3 of Outerloop iteration 4 -- bool(false) bool(true) bool(false) bool(true) bool(false) contains_object_class::foo3 -- Innerloop iteration 4 of Outerloop iteration 4 -- bool(false) bool(true) bool(false) bool(true) bool(false) contains_object_class::x123 -- Innerloop iteration 5 of Outerloop iteration 4 -- bool(false) bool(true) bool(false) bool(true) bool(false) contains_object_class::null -- Innerloop iteration 6 of Outerloop iteration 4 -- bool(false) bool(true) bool(false) bool(true) bool(false) contains_object_class::TRUE -- Innerloop iteration 7 of Outerloop iteration 4 -- bool(false) bool(true) bool(false) bool(true) bool(false) contains_object_class::123 -- Innerloop iteration 8 of Outerloop iteration 4 -- bool(false) bool(false) bool(false) bool(false) bool(false) Array -- Innerloop iteration 9 of Outerloop iteration 4 -- bool(true) bool(true) bool(true) bool(true) bool(true) contains_object_class::func -- Innerloop iteration 10 of Outerloop iteration 4 -- Strict Standards: Non-static method object_class::foo1() cannot be called statically in /var/work/php-5.2.4/ext/standard/tests/general_functions/is_callable.php on line 35 Strict Standards: Non-static method object_class::foo1() cannot be called statically in /var/work/php-5.2.4/ext/standard/tests/general_functions/is_callable.php on line 35 bool(true) Strict Standards: Non-static method object_class::foo1() cannot be called statically in /var/work/php-5.2.4/ext/standard/tests/general_functions/is_callable.php on line 36 bool(true) Strict Standards: Non-static method object_class::foo1() cannot be called statically in /var/work/php-5.2.4/ext/standard/tests/general_functions/is_callable.php on line 37 Strict Standards: Non-static method object_class::foo1() cannot be called statically in /var/work/php-5.2.4/ext/standard/tests/general_functions/is_callable.php on line 37 bool(true) Strict Standards: Non-static method object_class::foo1() cannot be called statically in /var/work/php-5.2.4/ext/standard/tests/general_functions/is_callable.php on line 38 bool(true) Strict Standards: Non-static method object_class::foo1() cannot be called statically in /var/work/php-5.2.4/ext/standard/tests/general_functions/is_callable.php on line 39 Strict Standards: Non-static method object_class::foo1() cannot be called statically in /var/work/php-5.2.4/ext/standard/tests/general_functions/is_callable.php on line 39 bool(true) object_class::foo1 --- Outerloop iteration 5 --- -- Innerloop iteration 1 of Outerloop iteration 5 -- bool(true) bool(true) bool(true) bool(true) bool(true) object_class::foo1 -- Innerloop iteration 2 of Outerloop iteration 5 -- bool(false) bool(true) bool(false) bool(true) bool(false) object_class::foo2 -- Innerloop iteration 3 of Outerloop iteration 5 -- bool(false) bool(true) bool(false) bool(true) bool(false) object_class::foo3 -- Innerloop iteration 4 of Outerloop iteration 5 -- bool(true) bool(true) bool(true) bool(true) bool(true) object_class::x123 -- Innerloop iteration 5 of Outerloop iteration 5 -- bool(true) bool(true) bool(true) bool(true) bool(true) object_class::null -- Innerloop iteration 6 of Outerloop iteration 5 -- bool(true) bool(true) bool(true) bool(true) bool(true) object_class::TRUE -- Innerloop iteration 7 of Outerloop iteration 5 -- bool(false) bool(true) bool(false) bool(true) bool(false) object_class::123 -- Innerloop iteration 8 of Outerloop iteration 5 -- bool(false) bool(false) bool(false) bool(false) bool(false) Array -- Innerloop iteration 9 of Outerloop iteration 5 -- bool(false) bool(true) bool(false) bool(true) bool(false) object_class::func -- Innerloop iteration 10 of Outerloop iteration 5 -- Strict Standards: Non-static method object_class::foo1() cannot be called statically in /var/work/php-5.2.4/ext/standard/tests/general_functions/is_callable.php on line 35 Strict Standards: Non-static method object_class::foo1() cannot be called statically in /var/work/php-5.2.4/ext/standard/tests/general_functions/is_callable.php on line 35 bool(true) Strict Standards: Non-static method object_class::foo1() cannot be called statically in /var/work/php-5.2.4/ext/standard/tests/general_functions/is_callable.php on line 36 bool(true) Strict Standards: Non-static method object_class::foo1() cannot be called statically in /var/work/php-5.2.4/ext/standard/tests/general_functions/is_callable.php on line 37 Strict Standards: Non-static method object_class::foo1() cannot be called statically in /var/work/php-5.2.4/ext/standard/tests/general_functions/is_callable.php on line 37 bool(true) Strict Standards: Non-static method object_class::foo1() cannot be called statically in /var/work/php-5.2.4/ext/standard/tests/general_functions/is_callable.php on line 38 bool(true) Strict Standards: Non-static method object_class::foo1() cannot be called statically in /var/work/php-5.2.4/ext/standard/tests/general_functions/is_callable.php on line 39 Strict Standards: Non-static method object_class::foo1() cannot be called statically in /var/work/php-5.2.4/ext/standard/tests/general_functions/is_callable.php on line 39 bool(true) object_class::foo1 --- Outerloop iteration 6 --- -- Innerloop iteration 1 of Outerloop iteration 6 -- bool(false) bool(true) bool(false) bool(true) bool(false) no_member_class::foo1 -- Innerloop iteration 2 of Outerloop iteration 6 -- bool(false) bool(true) bool(false) bool(true) bool(false) no_member_class::foo2 -- Innerloop iteration 3 of Outerloop iteration 6 -- bool(false) bool(true) bool(false) bool(true) bool(false) no_member_class::foo3 -- Innerloop iteration 4 of Outerloop iteration 6 -- bool(false) bool(true) bool(false) bool(true) bool(false) no_member_class::x123 -- Innerloop iteration 5 of Outerloop iteration 6 -- bool(false) bool(true) bool(false) bool(true) bool(false) no_member_class::null -- Innerloop iteration 6 of Outerloop iteration 6 -- bool(false) bool(true) bool(false) bool(true) bool(false) no_member_class::TRUE -- Innerloop iteration 7 of Outerloop iteration 6 -- bool(false) bool(true) bool(false) bool(true) bool(false) no_member_class::123 -- Innerloop iteration 8 of Outerloop iteration 6 -- bool(false) bool(false) bool(false) bool(false) bool(false) Array -- Innerloop iteration 9 of Outerloop iteration 6 -- bool(false) bool(true) bool(false) bool(true) bool(false) no_member_class::func -- Innerloop iteration 10 of Outerloop iteration 6 -- Strict Standards: Non-static method object_class::foo1() cannot be called statically in /var/work/php-5.2.4/ext/standard/tests/general_functions/is_callable.php on line 35 Strict Standards: Non-static method object_class::foo1() cannot be called statically in /var/work/php-5.2.4/ext/standard/tests/general_functions/is_callable.php on line 35 bool(true) Strict Standards: Non-static method object_class::foo1() cannot be called statically in /var/work/php-5.2.4/ext/standard/tests/general_functions/is_callable.php on line 36 bool(true) Strict Standards: Non-static method object_class::foo1() cannot be called statically in /var/work/php-5.2.4/ext/standard/tests/general_functions/is_callable.php on line 37 Strict Standards: Non-static method object_class::foo1() cannot be called statically in /var/work/php-5.2.4/ext/standard/tests/general_functions/is_callable.php on line 37 bool(true) Strict Standards: Non-static method object_class::foo1() cannot be called statically in /var/work/php-5.2.4/ext/standard/tests/general_functions/is_callable.php on line 38 bool(true) Strict Standards: Non-static method object_class::foo1() cannot be called statically in /var/work/php-5.2.4/ext/standard/tests/general_functions/is_callable.php on line 39 Strict Standards: Non-static method object_class::foo1() cannot be called statically in /var/work/php-5.2.4/ext/standard/tests/general_functions/is_callable.php on line 39 bool(true) object_class::foo1 --- Outerloop iteration 7 --- -- Innerloop iteration 1 of Outerloop iteration 7 -- bool(true) bool(true) bool(true) bool(true) bool(true) object_class::foo1 -- Innerloop iteration 2 of Outerloop iteration 7 -- bool(false) bool(true) bool(false) bool(true) bool(false) object_class::foo2 -- Innerloop iteration 3 of Outerloop iteration 7 -- bool(false) bool(true) bool(false) bool(true) bool(false) object_class::foo3 -- Innerloop iteration 4 of Outerloop iteration 7 -- bool(true) bool(true) bool(true) bool(true) bool(true) object_class::x123 -- Innerloop iteration 5 of Outerloop iteration 7 -- bool(true) bool(true) bool(true) bool(true) bool(true) object_class::null -- Innerloop iteration 6 of Outerloop iteration 7 -- bool(true) bool(true) bool(true) bool(true) bool(true) object_class::TRUE -- Innerloop iteration 7 of Outerloop iteration 7 -- bool(false) bool(true) bool(false) bool(true) bool(false) object_class::123 -- Innerloop iteration 8 of Outerloop iteration 7 -- bool(false) bool(false) bool(false) bool(false) bool(false) Array -- Innerloop iteration 9 of Outerloop iteration 7 -- bool(false) bool(true) bool(false) bool(true) bool(false) object_class::func -- Innerloop iteration 10 of Outerloop iteration 7 -- Strict Standards: Non-static method object_class::foo1() cannot be called statically in /var/work/php-5.2.4/ext/standard/tests/general_functions/is_callable.php on line 35 Strict Standards: Non-static method object_class::foo1() cannot be called statically in /var/work/php-5.2.4/ext/standard/tests/general_functions/is_callable.php on line 35 bool(true) Strict Standards: Non-static method object_class::foo1() cannot be called statically in /var/work/php-5.2.4/ext/standard/tests/general_functions/is_callable.php on line 36 bool(true) Strict Standards: Non-static method object_class::foo1() cannot be called statically in /var/work/php-5.2.4/ext/standard/tests/general_functions/is_callable.php on line 37 Strict Standards: Non-static method object_class::foo1() cannot be called statically in /var/work/php-5.2.4/ext/standard/tests/general_functions/is_callable.php on line 37 bool(true) Strict Standards: Non-static method object_class::foo1() cannot be called statically in /var/work/php-5.2.4/ext/standard/tests/general_functions/is_callable.php on line 38 bool(true) Strict Standards: Non-static method object_class::foo1() cannot be called statically in /var/work/php-5.2.4/ext/standard/tests/general_functions/is_callable.php on line 39 Strict Standards: Non-static method object_class::foo1() cannot be called statically in /var/work/php-5.2.4/ext/standard/tests/general_functions/is_callable.php on line 39 bool(true) object_class::foo1 --- Outerloop iteration 8 --- -- Innerloop iteration 1 of Outerloop iteration 8 -- bool(false) bool(false) bool(false) bool(false) bool(false) Array -- Innerloop iteration 2 of Outerloop iteration 8 -- bool(false) bool(false) bool(false) bool(false) bool(false) Array -- Innerloop iteration 3 of Outerloop iteration 8 -- bool(false) bool(false) bool(false) bool(false) bool(false) Array -- Innerloop iteration 4 of Outerloop iteration 8 -- bool(false) bool(false) bool(false) bool(false) bool(false) Array -- Innerloop iteration 5 of Outerloop iteration 8 -- bool(false) bool(false) bool(false) bool(false) bool(false) Array -- Innerloop iteration 6 of Outerloop iteration 8 -- bool(false) bool(false) bool(false) bool(false) bool(false) Array -- Innerloop iteration 7 of Outerloop iteration 8 -- bool(false) bool(false) bool(false) bool(false) bool(false) Array -- Innerloop iteration 8 of Outerloop iteration 8 -- bool(false) bool(false) bool(false) bool(false) bool(false) Array -- Innerloop iteration 9 of Outerloop iteration 8 -- bool(false) bool(false) bool(false) bool(false) bool(false) Array -- Innerloop iteration 10 of Outerloop iteration 8 -- Strict Standards: Non-static method object_class::foo1() cannot be called statically in /var/work/php-5.2.4/ext/standard/tests/general_functions/is_callable.php on line 35 Strict Standards: Non-static method object_class::foo1() cannot be called statically in /var/work/php-5.2.4/ext/standard/tests/general_functions/is_callable.php on line 35 bool(true) Strict Standards: Non-static method object_class::foo1() cannot be called statically in /var/work/php-5.2.4/ext/standard/tests/general_functions/is_callable.php on line 36 bool(true) Strict Standards: Non-static method object_class::foo1() cannot be called statically in /var/work/php-5.2.4/ext/standard/tests/general_functions/is_callable.php on line 37 Strict Standards: Non-static method object_class::foo1() cannot be called statically in /var/work/php-5.2.4/ext/standard/tests/general_functions/is_callable.php on line 37 bool(true) Strict Standards: Non-static method object_class::foo1() cannot be called statically in /var/work/php-5.2.4/ext/standard/tests/general_functions/is_callable.php on line 38 bool(true) Strict Standards: Non-static method object_class::foo1() cannot be called statically in /var/work/php-5.2.4/ext/standard/tests/general_functions/is_callable.php on line 39 Strict Standards: Non-static method object_class::foo1() cannot be called statically in /var/work/php-5.2.4/ext/standard/tests/general_functions/is_callable.php on line 39 bool(true) object_class::foo1 *** Testing is_callable() on invalid function names *** -- Iteration 1 -- bool(false) bool(false) bool(false) bool(false) bool(false) -- Iteration 2 -- bool(false) bool(false) bool(false) bool(false) bool(false) 0 -- Iteration 3 -- bool(false) bool(false) bool(false) bool(false) bool(false) 1234567890 -- Iteration 4 -- bool(false) bool(false) bool(false) bool(false) bool(false) -100123456782 -- Iteration 5 -- bool(false) bool(false) bool(false) bool(false) bool(false) -2 -- Iteration 6 -- bool(false) bool(false) bool(false) bool(false) bool(false) 0.567 -- Iteration 7 -- bool(false) bool(false) bool(false) bool(false) bool(false) -- Iteration 8 -- bool(false) bool(false) bool(false) bool(false) bool(false) Array -- Iteration 9 -- bool(false) bool(false) bool(false) bool(false) bool(false) -- Iteration 10 -- bool(false) bool(false) bool(false) bool(false) bool(false) -- Iteration 11 -- bool(false) bool(false) bool(false) bool(false) bool(false) Resource id #5 *** Testing error conditions *** Warning: Wrong parameter count for is_callable() in /var/work/php-5.2.4/ext/standard/tests/general_functions/is_callable.php on line 228 NULL Warning: Wrong parameter count for is_callable() in /var/work/php-5.2.4/ext/standard/tests/general_functions/is_callable.php on line 230 NULL Done ================================================================================ 240+ 241+ Strict Standards: Non-static method object_class::foo1() cannot be called statically in /var/work/php-5.2.4/ext/standard/tests/general_functions/is_callable.php on line 35 240- bool(true) 245- bool(true) 246+ 247+ Strict Standards: Non-static method object_class::foo1() cannot be called statically in /var/work/php-5.2.4/ext/standard/tests/general_functions/is_callable.php on line 37 251+ 252+ Strict Standards: Non-static method object_class::foo1() cannot be called statically in /var/work/php-5.2.4/ext/standard/tests/general_functions/is_callable.php on line 38 253+ bool(true) 254+ 255+ Strict Standards: Non-static method object_class::foo1() cannot be called statically in /var/work/php-5.2.4/ext/standard/tests/general_functions/is_callable.php on line 39 256+ 257+ Strict Standards: Non-static method object_class::foo1() cannot be called statically in /var/work/php-5.2.4/ext/standard/tests/general_functions/is_callable.php on line 39 258+ bool(true) 317- bool(true) 322- bool(true) 327+ 328+ Strict Standards: Non-static method object_class::foo1() cannot be called statically in /var/work/php-5.2.4/ext/standard/tests/general_functions/is_callable.php on line 35 333+ 334+ Strict Standards: Non-static method object_class::foo1() cannot be called statically in /var/work/php-5.2.4/ext/standard/tests/general_functions/is_callable.php on line 37 338+ 339+ Strict Standards: Non-static method object_class::foo1() cannot be called statically in /var/work/php-5.2.4/ext/standard/tests/general_functions/is_callable.php on line 38 340+ bool(true) 341+ 342+ Strict Standards: Non-static method object_class::foo1() cannot be called statically in /var/work/php-5.2.4/ext/standard/tests/general_functions/is_callable.php on line 39 343+ 344+ Strict Standards: Non-static method object_class::foo1() cannot be called statically in /var/work/php-5.2.4/ext/standard/tests/general_functions/is_callable.php on line 39 345+ bool(true) 394- bool(true) 399- bool(true) 414+ 415+ Strict Standards: Non-static method object_class::foo1() cannot be called statically in /var/work/php-5.2.4/ext/standard/tests/general_functions/is_callable.php on line 35 420+ 421+ Strict Standards: Non-static method object_class::foo1() cannot be called statically in /var/work/php-5.2.4/ext/standard/tests/general_functions/is_callable.php on line 37 425+ 426+ Strict Standards: Non-static method object_class::foo1() cannot be called statically in /var/work/php-5.2.4/ext/standard/tests/general_functions/is_callable.php on line 38 427+ bool(true) 428+ 429+ Strict Standards: Non-static method object_class::foo1() cannot be called statically in /var/work/php-5.2.4/ext/standard/tests/general_functions/is_callable.php on line 39 430+ 431+ Strict Standards: Non-static method object_class::foo1() cannot be called statically in /var/work/php-5.2.4/ext/standard/tests/general_functions/is_callable.php on line 39 432+ bool(true) 471- bool(true) 476- bool(true) 501+ 502+ Strict Standards: Non-static method object_class::foo1() cannot be called statically in /var/work/php-5.2.4/ext/standard/tests/general_functions/is_callable.php on line 35 507+ 508+ Strict Standards: Non-static method object_class::foo1() cannot be called statically in /var/work/php-5.2.4/ext/standard/tests/general_functions/is_callable.php on line 37 512+ 513+ Strict Standards: Non-static method object_class::foo1() cannot be called statically in /var/work/php-5.2.4/ext/standard/tests/general_functions/is_callable.php on line 38 514+ bool(true) 515+ 516+ Strict Standards: Non-static method object_class::foo1() cannot be called statically in /var/work/php-5.2.4/ext/standard/tests/general_functions/is_callable.php on line 39 517+ 518+ Strict Standards: Non-static method object_class::foo1() cannot be called statically in /var/work/php-5.2.4/ext/standard/tests/general_functions/is_callable.php on line 39 519+ bool(true) 548- bool(true) 553- bool(true) 588+ 589+ Strict Standards: Non-static method object_class::foo1() cannot be called statically in /var/work/php-5.2.4/ext/standard/tests/general_functions/is_callable.php on line 35 594+ 595+ Strict Standards: Non-static method object_class::foo1() cannot be called statically in /var/work/php-5.2.4/ext/standard/tests/general_functions/is_callable.php on line 37 599+ 600+ Strict Standards: Non-static method object_class::foo1() cannot be called statically in /var/work/php-5.2.4/ext/standard/tests/general_functions/is_callable.php on line 38 601+ bool(true) 602+ 603+ Strict Standards: Non-static method object_class::foo1() cannot be called statically in /var/work/php-5.2.4/ext/standard/tests/general_functions/is_callable.php on line 39 604+ 605+ Strict Standards: Non-static method object_class::foo1() cannot be called statically in /var/work/php-5.2.4/ext/standard/tests/general_functions/is_callable.php on line 39 606+ bool(true) 625- bool(true) 630- bool(true) 675+ 676+ Strict Standards: Non-static method object_class::foo1() cannot be called statically in /var/work/php-5.2.4/ext/standard/tests/general_functions/is_callable.php on line 35 681+ 682+ Strict Standards: Non-static method object_class::foo1() cannot be called statically in /var/work/php-5.2.4/ext/standard/tests/general_functions/is_callable.php on line 37 686+ 687+ Strict Standards: Non-static method object_class::foo1() cannot be called statically in /var/work/php-5.2.4/ext/standard/tests/general_functions/is_callable.php on line 38 688+ bool(true) 689+ 690+ Strict Standards: Non-static method object_class::foo1() cannot be called statically in /var/work/php-5.2.4/ext/standard/tests/general_functions/is_callable.php on line 39 691+ 692+ Strict Standards: Non-static method object_class::foo1() cannot be called statically in /var/work/php-5.2.4/ext/standard/tests/general_functions/is_callable.php on line 39 693+ bool(true) 702- bool(true) 707- bool(true) 762+ 763+ Strict Standards: Non-static method object_class::foo1() cannot be called statically in /var/work/php-5.2.4/ext/standard/tests/general_functions/is_callable.php on line 35 768+ 769+ Strict Standards: Non-static method object_class::foo1() cannot be called statically in /var/work/php-5.2.4/ext/standard/tests/general_functions/is_callable.php on line 37 773+ 774+ Strict Standards: Non-static method object_class::foo1() cannot be called statically in /var/work/php-5.2.4/ext/standard/tests/general_functions/is_callable.php on line 38 775+ bool(true) 776+ 777+ Strict Standards: Non-static method object_class::foo1() cannot be called statically in /var/work/php-5.2.4/ext/standard/tests/general_functions/is_callable.php on line 39 778+ 779+ Strict Standards: Non-static method object_class::foo1() cannot be called statically in /var/work/php-5.2.4/ext/standard/tests/general_functions/is_callable.php on line 39 780+ bool(true) 779- bool(true) 784- bool(true) 849+ 850+ Strict Standards: Non-static method object_class::foo1() cannot be called statically in /var/work/php-5.2.4/ext/standard/tests/general_functions/is_callable.php on line 35 855+ 856+ Strict Standards: Non-static method object_class::foo1() cannot be called statically in /var/work/php-5.2.4/ext/standard/tests/general_functions/is_callable.php on line 37 860+ 861+ Strict Standards: Non-static method object_class::foo1() cannot be called statically in /var/work/php-5.2.4/ext/standard/tests/general_functions/is_callable.php on line 38 862+ bool(true) 863+ 864+ Strict Standards: Non-static method object_class::foo1() cannot be called statically in /var/work/php-5.2.4/ext/standard/tests/general_functions/is_callable.php on line 39 865+ 866+ Strict Standards: Non-static method object_class::foo1() cannot be called statically in /var/work/php-5.2.4/ext/standard/tests/general_functions/is_callable.php on line 39 867+ bool(true) ================================================================================ ================================================================================ /var/work/php-5.2.4/ext/standard/tests/general_functions/proc_open02.phpt ================================================================================ bool(true) array(8) { ["command"]=> string(28) "/usr/bin/nohup /bin/sleep 50" ["pid"]=> int(11144) ["running"]=> bool(true) ["signaled"]=> bool(false) ["stopped"]=> bool(false) ["exitcode"]=> int(-1) ["termsig"]=> int(0) ["stopsig"]=> int(0) } bool(true) array(8) { ["command"]=> string(28) "/usr/bin/nohup /bin/sleep 50" ["pid"]=> int(11144) ["running"]=> bool(false) ["signaled"]=> bool(false) ["stopped"]=> bool(false) ["exitcode"]=> int(-1) ["termsig"]=> int(0) ["stopsig"]=> int(0) } Done! ================================================================================ 029+ bool(false) 029- bool(true) 035+ int(0) 035- int(15) ================================================================================ ================================================================================ /var/work/php-5.2.4/ext/standard/tests/strings/htmlentities02.phpt (warn: possibly braindead libc) ================================================================================ string(24) "&frac14;&frac12;&frac34;" ================================================================================ 001+ string(24) "&frac14;&frac12;&frac34;" 001- string(20) "&OElig;&oelig;&Yuml;" ================================================================================ ================================================================================ /var/work/php-5.2.4/ext/standard/tests/strings/htmlentities04.phpt ================================================================================ string(42) "&iexcl;&cent;&iexcl;&pound;&iexcl;&curren;" ================================================================================ 001+ string(42) "&iexcl;&cent;&iexcl;&pound;&iexcl;&curren;" 001- string(6) "¡¢¡£¡¤" ================================================================================ ================================================================================ /var/work/php-5.2.4/ext/standard/tests/strings/htmlentities15.phpt ================================================================================ string(9) "ÒÏÓËÏÛÎÙÊ" string(63) "&Ograve;&Iuml;&Oacute;&Euml;&Iuml;&Ucirc;&Icirc;&Ugrave;&Ecirc;" ================================================================================ 002+ string(63) "&Ograve;&Iuml;&Oacute;&Euml;&Iuml;&Ucirc;&Icirc;&Ugrave;&Ecirc;" 002- string(63) "&#1088;&#1086;&#1089;&#1082;&#1086;&#1096;&#1085;&#1099;&#1081;" ================================================================================ ================================================================================ /var/work/php-5.2.4/ext/xml/tests/bug32001.phpt ================================================================================ libxml2 Version => 2.6.26 Encoding: UTF-8 XML Prologue: present Chunk size: all data at once BOM: not prepended array(3) { [0]=> string(128) "e38386e382b9e383883ae38386e382b9e3838831: 687474703a2f2f7777772e6578616d706c652e636f6d2fe38386e382b9e383882f, e38386e382b9e38388" [1]=> string(60) "e38386e382b9e383883ae38386e382b9e3838832: e38386e382b9e38388" [2]=> string(42) "e38386e382b9e383883ae38386e382b9e3838833: " } Encoding: UTF-8 XML Prologue: not present Chunk size: all data at once BOM: not prepended array(3) { [0]=> string(128) "e38386e382b9e383883ae38386e382b9e3838831: 687474703a2f2f7777772e6578616d706c652e636f6d2fe38386e382b9e383882f, e38386e382b9e38388" [1]=> string(60) "e38386e382b9e383883ae38386e382b9e3838832: e38386e382b9e38388" [2]=> string(42) "e38386e382b9e383883ae38386e382b9e3838833: " } Encoding: UTF-8 XML Prologue: present Chunk size: all data at once BOM: prepended array(3) { [0]=> string(128) "e38386e382b9e383883ae38386e382b9e3838831: 687474703a2f2f7777772e6578616d706c652e636f6d2fe38386e382b9e383882f, e38386e382b9e38388" [1]=> string(60) "e38386e382b9e383883ae38386e382b9e3838832: e38386e382b9e38388" [2]=> string(42) "e38386e382b9e383883ae38386e382b9e3838833: " } Encoding: UTF-8 XML Prologue: not present Chunk size: all data at once BOM: prepended array(3) { [0]=> string(128) "e38386e382b9e383883ae38386e382b9e3838831: 687474703a2f2f7777772e6578616d706c652e636f6d2fe38386e382b9e383882f, e38386e382b9e38388" [1]=> string(60) "e38386e382b9e383883ae38386e382b9e3838832: e38386e382b9e38388" [2]=> string(42) "e38386e382b9e383883ae38386e382b9e3838833: " } Encoding: UTF-16BE XML Prologue: present Chunk size: all data at once BOM: not prepended array(3) { [0]=> string(128) "e38386e382b9e383883ae38386e382b9e3838831: 687474703a2f2f7777772e6578616d706c652e636f6d2fe38386e382b9e383882f, e38386e382b9e38388" [1]=> string(60) "e38386e382b9e383883ae38386e382b9e3838832: e38386e382b9e38388" [2]=> string(42) "e38386e382b9e383883ae38386e382b9e3838833: " } Encoding: UTF-16BE XML Prologue: present Chunk size: all data at once BOM: prepended array(3) { [0]=> string(128) "e38386e382b9e383883ae38386e382b9e3838831: 687474703a2f2f7777772e6578616d706c652e636f6d2fe38386e382b9e383882f, e38386e382b9e38388" [1]=> string(60) "e38386e382b9e383883ae38386e382b9e3838832: e38386e382b9e38388" [2]=> string(42) "e38386e382b9e383883ae38386e382b9e3838833: " } Encoding: UTF-16BE XML Prologue: not present Chunk size: all data at once BOM: prepended array(3) { [0]=> string(128) "e38386e382b9e383883ae38386e382b9e3838831: 687474703a2f2f7777772e6578616d706c652e636f6d2fe38386e382b9e383882f, e38386e382b9e38388" [1]=> string(60) "e38386e382b9e383883ae38386e382b9e3838832: e38386e382b9e38388" [2]=> string(42) "e38386e382b9e383883ae38386e382b9e3838833: " } Encoding: UTF-16LE XML Prologue: present Chunk size: all data at once BOM: not prepended array(3) { [0]=> string(128) "e38386e382b9e383883ae38386e382b9e3838831: 687474703a2f2f7777772e6578616d706c652e636f6d2fe38386e382b9e383882f, e38386e382b9e38388" [1]=> string(60) "e38386e382b9e383883ae38386e382b9e3838832: e38386e382b9e38388" [2]=> string(42) "e38386e382b9e383883ae38386e382b9e3838833: " } Encoding: UTF-16LE XML Prologue: present Chunk size: all data at once BOM: prepended array(3) { [0]=> string(128) "e38386e382b9e383883ae38386e382b9e3838831: 687474703a2f2f7777772e6578616d706c652e636f6d2fe38386e382b9e383882f, e38386e382b9e38388" [1]=> string(60) "e38386e382b9e383883ae38386e382b9e3838832: e38386e382b9e38388" [2]=> string(42) "e38386e382b9e383883ae38386e382b9e3838833: " } Encoding: UTF-16LE XML Prologue: not present Chunk size: all data at once BOM: prepended array(3) { [0]=> string(128) "e38386e382b9e383883ae38386e382b9e3838831: 687474703a2f2f7777772e6578616d706c652e636f6d2fe38386e382b9e383882f, e38386e382b9e38388" [1]=> string(60) "e38386e382b9e383883ae38386e382b9e3838832: e38386e382b9e38388" [2]=> string(42) "e38386e382b9e383883ae38386e382b9e3838833: " } Encoding: UTF-8 XML Prologue: present Chunk size: 1 byte(s) BOM: not prepended array(3) { [0]=> string(128) "e38386e382b9e383883ae38386e382b9e3838831: 687474703a2f2f7777772e6578616d706c652e636f6d2fe38386e382b9e383882f, e38386e382b9e38388" [1]=> string(60) "e38386e382b9e383883ae38386e382b9e3838832: e38386e382b9e38388" [2]=> string(42) "e38386e382b9e383883ae38386e382b9e3838833: " } ================================================================================ 134- Encoding: UTF-8 135- XML Prologue: not present 136- Chunk size: 1 byte(s) 137- BOM: not prepended 138- array(3) { 139- [0]=> 140- string(128) "e38386e382b9e383883ae38386e382b9e3838831: 687474703a2f2f7777772e6578616d706c652e636f6d2fe38386e382b9e383882f, e38386e382b9e38388" 141- [1]=> 142- string(60) "e38386e382b9e383883ae38386e382b9e3838832: e38386e382b9e38388" 143- [2]=> 144- string(42) "e38386e382b9e383883ae38386e382b9e3838833: " 145- } 146- Encoding: UTF-8 147- XML Prologue: present 148- Chunk size: 1 byte(s) 149- BOM: prepended 150- array(3) { 151- [0]=> 152- string(128) "e38386e382b9e383883ae38386e382b9e3838831: 687474703a2f2f7777772e6578616d706c652e636f6d2fe38386e382b9e383882f, e38386e382b9e38388" 153- [1]=> 154- string(60) "e38386e382b9e383883ae38386e382b9e3838832: e38386e382b9e38388" 155- [2]=> 156- string(42) "e38386e382b9e383883ae38386e382b9e3838833: " 157- } 158- Encoding: UTF-8 159- XML Prologue: not present 160- Chunk size: 1 byte(s) 161- BOM: prepended 162- array(3) { 163- [0]=> 164- string(128) "e38386e382b9e383883ae38386e382b9e3838831: 687474703a2f2f7777772e6578616d706c652e636f6d2fe38386e382b9e383882f, e38386e382b9e38388" 165- [1]=> 166- string(60) "e38386e382b9e383883ae38386e382b9e3838832: e38386e382b9e38388" 167- [2]=> 168- string(42) "e38386e382b9e383883ae38386e382b9e3838833: " 169- } 170- Encoding: UTF-16BE 171- XML Prologue: present 172- Chunk size: 1 byte(s) 173- BOM: not prepended 174- array(3) { 175- [0]=> 176- string(128) "e38386e382b9e383883ae38386e382b9e3838831: 687474703a2f2f7777772e6578616d706c652e636f6d2fe38386e382b9e383882f, e38386e382b9e38388" 177- [1]=> 178- string(60) "e38386e382b9e383883ae38386e382b9e3838832: e38386e382b9e38388" 179- [2]=> 180- string(42) "e38386e382b9e383883ae38386e382b9e3838833: " 181- } 182- Encoding: UTF-16BE 183- XML Prologue: present 184- Chunk size: 1 byte(s) 185- BOM: prepended 186- array(3) { 187- [0]=> 188- string(128) "e38386e382b9e383883ae38386e382b9e3838831: 687474703a2f2f7777772e6578616d706c652e636f6d2fe38386e382b9e383882f, e38386e382b9e38388" 189- [1]=> 190- string(60) "e38386e382b9e383883ae38386e382b9e3838832: e38386e382b9e38388" 191- [2]=> 192- string(42) "e38386e382b9e383883ae38386e382b9e3838833: " 193- } 194- Encoding: UTF-16BE 195- XML Prologue: not present 196- Chunk size: 1 byte(s) 197- BOM: prepended 198- array(3) { 199- [0]=> 200- string(128) "e38386e382b9e383883ae38386e382b9e3838831: 687474703a2f2f7777772e6578616d706c652e636f6d2fe38386e382b9e383882f, e38386e382b9e38388" 201- [1]=> 202- string(60) "e38386e382b9e383883ae38386e382b9e3838832: e38386e382b9e38388" 203- [2]=> 204- string(42) "e38386e382b9e383883ae38386e382b9e3838833: " 205- } 206- Encoding: UTF-16LE 207- XML Prologue: present 208- Chunk size: 1 byte(s) 209- BOM: not prepended 210- array(3) { 211- [0]=> 212- string(128) "e38386e382b9e383883ae38386e382b9e3838831: 687474703a2f2f7777772e6578616d706c652e636f6d2fe38386e382b9e383882f, e38386e382b9e38388" 213- [1]=> 214- string(60) "e38386e382b9e383883ae38386e382b9e3838832: e38386e382b9e38388" 215- [2]=> 216- string(42) "e38386e382b9e383883ae38386e382b9e3838833: " 217- } 218- Encoding: UTF-16LE 219- XML Prologue: present 220- Chunk size: 1 byte(s) 221- BOM: prepended 222- array(3) { 223- [0]=> 224- string(128) "e38386e382b9e383883ae38386e382b9e3838831: 687474703a2f2f7777772e6578616d706c652e636f6d2fe38386e382b9e383882f, e38386e382b9e38388" 225- [1]=> 226- string(60) "e38386e382b9e383883ae38386e382b9e3838832: e38386e382b9e38388" 227- [2]=> 228- string(42) "e38386e382b9e383883ae38386e382b9e3838833: " 229- } 230- Encoding: UTF-16LE 231- XML Prologue: not present 232- Chunk size: 1 byte(s) 233- BOM: prepended 234- array(3) { 235- [0]=> 236- string(128) "e38386e382b9e383883ae38386e382b9e3838831: 687474703a2f2f7777772e6578616d706c652e636f6d2fe38386e382b9e383882f, e38386e382b9e38388" 237- [1]=> 238- string(60) "e38386e382b9e383883ae38386e382b9e3838832: e38386e382b9e38388" 239- [2]=> 240- string(42) "e38386e382b9e383883ae38386e382b9e3838833: " 241- } ================================================================================ ================================================================================ /var/work/php-5.2.4/sapi/cli/tests/015.phpt ================================================================================ PHP 5.2.4 (cli) (built: Oct 16 2007 16:27:15) PHP 5.2.4 (cli) (built: Oct 16 2007 16:27:15) Usage: php [options] [-f] <file> [--] [args...] Done ================================================================================ 002+ 003+ PHP 5.2.4 (cli) (built: Oct 16 2007 16:27:15) 004+ Usage: php [options] [-f] <file> [--] [args...] 005+ Done 002- Array 003- ( 004- [0] => - 005- [1] => foo 006- [2] => bar 007- [3] => baz 008- ) 009- 010- PHP %d.%d.%d%s(cli) (built: %s)%s 011- Usage: %s [options] [-f] <file> [--] [args...] 012- Done ================================================================================ ================================================================================ BUILD ENVIRONMENT ================================================================================ OS: Linux - Linux gtrk1.2n9soft.com 2.6.22.5 #2 SMP Fri Aug 24 17:12:00 KST 2007 i686 Autoconf: autoconf (GNU Autoconf) 2.59 Written by David J. MacKenzie and Akim Demaille. Copyright (C) 2003 Free Software Foundation, Inc. This is free software; see the source for copying conditions. There is NO warranty; not even for MERCHANTABILITY or FITNESS FOR A PARTICULAR PURPOSE. Bundled Libtool: ltmain.sh (GNU libtool) 1.5.20 (1.1220.2.287 2005/08/31 18:54:15) Copyright (C) 2005 Free Software Foundation, Inc. This is free software; see the source for copying conditions. There is NO warranty; not even for MERCHANTABILITY or FITNESS FOR A PARTICULAR PURPOSE. System Libtool: ltmain.sh (GNU libtool) 1.5.22 (1.1220.2.365 2005/12/18 22:14:06) Copyright (C) 2005 Free Software Foundation, Inc. This is free software; see the source for copying conditions. There is NO warranty; not even for MERCHANTABILITY or FITNESS FOR A PARTICULAR PURPOSE. Compiler: Using built-in specs. Target: i386-redhat-linux Configured with: ../configure --prefix=/usr --mandir=/usr/share/man --infodir=/usr/share/info --enable-shared --enable-threads=posix --enable-checking=release --with-system-zlib --enable-__cxa_atexit --disable-libunwind-exceptions --enable-libgcj-multifile --enable-languages=c,c++,objc,obj-c++,java,fortran,ada --enable-java-awt=gtk --disable-dssi --enable-plugin --with-java-home=/usr/lib/jvm/java-1.4.2-gcj-1.4.2.0/jre --with-cpu=generic --host=i386-redhat-linux Thread model: posix gcc version 4.1.1 20070105 (Red Hat 4.1.1-52) Bison: bison (GNU Bison) 2.3 Written by Robert Corbett and Richard Stallman. Copyright (C) 2006 Free Software Foundation, Inc. This is free software; see the source for copying conditions. There is NO warranty; not even for MERCHANTABILITY or FITNESS FOR A PARTICULAR PURPOSE. Libraries: linux-gate.so.1 => (0xffffe000) libcrypt.so.1 => /lib/libcrypt.so.1 (0x008bd000) librt.so.1 => /lib/librt.so.1 (0x00793000) libmysqlclient.so.15 => /usr/local/mysql-5.0.45/lib/mysql/libmysqlclient.so.15 (0x4000b000) libm.so.6 => /lib/libm.so.6 (0x0074b000) libz.so.1 => /usr/lib/libz.so.1 (0x007a7000) libiconv.so.2 => /usr/local/iconv/lib/libiconv.so.2 (0x4006f000) libresolv.so.2 => /lib/libresolv.so.2 (0x00a00000) libdl.so.2 => /lib/libdl.so.2 (0x00774000) libnsl.so.1 => /lib/libnsl.so.1 (0x008ed000) libxml2.so.2 => /usr/lib/libxml2.so.2 (0x002dc000) libc.so.6 => /lib/libc.so.6 (0x0060c000) libpthread.so.0 => /lib/libpthread.so.0 (0x0077a000) /lib/ld-linux.so.2 (0x005ea000) User's E-mail: ================================================================================ PHPINFO ================================================================================ phpinfo() PHP Version => 5.2.4 System => Linux gtrk1.2n9soft.com 2.6.22.5 #2 SMP Fri Aug 24 17:12:00 KST 2007 i686 Build Date => Oct 16 2007 16:25:45 Configure Command => './configure' '--with-config-file-path=/usr/local/apache' '--with-mysql=/usr/local/mysql' '--with-iconv=/usr/local/iconv' '--with-apache=../apache_1.3.39' '--with-zlib' '--enable-shared' '--enable-cli' '--enable-mbstring=all' '--disable-debug' '--exec-prefix=/usr/local' '--enable-sigchild' Server API => Command Line Interface Virtual Directory Support => disabled Configuration File (php.ini) Path => /usr/local/apache Loaded Configuration File => /usr/local/Zend/etc/php.ini PHP API => 20041225 PHP Extension => 20060613 Zend Extension => 220060519 Debug Build => no Thread Safety => disabled Zend Memory Manager => enabled IPv6 Support => enabled Registered PHP Streams => php, file, data, http, ftp, compress.zlib Registered Stream Socket Transports => tcp, udp, unix, udg Registered Stream Filters => string.rot13, string.toupper, string.tolower, string.strip_tags, convert.*, consumed, convert.iconv.*, zlib.* This program makes use of the Zend Scripting Language Engine: Zend Engine v2.2.0, Copyright (c) 1998-2007 Zend Technologies with Zend Extension Manager v1.2.2, Copyright (c) 2003-2007, by Zend Technologies with Zend Optimizer v3.3.0, Copyright (c) 1998-2007, by Zend Technologies _______________________________________________________________________ Configuration PHP Core Directive => Local Value => Master Value allow_call_time_pass_reference => On => On allow_url_fopen => On => On allow_url_include => Off => Off always_populate_raw_post_data => Off => Off arg_separator.input => & => & arg_separator.output => & => & asp_tags => Off => Off auto_append_file => no value => no value auto_globals_jit => On => On auto_prepend_file => no value => no value browscap => no value => no value default_charset => no value => no value default_mimetype => text/html => text/html define_syslog_variables => Off => Off disable_classes => no value => no value disable_functions => no value => no value display_errors => STDOUT => STDOUT display_startup_errors => Off => Off doc_root => no value => no value docref_ext => no value => no value docref_root => no value => no value enable_dl => On => On error_append_string => no value => no value error_log => no value => no value error_prepend_string => no value => no value error_reporting => 6135 => 6135 expose_php => Off => Off extension_dir => /usr/local/lib/php => /usr/local/lib/php file_uploads => Off => Off highlight.bg => <font style="color: #FFFFFF">#FFFFFF</font> => <font style="color: #FFFFFF">#FFFFFF</font> highlight.comment => <font style="color: #FF8000">#FF8000</font> => <font style="color: #FF8000">#FF8000</font> highlight.default => <font style="color: #0000BB">#0000BB</font> => <font style="color: #0000BB">#0000BB</font> highlight.html => <font style="color: #000000">#000000</font> => <font style="color: #000000">#000000</font> highlight.keyword => <font style="color: #007700">#007700</font> => <font style="color: #007700">#007700</font> highlight.string => <font style="color: #DD0000">#DD0000</font> => <font style="color: #DD0000">#DD0000</font> html_errors => Off => Off ignore_repeated_errors => Off => Off ignore_repeated_source => Off => Off ignore_user_abort => Off => Off implicit_flush => On => On include_path => .:/usr/local/lib/php => .:/usr/local/lib/php log_errors => Off => Off log_errors_max_len => 1024 => 1024 magic_quotes_gpc => On => On magic_quotes_runtime => Off => Off magic_quotes_sybase => Off => Off mail.force_extra_parameters => no value => no value max_execution_time => 0 => 0 max_input_nesting_level => 64 => 64 max_input_time => -1 => -1 memory_limit => 32M => 32M open_basedir => no value => no value output_buffering => 0 => 0 output_handler => no value => no value post_max_size => 30M => 30M precision => 12 => 12 realpath_cache_size => 16K => 16K realpath_cache_ttl => 120 => 120 register_argc_argv => On => On register_globals => On => On register_long_arrays => On => On report_memleaks => On => On report_zend_debug => Off => Off safe_mode => Off => Off safe_mode_exec_dir => no value => no value safe_mode_gid => Off => Off safe_mode_include_dir => no value => no value sendmail_from => no value => no value sendmail_path => /usr/sbin/sendmail -t -i => /usr/sbin/sendmail -t -i serialize_precision => 100 => 100 short_open_tag => On => On SMTP => localhost => localhost smtp_port => 25 => 25 sql.safe_mode => Off => Off track_errors => Off => Off unserialize_callback_func => no value => no value upload_max_filesize => 2M => 2M upload_tmp_dir => no value => no value user_dir => no value => no value variables_order => EGPCS => EGPCS xmlrpc_error_number => 0 => 0 xmlrpc_errors => Off => Off y2k_compliance => On => On zend.ze1_compatibility_mode => Off => Off ctype ctype functions => enabled date date/time support => enabled "Olson" Timezone Database Version => 2007.6 Timezone Database => internal Default timezone => Asia/Seoul Directive => Local Value => Master Value date.default_latitude => 31.7667 => 31.7667 date.default_longitude => 35.2333 => 35.2333 date.sunrise_zenith => 90.583333 => 90.583333 date.sunset_zenith => 90.583333 => 90.583333 date.timezone => no value => no value dom DOM/XML => enabled DOM/XML API Version => 20031129 libxml Version => 2.6.26 HTML Support => enabled XPath Support => enabled XPointer Support => enabled Schema Support => enabled RelaxNG Support => enabled filter Input Validation and Filtering => enabled Revision => $Revision: 1.52.2.39 $ Directive => Local Value => Master Value filter.default => unsafe_raw => unsafe_raw filter.default_flags => no value => no value hash hash support => enabled Hashing Engines => md2 md4 md5 sha1 sha256 sha384 sha512 ripemd128 ripemd160 ripemd256 ripemd320 whirlpool tiger128,3 tiger160,3 tiger192,3 tiger128,4 tiger160,4 tiger192,4 snefru gost adler32 crc32 crc32b haval128,3 haval160,3 haval192,3 haval224,3 haval256,3 haval128,4 haval160,4 haval192,4 haval224,4 haval256,4 haval128,5 haval160,5 haval192,5 haval224,5 haval256,5 iconv iconv support => enabled iconv implementation => glibc iconv library version => 1.11 Directive => Local Value => Master Value iconv.input_encoding => ISO-8859-1 => ISO-8859-1 iconv.internal_encoding => ISO-8859-1 => ISO-8859-1 iconv.output_encoding => ISO-8859-1 => ISO-8859-1 json json support => enabled json version => 1.2.1 libxml libXML support => active libXML Version => 2.6.26 libXML streams => enabled mbstring Multibyte Support => enabled Multibyte string engine => libmbfl Multibyte (japanese) regex support => enabled Multibyte regex (oniguruma) version => 4.4.4 Multibyte regex (oniguruma) backtrack check => On mbstring extension makes use of "streamable kanji code filter and converter", which is distributed under the GNU Lesser General Public License version 2.1. Directive => Local Value => Master Value mbstring.detect_order => no value => no value mbstring.encoding_translation => Off => Off mbstring.func_overload => 0 => 0 mbstring.http_input => pass => pass mbstring.http_output => pass => pass mbstring.internal_encoding => ISO-8859-1 => no value mbstring.language => neutral => neutral mbstring.strict_detection => Off => Off mbstring.substitute_character => no value => no value mysql MySQL Support => enabled Active Persistent Links => 0 Active Links => 0 Client API version => 5.0.45 MYSQL_MODULE_TYPE => external MYSQL_SOCKET => /tmp/mysql.sock MYSQL_INCLUDE => -I/usr/local/mysql/include/mysql MYSQL_LIBS => -L/usr/local/mysql/lib/mysql -lmysqlclient Directive => Local Value => Master Value mysql.allow_persistent => Off => Off mysql.connect_timeout => 60 => 60 mysql.default_host => no value => no value mysql.default_password => no value => no value mysql.default_port => no value => no value mysql.default_socket => /tmp/mysql.sock => /tmp/mysql.sock mysql.default_user => no value => no value mysql.max_links => Unlimited => Unlimited mysql.max_persistent => Unlimited => Unlimited mysql.trace_mode => Off => Off pcre PCRE (Perl Compatible Regular Expressions) Support => enabled PCRE Library Version => 7.2 2007-06-19 Directive => Local Value => Master Value pcre.backtrack_limit => 100000 => 100000 pcre.recursion_limit => 100000 => 100000 PDO PDO support => enabled PDO drivers => sqlite2, sqlite pdo_sqlite PDO Driver for SQLite 3.x => enabled PECL Module version => (bundled) 1.0.1 $Id: pdo_sqlite.c,v 1.10.2.6.2.2 2007/03/23 14:30:00 wez Exp $ SQLite Library => 3.3.17 posix Revision => $Revision: 1.70.2.3.2.16 $ Reflection Reflection => enabled Version => $Id: php_reflection.c,v 1.164.2.33.2.45 2007/08/20 17:01:22 sebastian Exp $ session Session Support => enabled Registered save handlers => files user sqlite Registered serializer handlers => php php_binary Directive => Local Value => Master Value session.auto_start => Off => Off session.bug_compat_42 => On => On session.bug_compat_warn => On => On session.cache_expire => 180 => 180 session.cache_limiter => nocache => nocache session.cookie_domain => no value => no value session.cookie_httponly => Off => Off session.cookie_lifetime => 0 => 0 session.cookie_path => / => / session.cookie_secure => Off => Off session.entropy_file => no value => no value session.entropy_length => 0 => 0 session.gc_divisor => 100 => 100 session.gc_maxlifetime => 1440 => 1440 session.gc_probability => 1 => 1 session.hash_bits_per_character => 4 => 4 session.hash_function => 0 => 0 session.name => TSPSESSIONID => TSPSESSIONID session.referer_check => no value => no value session.save_handler => files => files session.save_path => /tmp => /tmp session.serialize_handler => php => php session.use_cookies => On => On session.use_only_cookies => Off => Off session.use_trans_sid => 0 => 0 SimpleXML Simplexml support => enabled Revision => $Revision: 1.151.2.22.2.35 $ Schema support => enabled SPL SPL support => enabled Interfaces => Countable, OuterIterator, RecursiveIterator, SeekableIterator, SplObserver, SplSubject Classes => AppendIterator, ArrayIterator, ArrayObject, BadFunctionCallException, BadMethodCallException, CachingIterator, DirectoryIterator, DomainException, EmptyIterator, FilterIterator, InfiniteIterator, InvalidArgumentException, IteratorIterator, LengthException, LimitIterator, LogicException, NoRewindIterator, OutOfBoundsException, OutOfRangeException, OverflowException, ParentIterator, RangeException, RecursiveArrayIterator, RecursiveCachingIterator, RecursiveDirectoryIterator, RecursiveFilterIterator, RecursiveIteratorIterator, RecursiveRegexIterator, RegexIterator, RuntimeException, SimpleXMLIterator, SplFileInfo, SplFileObject, SplObjectStorage, SplTempFileObject, UnderflowException, UnexpectedValueException SQLite SQLite support => enabled PECL Module version => 2.0-dev $Id: sqlite.c,v 1.166.2.13.2.9 2007/05/19 17:58:22 iliaa Exp $ SQLite Library => 2.8.17 SQLite Encoding => iso8859 Directive => Local Value => Master Value sqlite.assoc_case => 0 => 0 standard Regex Library => Bundled library enabled Dynamic Library Support => enabled Path to sendmail => /usr/sbin/sendmail -t -i Directive => Local Value => Master Value assert.active => 1 => 1 assert.bail => 0 => 0 assert.callback => no value => no value assert.quiet_eval => 0 => 0 assert.warning => 1 => 1 auto_detect_line_endings => 0 => 0 default_socket_timeout => 60 => 60 safe_mode_allowed_env_vars => PHP_ => PHP_ safe_mode_protected_env_vars => LD_LIBRARY_PATH => LD_LIBRARY_PATH url_rewriter.tags => a=href,area=href,frame=src,input=src,form=,fieldset= => a=href,area=href,frame=src,input=src,form=,fieldset= user_agent => no value => no value tokenizer Tokenizer Support => enabled xml XML Support => active XML Namespace Support => active libxml2 Version => 2.6.26 xmlreader XMLReader => enabled xmlwriter XMLWriter => enabled Zend Optimizer Optimization Pass 1 => enabled Optimization Pass 2 => enabled Optimization Pass 3 => enabled Optimization Pass 4 => enabled Optimization Pass 9 => enabled Zend Loader => enabled License Path => Obfuscation level => 3 zlib ZLib Support => enabled Stream Wrapper support => compress.zlib:// Stream Filter support => zlib.inflate, zlib.deflate Compiled Version => 1.2.3 Linked Version => 1.2.3 Directive => Local Value => Master Value zlib.output_compression => Off => Off zlib.output_compression_level => -1 => -1 zlib.output_handler => no value => no value Additional Modules Module Name Environment Variable => Value HOSTNAME => gtrk1.2n9soft.com TEST_PHP_SRCDIR => /var/work/php-5.2.4 SHELL => /bin/bash TERM => xterm MAKEFLAGS => HISTSIZE => 1000 SSH_CLIENT => deleted SSH_TTY => deleted USER => root LS_COLORS => no=00:fi=00:di=00;34:ln=00;36:pi=40;33:so=00;35:bd=40;33;01:cd=40;33;01:or=01;05;37;41:mi=01;05;37;41:ex=00;32:*.cmd=00;32:*.exe=00;32:*.com=00;32:*.btm=00;32:*.bat=00;32:*.sh=00;32:*.csh=00;32:*.tar=00;31:*.tgz=00;31:*.arj=00;31:*.taz=00;31:*.lzh=00;31:*.zip=00;31:*.z=00;31:*.Z=00;31:*.gz=00;31:*.bz2=00;31:*.bz=00;31:*.tz=00;31:*.rpm=00;31:*.cpio=00;31:*.jpg=00;35:*.gif=00;35:*.bmp=00;35:*.xbm=00;35:*.xpm=00;35:*.png=00;35:*.tif=00;35: SSH_AUTH_SOCK => deleted MAKELEVEL => 1 MFLAGS => PATH => /usr/kerberos/sbin:/usr/kerberos/bin:/usr/local/sbin:/usr/local/bin:/sbin:/bin:/usr/sbin:/usr/bin:/usr/local/mysql/bin:/root/bin MAIL => /var/spool/mail/root _ => /var/work/php-5.2.4/sapi/cli/php PWD => /var/work/php-5.2.4 INPUTRC => /etc/inputrc LANG => ko_KR.UTF-8 TEST_PHP_EXECUTABLE => /var/work/php-5.2.4/sapi/cli/php HOME => /root SHLVL => 3 LOGNAME => root CVS_RSH => ssh SSH_CONNECTION => deleted LESSOPEN => |/usr/bin/lesspipe.sh %s CC => gcc G_BROKEN_FILENAMES => 1 PHP Variables Variable => Value PHP_SELF => _SERVER["HOSTNAME"] => gtrk1.2n9soft.com _SERVER["TEST_PHP_SRCDIR"] => /var/work/php-5.2.4 _SERVER["SHELL"] => /bin/bash _SERVER["TERM"] => xterm _SERVER["MAKEFLAGS"] => _SERVER["HISTSIZE"] => 1000 _SERVER["SSH_CLIENT"] => deleted _SERVER["SSH_TTY"] => deleted _SERVER["USER"] => root _SERVER["LS_COLORS"] => no=00:fi=00:di=00;34:ln=00;36:pi=40;33:so=00;35:bd=40;33;01:cd=40;33;01:or=01;05;37;41:mi=01;05;37;41:ex=00;32:*.cmd=00;32:*.exe=00;32:*.com=00;32:*.btm=00;32:*.bat=00;32:*.sh=00;32:*.csh=00;32:*.tar=00;31:*.tgz=00;31:*.arj=00;31:*.taz=00;31:*.lzh=00;31:*.zip=00;31:*.z=00;31:*.Z=00;31:*.gz=00;31:*.bz2=00;31:*.bz=00;31:*.tz=00;31:*.rpm=00;31:*.cpio=00;31:*.jpg=00;35:*.gif=00;35:*.bmp=00;35:*.xbm=00;35:*.xpm=00;35:*.png=00;35:*.tif=00;35: _SERVER["SSH_AUTH_SOCK"] => deleted _SERVER["MAKELEVEL"] => 1 _SERVER["MFLAGS"] => _SERVER["PATH"] => /usr/kerberos/sbin:/usr/kerberos/bin:/usr/local/sbin:/usr/local/bin:/sbin:/bin:/usr/sbin:/usr/bin:/usr/local/mysql/bin:/root/bin _SERVER["MAIL"] => /var/spool/mail/root _SERVER["_"] => /var/work/php-5.2.4/sapi/cli/php _SERVER["PWD"] => /var/work/php-5.2.4 _SERVER["INPUTRC"] => /etc/inputrc _SERVER["LANG"] => ko_KR.UTF-8 _SERVER["TEST_PHP_EXECUTABLE"] => /var/work/php-5.2.4/sapi/cli/php _SERVER["HOME"] => /root _SERVER["SHLVL"] => 3 _SERVER["LOGNAME"] => root _SERVER["CVS_RSH"] => ssh _SERVER["SSH_CONNECTION"] => deleted _SERVER["LESSOPEN"] => |/usr/bin/lesspipe.sh %s _SERVER["CC"] => gcc _SERVER["G_BROKEN_FILENAMES"] => 1 _SERVER["PHP_SELF"] => _SERVER["SCRIPT_NAME"] => _SERVER["SCRIPT_FILENAME"] => _SERVER["PATH_TRANSLATED"] => _SERVER["DOCUMENT_ROOT"] => _SERVER["REQUEST_TIME"] => 1192519916 _SERVER["argv"] => Array ( ) _SERVER["argc"] => 0 _ENV["HOSTNAME"] => gtrk1.2n9soft.com _ENV["TEST_PHP_SRCDIR"] => /var/work/php-5.2.4 _ENV["SHELL"] => /bin/bash _ENV["TERM"] => xterm _ENV["MAKEFLAGS"] => _ENV["HISTSIZE"] => 1000 _ENV["SSH_CLIENT"] => deleted _ENV["SSH_TTY"] => deleted _ENV["USER"] => root _ENV["LS_COLORS"] => no=00:fi=00:di=00;34:ln=00;36:pi=40;33:so=00;35:bd=40;33;01:cd=40;33;01:or=01;05;37;41:mi=01;05;37;41:ex=00;32:*.cmd=00;32:*.exe=00;32:*.com=00;32:*.btm=00;32:*.bat=00;32:*.sh=00;32:*.csh=00;32:*.tar=00;31:*.tgz=00;31:*.arj=00;31:*.taz=00;31:*.lzh=00;31:*.zip=00;31:*.z=00;31:*.Z=00;31:*.gz=00;31:*.bz2=00;31:*.bz=00;31:*.tz=00;31:*.rpm=00;31:*.cpio=00;31:*.jpg=00;35:*.gif=00;35:*.bmp=00;35:*.xbm=00;35:*.xpm=00;35:*.png=00;35:*.tif=00;35: _ENV["SSH_AUTH_SOCK"] => deleted _ENV["MAKELEVEL"] => 1 _ENV["MFLAGS"] => _ENV["PATH"] => /usr/kerberos/sbin:/usr/kerberos/bin:/usr/local/sbin:/usr/local/bin:/sbin:/bin:/usr/sbin:/usr/bin:/usr/local/mysql/bin:/root/bin _ENV["MAIL"] => /var/spool/mail/root _ENV["_"] => /var/work/php-5.2.4/sapi/cli/php _ENV["PWD"] => /var/work/php-5.2.4 _ENV["INPUTRC"] => /etc/inputrc _ENV["LANG"] => ko_KR.UTF-8 _ENV["TEST_PHP_EXECUTABLE"] => /var/work/php-5.2.4/sapi/cli/php _ENV["HOME"] => /root _ENV["SHLVL"] => 3 _ENV["LOGNAME"] => root _ENV["CVS_RSH"] => ssh _ENV["SSH_CONNECTION"] => deleted _ENV["LESSOPEN"] => |/usr/bin/lesspipe.sh %s _ENV["CC"] => gcc _ENV["G_BROKEN_FILENAMES"] => 1 PHP License This program is free software; you can redistribute it and/or modify it under the terms of the PHP License as published by the PHP Group and included in the distribution in the file: LICENSE This program is distributed in the hope that it will be useful, but WITHOUT ANY WARRANTY; without even the implied warranty of MERCHANTABILITY or FITNESS FOR A PARTICULAR PURPOSE. If you did not receive a copy of the PHP license, or have any questions about PHP licensing, please contact license@php.net.

« previous php.qa (#50637) next »