PHP Test results

From: Date: Mon, 15 Apr 2002 08:19:05 +0000
Subject: PHP Test results
Groups: php.qa 
Request: Send a blank email to php-qa+get-5103@lists.php.net to get a copy of this message
array ( 'user_name' => 'Mark Lee', 'email' => 'maltg85@users.sf.net', 'package' => '4.2.0-RC4', 'testcase' => '0', 'status' => 'Fail', 'os' => 'Linux i386', 'sapi' => 'cgi', 'automake' => '1.4', 'autoconf' => '2.1.3', 'libtool' => '1.4.0', 'bison' => '1.2.8', 'bcmath' => 'on', 'bz2' => 'on', 'calendar' => 'on', 'ctype' => 'on', 'curl' => 'on', 'dba' => 'on', 'domxml' => 'on', 'ftp' => 'on', 'gd' => 'on', 'gettext' => 'on', 'gmp' => 'on', 'imap' => 'on', 'java' => 'on', 'mcrypt' => 'on', 'mhash' => 'on', 'ming' => 'on', 'mysql' => 'on', 'ncurses' => 'on', 'openssl' => 'on', 'pcre' => 'on', 'pdf' => 'on', 'posix' => 'on', 'pspell' => 'on', 'session' => 'on', 'sockets' => 'on', 'standard' => 'on', 'tokenizer' => 'on', 'wddx' => 'on', 'xml' => 'on', 'xmlrpc' => 'on', 'xslt' => 'on', 'zip' => 'on', 'zlib' => 'on', 'test' => 'n/a', 'problems' => 'Making all in . make[1]: Entering directory `/home/maltg85/Downloads/build/php-4.2.0RC4\' gcc -I. -I/home/maltg85/Downloads/build/php-4.2.0RC4/ -I/home/maltg85/Downloads/build/php-4.2.0RC4/main -I/home/maltg85/Downloads/build/php-4.2.0RC4 -I/home/maltg85/Downloads/build/php-4.2.0RC4/Zend -I/usr/include/libxml2 -I/usr/include/freetype2/freetype -I/usr/local/include/imap -I/usr/local/include -I/usr/include/mysql -I/usr/include/pspell -I/home/maltg85/Downloads/build/php-4.2.0RC4/ext/xmlrpc/libxmlrpc -I/home/maltg85/Downloads/build/php-4.2.0RC4/TSRM -I. -I/usr/local/include -c stub.c && touch stub.lo /bin/sh /home/maltg85/Downloads/build/php-4.2.0RC4/libtool --silent --mode=link gcc -I. -I/home/maltg85/Downloads/build/php-4.2.0RC4/ -I/home/maltg85/Downloads/build/php-4.2.0RC4/main -I/home/maltg85/Downloads/build/php-4.2.0RC4 -I/home/maltg85/Downloads/build/php-4.2.0RC4/Zend -I/usr/include/libxml2 -I/usr/include/freetype2/freetype -I/usr/local/include/imap -I/usr/local/include -I/usr/include/mysql -I/usr/include/pspell -I/home/maltg85/Downloads/build/php-4.2.0RC4/ext/xmlrpc/libxmlrpc -I/home/maltg85/Downloads/build/php-4.2.0RC4/TSRM -I. -I/usr/local/include -prefer-non-pic -static -L/usr/local/lib -o libphp4.la -rpath /home/maltg85/Downloads/build/php-4.2.0RC4/libs -L/usr/X11R6//lib -L/usr/local/java/./jre/lib/i386/hotspot -L/usr/local/java/./jre/lib/i386/classic -L/usr/local/java/./jre/lib/i386/server -L/usr/local/java/./jre/lib/i386/native_threads -L/usr/local/java/./jre/lib/i386 -L/lib -L/usr/local/lib -L/usr/local/lib -R /usr/X11R6//lib -R /usr/local/java/./jre/lib/i386/hotspot -R /usr/local/java/./jre/lib/i386/classic -R /usr/local/java/./jre/lib/i386/server -R /usr/local/java/./jre/lib/i386/native_threads -R /usr/local/java/./jre/lib/i386 -R /lib -R /usr/local/lib stub.lo Zend/libZend.la sapi/cgi/libsapi.la main/libmain.la regex/libregex.la /home/maltg85/Downloads/build/php-4.2.0RC4/ext/calendar/libcalendar.la /home/maltg85/Downloads/build/php-4.2.0RC4/ext/ftp/libftp.la /home/maltg85/Downloads/build/php-4.2.0RC4/ext/openssl/libopenssl.la /home/maltg85/Downloads/build/php-4.2.0RC4/ext/posix/libposix.la /home/maltg85/Downloads/build/php-4.2.0RC4/ext/session/libsession.la /home/maltg85/Downloads/build/php-4.2.0RC4/ext/standard/libstandard.la /home/maltg85/Downloads/build/php-4.2.0RC4/ext/xml/libxml.la /home/maltg85/Downloads/build/php-4.2.0RC4/ext/xmlrpc/libxmlrpc.la /home/maltg85/Downloads/build/php-4.2.0RC4/ext/xslt/libxslt.la TSRM/libtsrm.la -lpam -lsablot -lexpat -lexpat -lexpat -lexpat -lexpat -lpdf -lz -ltiff -lpng -ljpeg -ljava -lcrypt -lpam -lgmp -lgd -lfreetype -lX11 -lXpm -lpng -lz -ljpeg -lcrypt -lssl -lcrypto -lresolv -lm -ldl -lnsl -lresolv -lcrypt -ldl /bin/sh /home/maltg85/Downloads/build/php-4.2.0RC4/libtool --silent --mode=link gcc -I. -I/home/maltg85/Downloads/build/php-4.2.0RC4/ -I/home/maltg85/Downloads/build/php-4.2.0RC4/main -I/home/maltg85/Downloads/build/php-4.2.0RC4 -I/home/maltg85/Downloads/build/php-4.2.0RC4/Zend -I/usr/include/libxml2 -I/usr/include/freetype2/freetype -I/usr/local/include/imap -I/usr/local/include -I/usr/include/mysql -I/usr/include/pspell -I/home/maltg85/Downloads/build/php-4.2.0RC4/ext/xmlrpc/libxmlrpc -I/home/maltg85/Downloads/build/php-4.2.0RC4/TSRM -I. -I/usr/local/include -L/usr/local/lib -o php -export-dynamic stub.lo libphp4.la ./.libs/libphp4.a(SAPI.o): In function `sapi_add_header_ex\': SAPI.o(.text+0xd1c): undefined reference to `php_pcre_replace\' SAPI.o(.text+0xd73): undefined reference to `php_pcre_replace\' collect2: ld returned 1 exit status make[1]: *** [php] Error 1 make[1]: Leaving directory `/home/maltg85/Downloads/build/php-4.2.0RC4\' make: *** [all-recursive] Error 1 ', 'bugids' => '', 'remarks' => './configure --prefix=/usr/local --with-config-file-path=/usr/local/etc \\ --with-openssl=shared,/usr --with-zlib-dir=/usr --with-zlib=shared \\ --enable-bcmath=shared --with-bz2=shared --enable-calendar --enable-ctype=shared --enable-tokenizer=shared \\ --with-curl=shared --enable-dba=shared --with-gdbm --with-dom=shared --enable-ftp --with-tiff-dir \\ --with-gd=shared,/usr --with-jpeg-dir=/usr --with-png-dir=/usr --with-xpm-dir=/usr/X11R6/ --with-ttf \\ --with-freetype-dir --with-gettext=shared --with-gmp=shared --with-ming=shared,/usr/local --with-mysql=shared,/usr \\ --with-ncurses=shared --with-pdflib=shared,/usr/local --enable-trans-sid --enable-sockets=shared --enable-wddx=shared \\ --with-regex=php --with-expat-dir=/usr --with-xmlrpc=shared --enable-xslt=shared --enable-xml=shared \\ --with-xslt-sablot --with-zip=shared --enable-inline-optimization --with-imap=shared --with-imap-ssl=/usr/local \\ --with-pspell=shared --with-pcre-regex=shared,/usr --with-mcrypt=shared --with-mhash=shared --with-java=/usr/local/java \\ --enable-sessions=shared (...yeah, I know that some of those extensions can\'t be created into shared modules, but it\'s wishful thinking.) FYI, the PCRE lib is the latest for mandrake from rpmfind.net, and RC3 compiled with the same configure line(s) without any errors. Perhaps configure forgot to add -lpcre to its list of libs? In addition, configuring with \"--with-mm=shared\" with RCs2-4 (didn\'t get RC1) gives this error during make: gcc -I. -I/home/maltg85/Downloads/build/php-4.2.0RC4/main -I/home/maltg85/Downloads/build/php-4.2.0RC4/main -I/home/maltg85/Downloads/build/php-4.2.0RC4 -I/home/maltg85/Downloads/build/php-4.2.0RC4/Zend -I/usr/include/libxml2 -I/usr/include/freetype2/freetype -I/usr/local/include/imap -I/usr/local/include -I/usr/include/mysql -I/usr/include/pspell -I/home/maltg85/Downloads/build/php-4.2.0RC4/ext/xmlrpc/libxmlrpc -I/home/maltg85/Downloads/build/php-4.2.0RC4/TSRM -I. -I/usr/local/include -c internal_functions.c && touch internal_functions.lo internal_functions.c:51: `phpext_ps_mm_ptr\' undeclared here (not in a function) internal_functions.c:51: initializer element is not constant internal_functions.c:51: (near initialization for `php_builtin_extensions[8]\') make[2]: *** [internal_functions.lo] Error 1 Don\'t know exactly if that\'s happened for awhile or not, but the last time I compiled a PHP version < 4.2.0 (4.1.0RC3) it worked.', )

« previous php.qa (#5103) next »