PHP Test results

From: Date: Tue, 16 Apr 2002 03:34:43 +0000
Subject: PHP Test results
Groups: php.qa 
Request: Send a blank email to php-qa+get-5127@lists.php.net to get a copy of this message
array ( 'user_name' => 'Mauricio Zambrano', 'email' => 'mauro@arcadia.inf.udec.cl', 'package' => '4.2.0-RC4', 'testcase' => '0', 'status' => 'Fail', 'os' => 'Linux i386', 'sapi' => 'Apache 2.x DSO', 'automake' => '1.4', 'autoconf' => '2.1.3', 'libtool' => '1.4.0', 'bison' => '1.2.8', 'bz2' => 'on', 'calendar' => 'on', 'db' => 'on', 'ftp' => 'on', 'gd' => 'on', 'imap' => 'on', 'java' => 'on', 'ldap' => 'on', 'mhash' => 'on', 'mysql' => 'on', 'oci8' => 'on', 'odbc' => 'on', 'openssl' => 'on', 'oracle' => 'on', 'pcre' => 'on', 'pdf' => 'on', 'pgsql' => 'on', 'pspell' => 'on', 'session' => 'on', 'sockets' => 'on', 'sybase' => 'on', 'sybase_ct' => 'on', 'sysvsem' => 'on', 'zlib' => 'on', 'test' => 'none', 'problems' => 'Build proble with java extension: (...) java.c: In function `jvm_create\': java.c:165: parse error before `*\' java.c:197: `JNI_CreateVM\' undeclared (first use in this function) java.c:197: (Each undeclared identifier is reported only once java.c:197: for each function it appears in.) java.c:197: parse error before `JNICALL\' java.c:198: `type name\' declared as function returning a function java.c:198: cast specifies function type java.c: At top level: java.c:663: syntax error before `void\' java.c:677: syntax error before `void\' java.c:685: syntax error before `void\' java.c:693: syntax error before `void\' java.c:701: syntax error before `void\' java.c:724: syntax error before `void\' java.c:730: syntax error before `jlong\' java.c:740: syntax error before `jlong\' java.c:751: syntax error before `jlong\' java.c:764: syntax error before `void\' java.c:772: syntax error before `void\' make[3]: *** [java.slo] Error 1 make[3]: Leaving directory `/usr/down/php-4.2.0RC4/ext/java\' make[2]: *** [all-recursive] Error 1 make[2]: Leaving directory `/usr/down/php-4.2.0RC4/ext/java\' make[1]: *** [all-recursive] Error 1 make[1]: Leaving directory `/usr/down/php-4.2.0RC4/ext\' make: *** [all-recursive] Error 1 [root@webdb php-4.2.0RC4]# ', 'bugids' => '', 'remarks' => 'I love php. I hope this will help :D', )

« previous php.qa (#5127) next »