PHP Test results

From: Date: Tue, 16 Apr 2002 12:33:33 +0000
Subject: PHP Test results
Groups: php.qa 
Request: Send a blank email to php-qa+get-5141@lists.php.net to get a copy of this message
array ( 'user_name' => 'Carl Brewer', 'email' => 'carl@bl.echidna.id.au', 'package' => '4.2.0-RC4', 'testcase' => '0', 'status' => 'Fail', 'os' => 'other', 'sapi' => 'Apache 2.x DSO', 'automake' => '1.4', 'autoconf' => '2.5.2', 'libtool' => '1.4.0', 'bison' => '1.2.8', 'test' => 'attempted to compile on Solaris 8 with apache 2.0.35 Arguments to configure : ./configure --with-apxs2=/opt/local/apache2/bin/apxs configure worked fine, tried to compile with solaris make and gmake, same error as shown below. [rollcage]/opt/store/www/php-4.2.0RC4{17} : gcc -v Reading specs from /opt/local/lib/gcc-lib/sparc-sun-solaris2.8/3.0.2/specs Configured with: ./configure --prefix=/opt/local : (reconfigured) ./configure --pr efix=/opt/local --disable-java Thread model: posix gcc version 3.0.2 [rollcage]/opt/store/www/php-4.2.0RC4{18} : uname -a SunOS rollcage 5.8 Generic_108528-14 sun4m sparc SUNW,SPARCstation-10 ', 'problems' => 'Making all in libmysql gmake[3]: Entering directory `/opt/store/www/php-4.2.0RC4/ext/mysql/libmysql\' gmake[4]: Entering directory `/opt/store/www/php-4.2.0RC4/ext/mysql/libmysql\' /bin/sh /opt/store/www/php-4.2.0RC4/libtool --silent --mode=compile gcc -I. -I/op t/store/www/php-4.2.0RC4/ext/mysql/libmysql -I/opt/store/www/php-4.2.0RC4/main -I/ opt/store/www/php-4.2.0RC4 -I/usr/local/apache2/include -I/opt/store/www/php-4.2.0 RC4/Zend -I/opt/store/www/php-4.2.0RC4/ext/mysql/libmysql -I/opt/store/www/php-4.2 .0RC4/ext/xml/expat -D_POSIX_PTHREAD_SEMANTICS -D_POSIX_PTHREAD_SEMANTICS -D_REEN TRANT -I/opt/store/www/php-4.2.0RC4/TSRM -DTHREAD=1 -g -O2 -pthreads -DZTS -prefer -pic -c libmysql.c In file included from libmysql.c:5: global.h:136:22: operator \'EOL\' has no left operand In file included from libmysql.c:5: global.h:256: warning: redefinition of `uint\' /opt/local/lib/gcc-lib/sparc-sun-solaris2.8/3.0.2/include/sys/types.h:504: warning : `uint\' previously declared here global.h:257: warning: redefinition of `ushort\' /opt/local/lib/gcc-lib/sparc-sun-solaris2.8/3.0.2/include/sys/types.h:503: warning : `ushort\' previously declared here global.h:258: warning: redefinition of `ulong\' /opt/local/lib/gcc-lib/sparc-sun-solaris2.8/3.0.2/include/sys/types.h:505: warning : `ulong\' previously declared here In file included from libmysql.c:5: global.h:498:22: operator \'EOL\' has no left operand In file included from libmysql.c:5: global.h:590: warning: redefinition of `ulong\' global.h:258: warning: `ulong\' previously declared here In file included from libmysql.c:12: m_string.h:205:36: operator \'==\' has no right operand libmysql.c: In function `net_field_length_ll\': libmysql.c:397: warning: left shift count >= width of type gmake[4]: *** [libmysql.lo] Error 1 gmake[4]: Leaving directory `/opt/store/www/php-4.2.0RC4/ext/mysql/libmysql\' gmake[3]: *** [all-recursive] Error 1 gmake[3]: Leaving directory `/opt/store/www/php-4.2.0RC4/ext/mysql/libmysql\' gmake[2]: *** [all-recursive] Error 1 gmake[2]: Leaving directory `/opt/store/www/php-4.2.0RC4/ext/mysql\' gmake[1]: *** [all-recursive] Error 1 gmake[1]: Leaving directory `/opt/store/www/php-4.2.0RC4/ext\' gmake: *** [all-recursive] Error 1 ', 'bugids' => '', 'remarks' => 'I am more than willing to try things to get this working, and assist debugging. ', )

« previous php.qa (#5141) next »