PHP Test results

From: Date: Tue, 16 Apr 2002 13:48:07 +0000
Subject: PHP Test results
Groups: php.qa 
Request: Send a blank email to php-qa+get-5145@lists.php.net to get a copy of this message
array ( 'user_name' => 'Koen de Jonge', 'email' => 'koen@procolix.com', 'package' => '4.2.0-RC4', 'testcase' => 'b1', 'status' => 'Fail', 'os' => 'Linux i386', 'sapi' => 'Apache 2.x DSO', 'automake' => '1.4', 'autoconf' => '2.1.3', 'libtool' => '1.4.0', 'bison' => '1.2.8', 'ldap' => 'on', 'mysql' => 'on', 'test' => '# mysql --version mysql Ver 11.15 Distrib 3.23.41, for redhat-linux-gnu (i386) # ./configure --with-mysql --with-apxs2=/opt/apache2.0/bin/apxs --with-ldap --enable-track-vars # make ', 'problems' => 'Making all in mysql make[2]: Entering directory `/root/src/php-4.2.0RC4/ext/mysql\' Making all in libmysql make[3]: Entering directory `/root/src/php-4.2.0RC4/ext/mysql/libmysql\' make[4]: Entering directory `/root/src/php-4.2.0RC4/ext/mysql/libmysql\' /bin/sh /root/src/php-4.2.0RC4/libtool --silent --mode=compile gcc -I. -I/root/src/php-4.2.0RC4/ext/mysql/libmysql -I/root/src/php-4.2.0RC4/main -I/root/src/php-4.2.0RC4 -I/opt/apache2.0/include -I/root/src/php-4.2.0RC4/Zend -I/usr/local/include -I/root/src/php-4.2.0RC4/ext/mysql/libmysql -I/root/src/php-4.2.0RC4/ext/xml/expat -D_REENTRANT -I/root/src/php-4.2.0RC4/TSRM -DTHREAD=1 -g -O2 -pthread -DZTS -prefer-pic -c libmysql.c In file included from libmysql.c:5: global.h:136:22: operator \'EOL\' has no left operand In file included from libmysql.c:5: global.h:498:22: operator \'EOL\' has no left operand In file included from libmysql.c:12: m_string.h:205:36: operator \'==\' has no right operand make[4]: *** [libmysql.lo] Error 1 make[4]: Leaving directory `/root/src/php-4.2.0RC4/ext/mysql/libmysql\' make[3]: *** [all-recursive] Error 1 make[3]: Leaving directory `/root/src/php-4.2.0RC4/ext/mysql/libmysql\' make[2]: *** [all-recursive] Error 1 make[2]: Leaving directory `/root/src/php-4.2.0RC4/ext/mysql\' make[1]: *** [all-recursive] Error 1 make[1]: Leaving directory `/root/src/php-4.2.0RC4/ext\' make: *** [all-recursive] Error 1 #', 'bugids' => '', 'remarks' => 'make fails. Back to the older versions.', )

« previous php.qa (#5145) next »