PHP Test results

From: Date: Wed, 17 Apr 2002 14:09:52 +0000
Subject: PHP Test results
Groups: php.qa 
Request: Send a blank email to php-qa+get-5170@lists.php.net to get a copy of this message
array ( 'user_name' => 'Sean P', 'email' => 'sean@pluard.com', 'package' => '4.2.0-RC4', 'testcase' => '0', 'status' => 'Fail', 'os' => 'Linux i386', 'sapi' => 'Apache 2.x DSO', 'automake' => '1.4', 'autoconf' => '2.1.3', 'libtool' => '1.3.5', 'bison' => '1.2.8', 'ftp' => 'on', 'gd' => 'on', 'imap' => 'on', 'mysql' => 'on', 'session' => 'on', 'sockets' => 'on', 'zlib' => 'on', 'test' => './configure --with-apxs2=/usr/local/apache2/bin/apxs --with-mysql=/usr/local/mysql --enable-track-vars --enable-ftp --with-gd --with-jpeg-dir=/usr/lib --with-png-dir=/usr/lib --enable-sockets --with-zlib-dir=/usr/local/lib --with-freetype-dir=/usr/local/lib --enable-gd-native-ttf ', 'problems' => 'Build failed. Works with non-apache 2.x with just the change to the apsx config opt. GD 1.8.4 Freetype 2.0.9 libpng 1.2.1 zlib 1.1.3 jpeg 6b Making all in gd make[2]: Entering directory `/root/download/php-4.2.0RC4/ext/gd\' make[3]: Entering directory `/root/download/php-4.2.0RC4/ext/gd\' /bin/sh /root/download/php-4.2.0RC4/libtool --silent --mode=compile gcc -I. -I/root/download/php-4.2.0RC4/ext/gd -I/root/download/php-4.2.0RC4/main -I/root/download/php-4.2.0RC4 -I/usr/local/apache2/include -I/root/download/php-4.2.0RC4/Zend -I/usr/local/include/freetype2/freetype -I/usr/local/mysql/include -I/root/download/php-4.2.0RC4/ext/xml/expat -D_REENTRANT -I/root/download/php-4.2.0RC4/TSRM -g -O2 -pthread -DZTS -prefer-pic -c gd.c gd.c: In function `zm_startup_gd\': gd.c:303: `gdArc\' undeclared (first use in this function) gd.c:303: (Each undeclared identifier is reported only once gd.c:303: for each function it appears in.) gd.c:304: `gdPie\' undeclared (first use in this function) gd.c:305: `gdChord\' undeclared (first use in this function) gd.c:306: `gdNoFill\' undeclared (first use in this function) gd.c:307: `gdEdged\' undeclared (first use in this function) gd.c: In function `zif_imagecreatetruecolor\': gd.c:588: warning: assignment makes pointer from integer without a cast gd.c: In function `zif_imagecolorat\': gd.c:1626: structure has no member named `tpixels\' gd.c: In function `php_imagettftext_common\': gd.c:2800: warning: passing arg 2 of `virtual_filepath\' from incompatible pointer type make[3]: *** [gd.lo] Error 1 make[3]: Leaving directory `/root/download/php-4.2.0RC4/ext/gd\' make[2]: *** [all-recursive] Error 1 make[2]: Leaving directory `/root/download/php-4.2.0RC4/ext/gd\' make[1]: *** [all-recursive] Error 1 make[1]: Leaving directory `/root/download/php-4.2.0RC4/ext\' make: *** [all-recursive] Error 1 ', 'bugids' => '', 'remarks' => '', )

« previous php.qa (#5170) next »