Test results for 5.2.5 [failed]

From: Date: Wed, 14 Nov 2007 19:08:48 +0000
Subject: Test results for 5.2.5 [failed]
Groups: php.qa 
Request: Send a blank email to php-qa+get-52028@lists.php.net to get a copy of this message
===================================================================== FAILED TEST SUMMARY --------------------------------------------------------------------- iconv() charset parameter length checks (CVE-2007-4840) [ext/iconv/tests/iconv-charset-length-cve-2007-4840.phpt] iconv_mime_decode() charset parameter length checks (CVE-2007-4840) [ext/iconv/tests/iconv_mime_decode-charset-length-cve-2007-4840.phpt] iconv_mime_decode_headers() charset parameter length checks (CVE-2007-4840) [ext/iconv/tests/iconv_mime_decode_headers-charset-length-cve-2007-4840.phpt] iconv_set_encoding() charset parameter length checks (CVE-2007-4840) [ext/iconv/tests/iconv_set_encoding-charset-length-cve-2007-4840.phpt] iconv stream filter [ext/iconv/tests/iconv_stream_filter.phpt] iconv_strlen() charset parameter length checks (CVE-2007-4840) [ext/iconv/tests/iconv_strlen-charset-length-cve-2007-4840.phpt] iconv_strpos() charset parameter length checks (CVE-2007-4840) [ext/iconv/tests/iconv_strpos-charset-length-cve-2007-4840.phpt] iconv_strrpos() charset parameter length checks (CVE-2007-4840) [ext/iconv/tests/iconv_strrpos-charset-length-cve-2007-4840.phpt] ob_iconv_handler() charset parameter length checks (CVE-2007-4840) [ext/iconv/tests/ob_iconv_handler-charset-length-cve-2007-4840.phpt] Bug #41567 (json_encode() double conversion is inconsistent with PHP) [ext/json/tests/bug41567.phpt] Test array_reverse() function : usage variations - assoc. array with diff. value for 'array' argument [ext/standard/tests/array/array_reverse_variation5.phpt] Test array_unshift() function : usage variations - assoc. array with diff values for 'array' argument [ext/standard/tests/array/array_unshift_variation5.phpt] dl() filename length checks (CVE-2007-4887) [ext/standard/tests/general_functions/dl-cve-2007-4887.phpt] Test setlocale() function : basic functionality - setting system locale to a specific [ext/standard/tests/strings/setlocale_basic1.phpt] Test setlocale() function : basic functionality - set locale using an array [ext/standard/tests/strings/setlocale_basic2.phpt] Test setlocale() function : basic functionality - passing multiple locales as argument [ext/standard/tests/strings/setlocale_basic3.phpt] Test setlocale() function : usage variations - passing multiple valid/invlaid locales as argument [ext/standard/tests/strings/setlocale_variation1.phpt] Test setlocale() function : usage variations - setting system locale = 0 [ext/standard/tests/strings/setlocale_variation3.phpt] Test setlocale() function : usage variations - setting system locale as null [ext/standard/tests/strings/setlocale_variation4.phpt] Test setlocale() function : usage variations - Setting system locale as empty string [ext/standard/tests/strings/setlocale_variation5.phpt] Test vsprintf() function : usage variations - string formats with non-string values [ext/standard/tests/strings/vsprintf_variation8.phpt] ===================================================================== ===================================================================== TEST RESULT SUMMARY --------------------------------------------------------------------- Exts skipped : 66 Exts tested : 13 --------------------------------------------------------------------- Number of tests : 4466 2683 Tests skipped : 1783 ( 39.9%) -------- Tests warned : 0 ( 0.0%) ( 0.0%) Tests failed : 21 ( 0.5%) ( 0.8%) Tests passed : 2662 ( 59.6%) ( 99.2%) --------------------------------------------------------------------- Time taken : 406 seconds ===================================================================== ===================================================================== FAILED TEST SUMMARY --------------------------------------------------------------------- iconv() charset parameter length checks (CVE-2007-4840) [ext/iconv/tests/iconv-charset-length-cve-2007-4840.phpt] iconv_mime_decode() charset parameter length checks (CVE-2007-4840) [ext/iconv/tests/iconv_mime_decode-charset-length-cve-2007-4840.phpt] iconv_mime_decode_headers() charset parameter length checks (CVE-2007-4840) [ext/iconv/tests/iconv_mime_decode_headers-charset-length-cve-2007-4840.phpt] iconv_set_encoding() charset parameter length checks (CVE-2007-4840) [ext/iconv/tests/iconv_set_encoding-charset-length-cve-2007-4840.phpt] iconv stream filter [ext/iconv/tests/iconv_stream_filter.phpt] iconv_strlen() charset parameter length checks (CVE-2007-4840) [ext/iconv/tests/iconv_strlen-charset-length-cve-2007-4840.phpt] iconv_strpos() charset parameter length checks (CVE-2007-4840) [ext/iconv/tests/iconv_strpos-charset-length-cve-2007-4840.phpt] iconv_strrpos() charset parameter length checks (CVE-2007-4840) [ext/iconv/tests/iconv_strrpos-charset-length-cve-2007-4840.phpt] ob_iconv_handler() charset parameter length checks (CVE-2007-4840) [ext/iconv/tests/ob_iconv_handler-charset-length-cve-2007-4840.phpt] Bug #41567 (json_encode() double conversion is inconsistent with PHP) [ext/json/tests/bug41567.phpt] Test array_reverse() function : usage variations - assoc. array with diff. value for 'array' argument [ext/standard/tests/array/array_reverse_variation5.phpt] Test array_unshift() function : usage variations - assoc. array with diff values for 'array' argument [ext/standard/tests/array/array_unshift_variation5.phpt] dl() filename length checks (CVE-2007-4887) [ext/standard/tests/general_functions/dl-cve-2007-4887.phpt] Test setlocale() function : basic functionality - setting system locale to a specific [ext/standard/tests/strings/setlocale_basic1.phpt] Test setlocale() function : basic functionality - set locale using an array [ext/standard/tests/strings/setlocale_basic2.phpt] Test setlocale() function : basic functionality - passing multiple locales as argument [ext/standard/tests/strings/setlocale_basic3.phpt] Test setlocale() function : usage variations - passing multiple valid/invlaid locales as argument [ext/standard/tests/strings/setlocale_variation1.phpt] Test setlocale() function : usage variations - setting system locale = 0 [ext/standard/tests/strings/setlocale_variation3.phpt] Test setlocale() function : usage variations - setting system locale as null [ext/standard/tests/strings/setlocale_variation4.phpt] Test setlocale() function : usage variations - Setting system locale as empty string [ext/standard/tests/strings/setlocale_variation5.phpt] Test vsprintf() function : usage variations - string formats with non-string values [ext/standard/tests/strings/vsprintf_variation8.phpt] ===================================================================== ================================================================================ /usr/local/src/pending/php-5.2.5/ext/iconv/tests/iconv-charset-length-cve-2007-4840.phpt ================================================================================ Fatal error: Allowed memory size of 8388608 bytes exhausted (tried to allocate 9000001 bytes) in /usr/local/src/pending/php-5.2.5/ext/iconv/tests/iconv-charset-length-cve-2007-4840.php on line 2 ================================================================================ 001+ Fatal error: Allowed memory size of 8388608 bytes exhausted (tried to allocate 9000001 bytes) in /usr/local/src/pending/php-5.2.5/ext/iconv/tests/iconv-charset-length-cve-2007-4840.php on line 2 001- Warning: iconv(): Charset parameter exceeds the maximum allowed length of %d characters in %s on line %d 002- bool(false) 003- 004- Warning: iconv(): Charset parameter exceeds the maximum allowed length of %d characters in %s on line %d 005- bool(false) ================================================================================ ================================================================================ /usr/local/src/pending/php-5.2.5/ext/iconv/tests/iconv_mime_decode-charset-length-cve-2007-4840.phpt ================================================================================ Fatal error: Allowed memory size of 8388608 bytes exhausted (tried to allocate 9000001 bytes) in /usr/local/src/pending/php-5.2.5/ext/iconv/tests/iconv_mime_decode-charset-length-cve-2007-4840.php on line 2 ================================================================================ 001+ Fatal error: Allowed memory size of 8388608 bytes exhausted (tried to allocate 9000001 bytes) in /usr/local/src/pending/php-5.2.5/ext/iconv/tests/iconv_mime_decode-charset-length-cve-2007-4840.php on line 2 001- Warning: iconv_mime_decode(): Charset parameter exceeds the maximum allowed length of %d characters in %s on line %d 002- bool(false) ================================================================================ ================================================================================ /usr/local/src/pending/php-5.2.5/ext/iconv/tests/iconv_mime_decode_headers-charset-length-cve-2007-4840.phpt ================================================================================ Fatal error: Allowed memory size of 8388608 bytes exhausted (tried to allocate 9000001 bytes) in /usr/local/src/pending/php-5.2.5/ext/iconv/tests/iconv_mime_decode_headers-charset-length-cve-2007-4840.php on line 2 ================================================================================ 001+ Fatal error: Allowed memory size of 8388608 bytes exhausted (tried to allocate 9000001 bytes) in /usr/local/src/pending/php-5.2.5/ext/iconv/tests/iconv_mime_decode_headers-charset-length-cve-2007-4840.php on line 2 001- Warning: iconv_mime_decode_headers(): Charset parameter exceeds the maximum allowed length of %d characters in %s on line %d 002- bool(false) ================================================================================ ================================================================================ /usr/local/src/pending/php-5.2.5/ext/iconv/tests/iconv_set_encoding-charset-length-cve-2007-4840.phpt ================================================================================ Fatal error: Allowed memory size of 8388608 bytes exhausted (tried to allocate 9000001 bytes) in /usr/local/src/pending/php-5.2.5/ext/iconv/tests/iconv_set_encoding-charset-length-cve-2007-4840.php on line 2 ================================================================================ 001+ Fatal error: Allowed memory size of 8388608 bytes exhausted (tried to allocate 9000001 bytes) in /usr/local/src/pending/php-5.2.5/ext/iconv/tests/iconv_set_encoding-charset-length-cve-2007-4840.php on line 2 001- Warning: iconv_set_encoding(): Charset parameter exceeds the maximum allowed length of %d characters in %s on line %d 002- bool(false) 003- 004- Warning: iconv_set_encoding(): Charset parameter exceeds the maximum allowed length of %d characters in %s on line %d 005- bool(false) 006- 007- Warning: iconv_set_encoding(): Charset parameter exceeds the maximum allowed length of %d characters in %s on line %d 008- bool(false) ================================================================================ ================================================================================ /usr/local/src/pending/php-5.2.5/ext/iconv/tests/iconv_stream_filter.phpt ================================================================================ string(20) "1b244224332473244b24" string(10) "41244f1b28" string(2) "42" string(20) "a4b3a4f3a4cba4c1a4cf" string(10) "69636f6e76" string(2) "0a" string(20) "1b244f24332466245824" string(10) "4e24421b28" string(2) "4f" ================================================================================ 007+ string(20) "1b244f24332466245824" 008+ string(10) "4e24421b28" 009+ string(2) "4f" 007- 008- Warning: fread(): iconv stream filter ("ISO-2022-JP"=>"EUC-JP"): invalid multibyte sequence in %s on line %d 009- string(0) "" 010- string(0) "" 011- string(0) "" ================================================================================ ================================================================================ /usr/local/src/pending/php-5.2.5/ext/iconv/tests/iconv_strlen-charset-length-cve-2007-4840.phpt ================================================================================ Fatal error: Allowed memory size of 8388608 bytes exhausted (tried to allocate 9792000 bytes) in /usr/local/src/pending/php-5.2.5/ext/iconv/tests/iconv_strlen-charset-length-cve-2007-4840.php on line 2 ================================================================================ 001+ Fatal error: Allowed memory size of 8388608 bytes exhausted (tried to allocate 9792000 bytes) in /usr/local/src/pending/php-5.2.5/ext/iconv/tests/iconv_strlen-charset-length-cve-2007-4840.php on line 2 001- Warning: iconv_strlen(): Charset parameter exceeds the maximum allowed length of %d characters in %s on line %d 002- bool(false) ================================================================================ ================================================================================ /usr/local/src/pending/php-5.2.5/ext/iconv/tests/iconv_strpos-charset-length-cve-2007-4840.phpt ================================================================================ Fatal error: Allowed memory size of 8388608 bytes exhausted (tried to allocate 9000001 bytes) in /usr/local/src/pending/php-5.2.5/ext/iconv/tests/iconv_strpos-charset-length-cve-2007-4840.php on line 2 ================================================================================ 001+ Fatal error: Allowed memory size of 8388608 bytes exhausted (tried to allocate 9000001 bytes) in /usr/local/src/pending/php-5.2.5/ext/iconv/tests/iconv_strpos-charset-length-cve-2007-4840.php on line 2 001- Warning: iconv_strpos(): Charset parameter exceeds the maximum allowed length of %d characters in %s on line %d 002- bool(false) ================================================================================ ================================================================================ /usr/local/src/pending/php-5.2.5/ext/iconv/tests/iconv_strrpos-charset-length-cve-2007-4840.phpt ================================================================================ Fatal error: Allowed memory size of 8388608 bytes exhausted (tried to allocate 9000001 bytes) in /usr/local/src/pending/php-5.2.5/ext/iconv/tests/iconv_strrpos-charset-length-cve-2007-4840.php on line 2 ================================================================================ 001+ Fatal error: Allowed memory size of 8388608 bytes exhausted (tried to allocate 9000001 bytes) in /usr/local/src/pending/php-5.2.5/ext/iconv/tests/iconv_strrpos-charset-length-cve-2007-4840.php on line 2 001- Warning: iconv_strrpos(): Charset parameter exceeds the maximum allowed length of %d characters in %s on line %d 002- bool(false) ================================================================================ ================================================================================ /usr/local/src/pending/php-5.2.5/ext/iconv/tests/ob_iconv_handler-charset-length-cve-2007-4840.phpt ================================================================================ Fatal error: Allowed memory size of 8388608 bytes exhausted (tried to allocate 9000001 bytes) in /usr/local/src/pending/php-5.2.5/ext/iconv/tests/ob_iconv_handler-charset-length-cve-2007-4840.php on line 2 ================================================================================ 001+ Fatal error: Allowed memory size of 8388608 bytes exhausted (tried to allocate 9000001 bytes) in /usr/local/src/pending/php-5.2.5/ext/iconv/tests/ob_iconv_handler-charset-length-cve-2007-4840.php on line 2 001- done ================================================================================ ================================================================================ /usr/local/src/pending/php-5.2.5/ext/json/tests/bug41567.phpt ================================================================================ float(123456789.123) Done ================================================================================ 001+ float(123456789.123) 001- float(123456789.12345) ================================================================================ ================================================================================ /usr/local/src/pending/php-5.2.5/ext/standard/tests/array/array_reverse_variation5.phpt ================================================================================ *** Testing array_reverse() : usage variations *** -- Iteration 1 -- - default argument - array(0) { } - $preserve keys = true - array(0) { } - $preserve_keys = false - array(0) { } -- Iteration 2 -- - default argument - array(1) { [0]=> int(0) } - $preserve keys = true - array(1) { [0]=> int(0) } - $preserve_keys = false - array(1) { [0]=> int(0) } -- Iteration 3 -- - default argument - array(1) { [0]=> int(1) } - $preserve keys = true - array(1) { [1]=> int(1) } - $preserve_keys = false - array(1) { [0]=> int(1) } -- Iteration 4 -- - default argument - array(4) { [0]=> int(4) ["three"]=> int(3) ["two"]=> int(2) ["one"]=> int(1) } - $preserve keys = true - array(4) { [4]=> int(4) ["three"]=> int(3) ["two"]=> int(2) ["one"]=> int(1) } - $preserve_keys = false - array(4) { [0]=> int(4) ["three"]=> int(3) ["two"]=> int(2) ["one"]=> int(1) } -- Iteration 5 -- - default argument - array(1) { ["float"]=> float(2.3333) } - $preserve keys = true - array(1) { ["float"]=> float(2.3333) } - $preserve_keys = false - array(1) { ["float"]=> float(2.3333) } -- Iteration 6 -- - default argument - array(4) { ["f4"]=> float(33333333.3333) [0]=> float(4.8999992284) ["f2"]=> float(3.33) ["f1"]=> float(1.2) } - $preserve keys = true - array(4) { ["f4"]=> float(33333333.3333) [3]=> float(4.8999992284) ["f2"]=> float(3.33) ["f1"]=> float(1.2) } - $preserve_keys = false - array(4) { ["f4"]=> float(33333333.3333) [0]=> float(4.8999992284) ["f2"]=> float(3.33) ["f1"]=> float(1.2) } -- Iteration 7 -- - default argument - array(4) { [0]=> string(4) "pen " [1]=> string(7) " world" ["red"]=> string(6) "col or" [2]=> string(6) " Hello" } - $preserve keys = true - array(4) { [3]=> string(4) "pen " [2]=> string(7) " world" ["red"]=> string(6) "col or" [111]=> string(6) " Hello" } - $preserve_keys = false - array(4) { [0]=> string(4) "pen " [1]=> string(7) " world" ["red"]=> string(6) "col or" [2]=> string(6) " Hello" } -- Iteration 8 -- - default argument - array(4) { [0]=> string(5) "pen\n" [1]=> string(9) "\v\fworld" ["red"]=> string(7) "col\tor" [2]=> string(7) "\tHello" } - $preserve keys = true - array(4) { [3]=> string(5) "pen\n" [2]=> string(9) "\v\fworld" ["red"]=> string(7) "col\tor" [111]=> string(7) "\tHello" } - $preserve_keys = false - array(4) { [0]=> string(5) "pen\n" [1]=> string(9) "\v\fworld" ["red"]=> string(7) "col\tor" [2]=> string(7) "\tHello" } -- Iteration 9 -- - default argument - array(2) { ["heredoc"]=> string(11) "Hello world" [0]=> string(5) "hello" } - $preserve keys = true - array(2) { ["heredoc"]=> string(11) "Hello world" [1]=> string(5) "hello" } - $preserve_keys = false - array(2) { ["heredoc"]=> string(11) "Hello world" [0]=> string(5) "hello" } -- Iteration 10 -- - default argument - array(3) { ["resource"]=> resource(5) of type (stream) ["unset"]=> NULL [0]=> object(classA)#1 (0) { } } - $preserve keys = true - array(3) { ["resource"]=> resource(5) of type (stream) ["unset"]=> NULL [11]=> object(classA)#1 (0) { } } - $preserve_keys = false - array(3) { ["resource"]=> resource(5) of type (stream) ["unset"]=> NULL [0]=> object(classA)#1 (0) { } } -- Iteration 11 -- - default argument - array(8) { ["heredoc"]=> string(11) "Hello world" ["unset"]=> NULL ["float"]=> float(444.432) ["int"]=> int(133) ["resource"]=> resource(5) of type (stream) [0]=> string(5) "fruit" [1]=> object(classA)#2 (0) { } [2]=> string(5) "hello" } - $preserve keys = true - array(8) { ["heredoc"]=> string(11) "Hello world" ["unset"]=> NULL ["float"]=> float(444.432) ["int"]=> int(133) ["resource"]=> resource(5) of type (stream) [222]=> string(5) "fruit" [2]=> object(classA)#2 (0) { } [1]=> string(5) "hello" } - $preserve_keys = false - array(8) { ["heredoc"]=> string(11) "Hello world" ["unset"]=> NULL ["float"]=> float(444.432) ["int"]=> int(133) ["resource"]=> resource(5) of type (stream) [0]=> string(5) "fruit" [1]=> object(classA)#2 (0) { } [2]=> string(5) "hello" } Done ================================================================================ 098+ float(33333333.3333) 098- float(33333333.333333) 109+ float(33333333.3333) 109- float(33333333.333333) 120+ float(33333333.3333) 120- float(33333333.333333) ================================================================================ ================================================================================ /usr/local/src/pending/php-5.2.5/ext/standard/tests/array/array_unshift_variation5.phpt ================================================================================ *** Testing array_unshift() : associative array with different values *** -- Iteration 1 -- int(1) array(1) { [0]=> int(10) } int(3) array(3) { [0]=> int(10) [1]=> string(5) "hello" [2]=> string(5) "world" } -- Iteration 2 -- int(2) array(2) { [0]=> int(10) [1]=> int(0) } int(4) array(4) { [0]=> int(10) [1]=> string(5) "hello" [2]=> string(5) "world" [3]=> int(0) } -- Iteration 3 -- int(2) array(2) { [0]=> int(10) [1]=> int(1) } int(4) array(4) { [0]=> int(10) [1]=> string(5) "hello" [2]=> string(5) "world" [3]=> int(1) } -- Iteration 4 -- int(5) array(5) { [0]=> int(10) ["one"]=> int(1) ["two"]=> int(2) ["three"]=> int(3) [1]=> int(4) } int(7) array(7) { [0]=> int(10) [1]=> string(5) "hello" [2]=> string(5) "world" ["one"]=> int(1) ["two"]=> int(2) ["three"]=> int(3) [3]=> int(4) } -- Iteration 5 -- int(2) array(2) { [0]=> int(10) ["float"]=> float(2.3333) } int(4) array(4) { [0]=> int(10) [1]=> string(5) "hello" [2]=> string(5) "world" ["float"]=> float(2.3333) } -- Iteration 6 -- int(5) array(5) { [0]=> int(10) ["f1"]=> float(1.2) ["f2"]=> float(3.33) [1]=> float(4.8999992284) ["f4"]=> float(33333333.3333) } int(7) array(7) { [0]=> int(10) [1]=> string(5) "hello" [2]=> string(5) "world" ["f1"]=> float(1.2) ["f2"]=> float(3.33) [3]=> float(4.8999992284) ["f4"]=> float(33333333.3333) } -- Iteration 7 -- int(5) array(5) { [0]=> int(10) [1]=> string(6) " Hello" ["red"]=> string(6) "col or" [2]=> string(7) " world" [3]=> string(4) "pen " } int(7) array(7) { [0]=> int(10) [1]=> string(5) "hello" [2]=> string(5) "world" [3]=> string(6) " Hello" ["red"]=> string(6) "col or" [4]=> string(7) " world" [5]=> string(4) "pen " } -- Iteration 8 -- int(5) array(5) { [0]=> int(10) [1]=> string(7) "\tHello" ["red"]=> string(7) "col\tor" [2]=> string(9) "\v\fworld" [3]=> string(5) "pen\n" } int(7) array(7) { [0]=> int(10) [1]=> string(5) "hello" [2]=> string(5) "world" [3]=> string(7) "\tHello" ["red"]=> string(7) "col\tor" [4]=> string(9) "\v\fworld" [5]=> string(5) "pen\n" } -- Iteration 9 -- int(3) array(3) { [0]=> int(10) [1]=> string(5) "hello" ["heredoc"]=> string(11) "Hello world" } int(5) array(5) { [0]=> int(10) [1]=> string(5) "hello" [2]=> string(5) "world" [3]=> string(5) "hello" ["heredoc"]=> string(11) "Hello world" } -- Iteration 10 -- int(4) array(4) { [0]=> int(10) [1]=> object(classA)#1 (0) { } ["unset"]=> NULL ["resource"]=> resource(5) of type (stream) } int(6) array(6) { [0]=> int(10) [1]=> string(5) "hello" [2]=> string(5) "world" [3]=> object(classA)#1 (0) { } ["unset"]=> NULL ["resource"]=> resource(5) of type (stream) } -- Iteration 11 -- int(9) array(9) { [0]=> int(10) [1]=> string(5) "hello" [2]=> object(classA)#2 (0) { } [3]=> string(5) "fruit" ["resource"]=> resource(5) of type (stream) ["int"]=> int(133) ["float"]=> float(444.432) ["unset"]=> NULL ["heredoc"]=> string(11) "Hello world" } int(11) array(11) { [0]=> int(10) [1]=> string(5) "hello" [2]=> string(5) "world" [3]=> string(5) "hello" [4]=> object(classA)#2 (0) { } [5]=> string(5) "fruit" ["resource"]=> resource(5) of type (stream) ["int"]=> int(133) ["float"]=> float(444.432) ["unset"]=> NULL ["heredoc"]=> string(11) "Hello world" } Done ================================================================================ 117+ float(33333333.3333) 117- float(33333333.333333) 134+ float(33333333.3333) 134- float(33333333.333333) ================================================================================ ================================================================================ /usr/local/src/pending/php-5.2.5/ext/standard/tests/general_functions/dl-cve-2007-4887.phpt ================================================================================ Fatal error: Allowed memory size of 8388608 bytes exhausted (tried to allocate 8376758 bytes) in /usr/local/src/pending/php-5.2.5/ext/standard/tests/general_functions/dl-cve-2007-4887.php on line 2 ================================================================================ 001+ Fatal error: Allowed memory size of 8388608 bytes exhausted (tried to allocate 8376758 bytes) in /usr/local/src/pending/php-5.2.5/ext/standard/tests/general_functions/dl-cve-2007-4887.php on line 2 001- Warning: dl(): File name exceeds the maximum allowed length of %d characters in %s on line %d 002- bool(false) ================================================================================ ================================================================================ /usr/local/src/pending/php-5.2.5/ext/standard/tests/strings/setlocale_basic1.phpt ================================================================================ *** Testing setlocale() : basic functionality - set to a specific locale *** Setting system locale(LC_ALL) to Checking currency settings in the new locale, expected: EUR, Found: Test FAILED. Done ================================================================================ 003+ Test FAILED. 003- string(%d) %s 004- Checking currency settings in the new locale, expected: %s, Found: %s 005- Test PASSED. ================================================================================ ================================================================================ /usr/local/src/pending/php-5.2.5/ext/standard/tests/strings/setlocale_basic2.phpt ================================================================================ *** Testing setlocale() with an array containing list of locales *** -- Testing setlocale() : 'category' argument as LC_ALL & 'locale' argument as an array -- Test FAILED. Done ================================================================================ 003+ Test FAILED. 003- string(%d) "%s" 004- Checking currency settings in the new locale, expected: %s, Found: %s 005- Test PASSED. ================================================================================ ================================================================================ /usr/local/src/pending/php-5.2.5/ext/standard/tests/strings/setlocale_basic3.phpt ================================================================================ *** Testing setlocale() by passing multiple locales as argument *** Done ================================================================================ 002- -- Testing setlocale() by giving 'category' as LC_ALL & multiple locales(en_US.utf8, Ko_KR.utf8, zh_CN.utf8) -- 003- string(%d) "%s" 004- Checking currency settings in the new locale, expected: %s, Found: %s 005- Test PASSED. ================================================================================ ================================================================================ /usr/local/src/pending/php-5.2.5/ext/standard/tests/strings/setlocale_variation1.phpt ================================================================================ *** Testing setlocale() by passing multiple valid/invalid locales as argument *** Done ================================================================================ 002- -- Testing setlocale() by giving 'category' as LC_ALL & multiple locales(en_US.invalid, en_US.utf8, Ko_KR.utf8, KO_KR.invalid, zh_CN.utf8) -- 003- string(%d) "%s" 004- Checking currency settings in the new locale, expected: %s, Found: %s 005- Test PASSED. ================================================================================ ================================================================================ /usr/local/src/pending/php-5.2.5/ext/standard/tests/strings/setlocale_variation3.phpt ================================================================================ *** Testing setlocale() : usage variations - setting system locale = 0 *** Locale info, before setting the locale array(18) { ["decimal_point"]=> string(1) "." ["thousands_sep"]=> string(0) "" ["int_curr_symbol"]=> string(0) "" ["currency_symbol"]=> string(0) "" ["mon_decimal_point"]=> string(0) "" ["mon_thousands_sep"]=> string(0) "" ["positive_sign"]=> string(0) "" ["negative_sign"]=> string(0) "" ["int_frac_digits"]=> int(127) ["frac_digits"]=> int(127) ["p_cs_precedes"]=> int(127) ["p_sep_by_space"]=> int(127) ["n_cs_precedes"]=> int(127) ["n_sep_by_space"]=> int(127) ["p_sign_posn"]=> int(127) ["n_sign_posn"]=> int(127) ["grouping"]=> array(0) { } ["mon_grouping"]=> array(0) { } } Setting system locale, category = LC_ALL and locale = 0 Locale info, after setting the locale array(18) { ["decimal_point"]=> string(1) "." ["thousands_sep"]=> string(0) "" ["int_curr_symbol"]=> string(0) "" ["currency_symbol"]=> string(0) "" ["mon_decimal_point"]=> string(0) "" ["mon_thousands_sep"]=> string(0) "" ["positive_sign"]=> string(0) "" ["negative_sign"]=> string(0) "" ["int_frac_digits"]=> int(127) ["frac_digits"]=> int(127) ["p_cs_precedes"]=> int(127) ["p_sep_by_space"]=> int(127) ["n_cs_precedes"]=> int(127) ["n_sep_by_space"]=> int(127) ["p_sign_posn"]=> int(127) ["n_sign_posn"]=> int(127) ["grouping"]=> array(0) { } ["mon_grouping"]=> array(0) { } } Checking locale in the system, Expected : no change in the existing locale Test PASSED. Done ================================================================================ 007+ string(0) "" 007- string(1) "," 009+ string(0) "" 009- string(4) "USD " 011+ string(0) "" 011- string(1) "$" 013+ string(0) "" 013- string(1) "." 015+ string(0) "" 015- string(1) "," 019+ string(0) "" 019- string(1) "-" 021+ int(127) 021- int(2) 023+ int(127) 023- int(2) 025+ int(127) 025- int(1) 027+ int(127) 027- int(0) 029+ int(127) 029- int(1) 031+ int(127) 031- int(0) 033+ int(127) 033- int(1) 035+ int(127) 035- int(1) 037+ array(0) { 037- array(2) { 038- [0]=> 039- int(3) 040- [1]=> 041- int(3) 040+ array(0) { 044- array(2) { 045- [0]=> 046- int(3) 047- [1]=> 048- int(3) 049+ string(0) "" 051+ string(0) "" 053+ string(0) "" 055+ string(0) "" 057+ string(0) "" 057- string(1) "," 059- string(4) "USD " 061+ string(0) "" 061- string(1) "$" 063+ int(127) 063- string(1) "." 065+ int(127) 065- string(1) "," 067+ int(127) 069+ int(127) 069- string(1) "-" 071+ int(127) 071- int(2) 073+ int(127) 073- int(2) 075+ int(127) 075- int(1) 077+ int(127) 077- int(0) 079+ array(0) { 079- int(1) 081- int(0) 082+ array(0) { 083- int(1) 085- int(1) 087- array(2) { 088- [0]=> 089- int(3) 090- [1]=> 091- int(3) 094- array(2) { 095- [0]=> 096- int(3) 097- [1]=> 098- int(3) ================================================================================ ================================================================================ /usr/local/src/pending/php-5.2.5/ext/standard/tests/strings/setlocale_variation4.phpt ================================================================================ *** Testing setlocale() : usage variations - Setting system locale = null *** Locale info, before setting the locale array(18) { ["decimal_point"]=> string(1) "." ["thousands_sep"]=> string(0) "" ["int_curr_symbol"]=> string(0) "" ["currency_symbol"]=> string(0) "" ["mon_decimal_point"]=> string(0) "" ["mon_thousands_sep"]=> string(0) "" ["positive_sign"]=> string(0) "" ["negative_sign"]=> string(0) "" ["int_frac_digits"]=> int(127) ["frac_digits"]=> int(127) ["p_cs_precedes"]=> int(127) ["p_sep_by_space"]=> int(127) ["n_cs_precedes"]=> int(127) ["n_sep_by_space"]=> int(127) ["p_sign_posn"]=> int(127) ["n_sign_posn"]=> int(127) ["grouping"]=> array(0) { } ["mon_grouping"]=> array(0) { } } Setting system locale, category = LC_ALL and locale = null Locale info, after setting the locale array(18) { ["decimal_point"]=> string(1) "." ["thousands_sep"]=> string(0) "" ["int_curr_symbol"]=> string(0) "" ["currency_symbol"]=> string(0) "" ["mon_decimal_point"]=> string(0) "" ["mon_thousands_sep"]=> string(0) "" ["positive_sign"]=> string(0) "" ["negative_sign"]=> string(0) "" ["int_frac_digits"]=> int(127) ["frac_digits"]=> int(127) ["p_cs_precedes"]=> int(127) ["p_sep_by_space"]=> int(127) ["n_cs_precedes"]=> int(127) ["n_sep_by_space"]=> int(127) ["p_sign_posn"]=> int(127) ["n_sign_posn"]=> int(127) ["grouping"]=> array(0) { } ["mon_grouping"]=> array(0) { } } Checking new locale in the system, Expected : the locale names will be set from the values of environment variables Test FAILED. Done ================================================================================ 007+ string(0) "" 007- string(1) "," 009+ string(0) "" 009- string(4) "AUD " 011+ string(0) "" 011- string(1) "$" 013+ string(0) "" 013- string(1) "." 015+ string(0) "" 015- string(1) "," 019+ string(0) "" 019- string(1) "-" 021+ int(127) 021- int(2) 023+ int(127) 023- int(2) 025+ int(127) 025- int(1) 027+ int(127) 027- int(0) 029+ int(127) 029- int(1) 031+ int(127) 031- int(0) 033+ int(127) 033- int(1) 035+ int(127) 035- int(1) 037+ array(0) { 037- array(2) { 038- [0]=> 039- int(3) 040- [1]=> 041- int(3) 040+ array(0) { 044- array(2) { 045- [0]=> 046- int(3) 047- [1]=> 048- int(3) 049+ string(0) "" 051+ string(0) "" 053+ string(0) "" 055+ string(0) "" 057+ string(0) "" 057- string(1) "," 059- string(4) "USD " 061+ string(0) "" 061- string(1) "$" 063+ int(127) 063- string(1) "." 065+ int(127) 065- string(1) "," 067+ int(127) 069+ int(127) 069- string(1) "-" 071+ int(127) 071- int(2) 073+ int(127) 073- int(2) 075+ int(127) 075- int(1) 077+ int(127) 077- int(0) 079+ array(0) { 079- int(1) 081- int(0) 082+ array(0) { 083- int(1) 085- int(1) 086+ Test FAILED. 087- array(2) { 088- [0]=> 089- int(3) 090- [1]=> 091- int(3) 094- array(2) { 095- [0]=> 096- int(3) 097- [1]=> 098- int(3) 102- Test PASSED. ================================================================================ ================================================================================ /usr/local/src/pending/php-5.2.5/ext/standard/tests/strings/setlocale_variation5.phpt ================================================================================ *** Testing setlocale() : usage variations - setting system locale = "" *** Locale info, before setting the locale array(18) { ["decimal_point"]=> string(1) "." ["thousands_sep"]=> string(0) "" ["int_curr_symbol"]=> string(0) "" ["currency_symbol"]=> string(0) "" ["mon_decimal_point"]=> string(0) "" ["mon_thousands_sep"]=> string(0) "" ["positive_sign"]=> string(0) "" ["negative_sign"]=> string(0) "" ["int_frac_digits"]=> int(127) ["frac_digits"]=> int(127) ["p_cs_precedes"]=> int(127) ["p_sep_by_space"]=> int(127) ["n_cs_precedes"]=> int(127) ["n_sep_by_space"]=> int(127) ["p_sign_posn"]=> int(127) ["n_sign_posn"]=> int(127) ["grouping"]=> array(0) { } ["mon_grouping"]=> array(0) { } } Setting system locale, category = LC_ALL and locale = "" Locale info, after setting the locale array(18) { ["decimal_point"]=> string(1) "." ["thousands_sep"]=> string(0) "" ["int_curr_symbol"]=> string(0) "" ["currency_symbol"]=> string(0) "" ["mon_decimal_point"]=> string(0) "" ["mon_thousands_sep"]=> string(0) "" ["positive_sign"]=> string(0) "" ["negative_sign"]=> string(0) "" ["int_frac_digits"]=> int(127) ["frac_digits"]=> int(127) ["p_cs_precedes"]=> int(127) ["p_sep_by_space"]=> int(127) ["n_cs_precedes"]=> int(127) ["n_sep_by_space"]=> int(127) ["p_sign_posn"]=> int(127) ["n_sign_posn"]=> int(127) ["grouping"]=> array(0) { } ["mon_grouping"]=> array(0) { } } Checking new locale in the system, Expected : the locale names will be set from the values of environment variables Test FAILED. Done ================================================================================ 007+ string(0) "" 007- string(1) "," 009+ string(0) "" 009- string(4) "AUD " 011+ string(0) "" 011- string(1) "$" 013+ string(0) "" 013- string(1) "." 015+ string(0) "" 015- string(1) "," 019+ string(0) "" 019- string(1) "-" 021+ int(127) 021- int(2) 023+ int(127) 023- int(2) 025+ int(127) 025- int(1) 027+ int(127) 027- int(0) 029+ int(127) 029- int(1) 031+ int(127) 031- int(0) 033+ int(127) 033- int(1) 035+ int(127) 035- int(1) 037+ array(0) { 037- array(2) { 038- [0]=> 039- int(3) 040- [1]=> 041- int(3) 040+ array(0) { 044- array(2) { 045- [0]=> 046- int(3) 047- [1]=> 048- int(3) 049+ string(0) "" 051+ string(0) "" 053+ string(0) "" 055+ string(0) "" 057+ string(0) "" 057- string(1) "," 059- string(4) "USD " 061+ string(0) "" 061- string(1) "$" 063+ int(127) 063- string(1) "." 065+ int(127) 065- string(1) "," 067+ int(127) 069+ int(127) 069- string(1) "-" 071+ int(127) 071- int(2) 073+ int(127) 073- int(2) 075+ int(127) 075- int(1) 077+ int(127) 077- int(0) 079+ array(0) { 079- int(1) 081- int(0) 082+ array(0) { 083- int(1) 085- int(1) 086+ Test FAILED. 087- array(2) { 088- [0]=> 089- int(3) 090- [1]=> 091- int(3) 094- array(2) { 095- [0]=> 096- int(3) 097- [1]=> 098- int(3) 102- Test PASSED. ================================================================================ ================================================================================ /usr/local/src/pending/php-5.2.5/ext/standard/tests/strings/vsprintf_variation8.phpt ================================================================================ *** Testing vsprintf() : string formats and non-string values *** -- Iteration 1 -- string(174) "2.2 0.2 10.2 123456.234 s -1234.6789 1234.6789 2000 2.0E -400000000000 2.2E 12345.78 12.0000000111 -12.0000011111 -123456.234 10.2 123456.234 2.2 0.2" -- Iteration 2 -- string(132) "2 -2 2 123456 s -12346789 12346789 1232 2000 -40000 2221 12345780 1211111 -12111111 -12345634 2 123456 2 -2" -- Iteration 3 -- string(131) "Array Array Array Array s Array Array Arra Arra Array Arra Array Array Array Array Array Array Array Array" -- Iteration 4 -- string(81) "1 1 1 s 1 1 0001 0000 #0 1 $1 _0 1 1 1" Done ================================================================================ 004+ string(174) "2.2 0.2 10.2 004- string(177) "2.2 0.2 10.2 006+ 2000 2.0E -400000000000 2.2E 007+ 12345.78 12.0000000111 -12.0000011111 -123456.234 006- 2000 2000 -400000000000 2200 007- 12345.78 12.000000011111 -12.00000111111 -123456.234 ================================================================================ ================================================================================ BUILD ENVIRONMENT ================================================================================ OS: Linux - Linux cpro 2.4.27 #6 SMP Wed Oct 27 12:37:16 CDT 2004 i686 Autoconf: autoconf (GNU Autoconf) 2.57 Written by David J. MacKenzie and Akim Demaille. Copyright 2002 Free Software Foundation, Inc. This is free software; see the source for copying conditions. There is NO warranty; not even for MERCHANTABILITY or FITNESS FOR A PARTICULAR PURPOSE. Bundled Libtool: ltmain.sh (GNU libtool) 1.5.20 (1.1220.2.287 2005/08/31 18:54:15) Copyright (C) 2005 Free Software Foundation, Inc. This is free software; see the source for copying conditions. There is NO warranty; not even for MERCHANTABILITY or FITNESS FOR A PARTICULAR PURPOSE. System Libtool: ltmain.sh (GNU libtool) 1.4.3 (1.922.2.110 2002/10/23 01:39:54) Compiler: Reading specs from /usr/lib/gcc-lib/i386-slackware-linux/3.2.2/specs Configured with: ../gcc-3.2.2/configure --prefix=/usr --enable-shared --enable-threads=posix --enable-__cxa_atexit --disable-checking --with-gnu-ld --verbose --target=i386-slackware-linux --host=i386-slackware-linux Thread model: posix gcc version 3.2.2 Bison: bison (GNU Bison) 1.35 Copyright 1984, 1986, 1989, 1992, 2000, 2001, 2002 Free Software Foundation, Inc. This is free software; see the source for copying conditions. There is NO warranty; not even for MERCHANTABILITY or FITNESS FOR A PARTICULAR PURPOSE. Libraries: /lib/libsafe.so.2 => /lib/libsafe.so.2 (0x40016000) libcrypt.so.1 => /lib/libcrypt.so.1 (0x40023000) libresolv.so.2 => /lib/libresolv.so.2 (0x40050000) libm.so.6 => /lib/libm.so.6 (0x40061000) libdl.so.2 => /lib/libdl.so.2 (0x40084000) libnsl.so.1 => /lib/libnsl.so.1 (0x40087000) libc.so.6 => /lib/libc.so.6 (0x4009c000) /lib/ld-linux.so.2 => /lib/ld-linux.so.2 (0x40000000) User's E-mail: jazzmang at yahoo dot com ================================================================================ PHPINFO ================================================================================ phpinfo() PHP Version => 5.2.5 System => Linux cpro 2.4.27 #6 SMP Wed Oct 27 12:37:16 CDT 2004 i686 Build Date => Nov 14 2007 10:36:16 Configure Command => ./configure --with-apxs=/usr/local/apache/bin/apxs --enable-mod_charset --disable-ipv6 --without-sqlite --disable-pdo --without-mysql --disable-dom --disable-simplexml --disable-libxml --disable-xml --disable-xmlreader --disable-xmlwriter --without-pear Server API => Command Line Interface Virtual Directory Support => disabled Configuration File (php.ini) Path => /usr/local/lib Loaded Configuration File => /usr/local/lib/php.ini PHP API => 20041225 PHP Extension => 20060613 Zend Extension => 220060519 Debug Build => no Thread Safety => disabled Zend Memory Manager => enabled IPv6 Support => disabled Registered PHP Streams => php, file, data, http, ftp Registered Stream Socket Transports => tcp, udp, unix, udg Registered Stream Filters => string.rot13, string.toupper, string.tolower, string.strip_tags, convert.*, consumed, convert.iconv.* This program makes use of the Zend Scripting Language Engine: Zend Engine v2.2.0, Copyright (c) 1998-2007 Zend Technologies _______________________________________________________________________ Configuration PHP Core Directive => Local Value => Master Value allow_call_time_pass_reference => On => On allow_url_fopen => On => On allow_url_include => Off => Off always_populate_raw_post_data => Off => Off arg_separator.input => & => & arg_separator.output => & => & asp_tags => Off => Off auto_append_file => no value => no value auto_globals_jit => On => On auto_prepend_file => no value => no value browscap => no value => no value default_charset => no value => no value default_mimetype => text/html => text/html define_syslog_variables => Off => Off disable_classes => no value => no value disable_functions => no value => no value display_errors => STDOUT => STDOUT display_startup_errors => Off => Off doc_root => no value => no value docref_ext => no value => no value docref_root => no value => no value enable_dl => On => On error_append_string => no value => no value error_log => no value => no value error_prepend_string => no value => no value error_reporting => 6135 => 6135 expose_php => On => On extension_dir => ./ => ./ file_uploads => On => On highlight.bg => <font style="color: #FFFFFF">#FFFFFF</font> => <font style="color: #FFFFFF">#FFFFFF</font> highlight.comment => <font style="color: #FF8000">#FF8000</font> => <font style="color: #FF8000">#FF8000</font> highlight.default => <font style="color: #0000BB">#0000BB</font> => <font style="color: #0000BB">#0000BB</font> highlight.html => <font style="color: #000000">#000000</font> => <font style="color: #000000">#000000</font> highlight.keyword => <font style="color: #007700">#007700</font> => <font style="color: #007700">#007700</font> highlight.string => <font style="color: #DD0000">#DD0000</font> => <font style="color: #DD0000">#DD0000</font> html_errors => Off => Off ignore_repeated_errors => Off => Off ignore_repeated_source => Off => Off ignore_user_abort => Off => Off implicit_flush => On => On include_path => .: => .: log_errors => Off => Off log_errors_max_len => 1024 => 1024 magic_quotes_gpc => On => On magic_quotes_runtime => Off => Off magic_quotes_sybase => Off => Off mail.force_extra_parameters => no value => no value max_execution_time => 0 => 0 max_input_nesting_level => 64 => 64 max_input_time => -1 => -1 memory_limit => 8M => 8M open_basedir => no value => no value output_buffering => 0 => 0 output_handler => no value => no value post_max_size => 8M => 8M precision => 12 => 12 realpath_cache_size => 16K => 16K realpath_cache_ttl => 120 => 120 register_argc_argv => On => On register_globals => Off => Off register_long_arrays => On => On report_memleaks => On => On report_zend_debug => Off => Off safe_mode => Off => Off safe_mode_exec_dir => no value => no value safe_mode_gid => Off => Off safe_mode_include_dir => no value => no value sendmail_from => me@localhost.com => me@localhost.com sendmail_path => /usr/bin/sendmail -t -i => /usr/bin/sendmail -t -i serialize_precision => 100 => 100 short_open_tag => On => On SMTP => localhost => localhost smtp_port => 25 => 25 sql.safe_mode => Off => Off track_errors => Off => Off unserialize_callback_func => no value => no value upload_max_filesize => 10M => 10M upload_tmp_dir => no value => no value user_dir => no value => no value variables_order => EGPCS => EGPCS xmlrpc_error_number => 0 => 0 xmlrpc_errors => Off => Off y2k_compliance => On => On zend.ze1_compatibility_mode => Off => Off ctype ctype functions => enabled date date/time support => enabled "Olson" Timezone Database Version => 2007.9 Timezone Database => internal Default timezone => America/Chicago Directive => Local Value => Master Value date.default_latitude => 31.7667 => 31.7667 date.default_longitude => 35.2333 => 35.2333 date.sunrise_zenith => 90.583333 => 90.583333 date.sunset_zenith => 90.583333 => 90.583333 date.timezone => no value => no value filter Input Validation and Filtering => enabled Revision => $Revision: 1.52.2.39 $ Directive => Local Value => Master Value filter.default => unsafe_raw => unsafe_raw filter.default_flags => no value => no value hash hash support => enabled Hashing Engines => md2 md4 md5 sha1 sha256 sha384 sha512 ripemd128 ripemd160 ripemd256 ripemd320 whirlpool tiger128,3 tiger160,3 tiger192,3 tiger128,4 tiger160,4 tiger192,4 snefru gost adler32 crc32 crc32b haval128,3 haval160,3 haval192,3 haval224,3 haval256,3 haval128,4 haval160,4 haval192,4 haval224,4 haval256,4 haval128,5 haval160,5 haval192,5 haval224,5 haval256,5 iconv iconv support => enabled iconv implementation => glibc iconv library version => 2.3.1 Directive => Local Value => Master Value iconv.input_encoding => ISO-8859-1 => ISO-8859-1 iconv.internal_encoding => ISO-8859-1 => ISO-8859-1 iconv.output_encoding => ISO-8859-1 => ISO-8859-1 json json support => enabled json version => 1.2.1 pcre PCRE (Perl Compatible Regular Expressions) Support => enabled PCRE Library Version => 7.3 2007-08-28 Directive => Local Value => Master Value pcre.backtrack_limit => 100000 => 100000 pcre.recursion_limit => 100000 => 100000 posix Revision => $Revision: 1.70.2.3.2.16 $ Reflection Reflection => enabled Version => $Id: php_reflection.c,v 1.164.2.33.2.47 2007/10/28 13:47:14 iliaa Exp $ session Session Support => enabled Registered save handlers => files user Registered serializer handlers => php php_binary Directive => Local Value => Master Value session.auto_start => Off => Off session.bug_compat_42 => On => On session.bug_compat_warn => On => On session.cache_expire => 180 => 180 session.cache_limiter => nocache => nocache session.cookie_domain => no value => no value session.cookie_httponly => Off => Off session.cookie_lifetime => 0 => 0 session.cookie_path => / => / session.cookie_secure => Off => Off session.entropy_file => no value => no value session.entropy_length => 0 => 0 session.gc_divisor => 100 => 100 session.gc_maxlifetime => 1440 => 1440 session.gc_probability => 1 => 1 session.hash_bits_per_character => 4 => 4 session.hash_function => 0 => 0 session.name => PHPSESSID => PHPSESSID session.referer_check => no value => no value session.save_handler => files => files session.save_path => /tmp/php => /tmp/php session.serialize_handler => php => php session.use_cookies => On => On session.use_only_cookies => Off => Off session.use_trans_sid => 0 => 0 SPL SPL support => enabled Interfaces => Countable, OuterIterator, RecursiveIterator, SeekableIterator, SplObserver, SplSubject Classes => AppendIterator, ArrayIterator, ArrayObject, BadFunctionCallException, BadMethodCallException, CachingIterator, DirectoryIterator, DomainException, EmptyIterator, FilterIterator, InfiniteIterator, InvalidArgumentException, IteratorIterator, LengthException, LimitIterator, LogicException, NoRewindIterator, OutOfBoundsException, OutOfRangeException, OverflowException, ParentIterator, RangeException, RecursiveArrayIterator, RecursiveCachingIterator, RecursiveDirectoryIterator, RecursiveFilterIterator, RecursiveIteratorIterator, RecursiveRegexIterator, RegexIterator, RuntimeException, SplFileInfo, SplFileObject, SplObjectStorage, SplTempFileObject, UnderflowException, UnexpectedValueException standard Regex Library => Bundled library enabled Dynamic Library Support => enabled Path to sendmail => /usr/bin/sendmail -t -i Directive => Local Value => Master Value assert.active => 1 => 1 assert.bail => 0 => 0 assert.callback => no value => no value assert.quiet_eval => 0 => 0 assert.warning => 1 => 1 auto_detect_line_endings => 0 => 0 default_socket_timeout => 60 => 60 safe_mode_allowed_env_vars => PHP_ => PHP_ safe_mode_protected_env_vars => LD_LIBRARY_PATH => LD_LIBRARY_PATH url_rewriter.tags => a=href,area=href,frame=src,input=src,form=,fieldset= => a=href,area=href,frame=src,input=src,form=,fieldset= user_agent => no value => no value tokenizer Tokenizer Support => enabled Additional Modules Module Name Environment Variable => Value MANPATH => /usr/man:/usr/contrib/man:/usr/share/man:/usr/X11/man:/usr/local/man HOSTNAME => cpro.us36.net TEST_PHP_SRCDIR => /usr/local/src/pending/php-5.2.5 SHELL => /bin/sh TERM => vt100 MAKEFLAGS => SSH_CLIENT => deleted SSH_TTY => deleted USER => root LS_COLORS => no=00:fi=00:di=01;34:ln=01;36:pi=40;33:so=01;35:bd=40;33;01:cd=40;33;01:or=40;31;01:ex=01;32:*.cmd=01;32:*.exe=01;32:*.com=01;32:*.btm=01;32:*.bat=01;32:*.tar=01;31:*.tgz=01;31:*.arj=01;31:*.taz=01;31:*.lzh=01;31:*.zip=01;31:*.bz2=01;31:*.rpm=01;31:*.deb=01;31:*.z=01;31:*.Z=01;31:*.gz=01;31:*.jpg=01;35:*.gif=01;35:*.bmp=01;35:*.ppm=01;35:*.tga=01;35:*.xbm=01;35:*.xpm=01;35:*.tif=01;35:*.mpg=01;37:*.avi=01;37:*.mov=01;37: SUDO_USER => jmg OPENWINHOME => /usr/openwin SUDO_UID => 802 SSH_AUTH_SOCK => deleted MAKELEVEL => 1 PAGER => less MFLAGS => MINICOM => -c on PATH => /usr/local/bin:/sbin:/usr/local/sbin:/bin:/usr/bin:/usr/X11/bin:/usr/contrib/bin:/usr/games:/usr/sbin:/home/jmg/bin:/.html:. MAIL => /var/mail/jmg _ => /usr/local/src/pending/php-5.2.5/sapi/cli/php BLOCKSIZE => 1k PWD => /usr/local/src/pending/php-5.2.5 EXINIT => set autoindent WWW_HOME => http://www.interkan.net/ EDITOR => pico TEST_PHP_EXECUTABLE => /usr/local/src/pending/php-5.2.5/sapi/cli/php ignoreeof => SUDO_COMMAND => /usr/bin/nice make test HOME => /home/jmg SHLVL => 3 LS_OPTIONS => --color=auto -F -b -T 0 LOGNAME => root LESS => -M SSH_CONNECTION => deleted MOZILLA_HOME => /usr/lib/netscape LESSOPEN => |lesspipe.sh %s SUDO_GID => 69 CC => gcc PHP Variables Variable => Value _SERVER["MANPATH"] => /usr/man:/usr/contrib/man:/usr/share/man:/usr/X11/man:/usr/local/man _SERVER["HOSTNAME"] => cpro.us36.net _SERVER["TEST_PHP_SRCDIR"] => /usr/local/src/pending/php-5.2.5 _SERVER["SHELL"] => /bin/sh _SERVER["TERM"] => vt100 _SERVER["MAKEFLAGS"] => _SERVER["SSH_CLIENT"] => deleted _SERVER["SSH_TTY"] => deleted _SERVER["USER"] => root _SERVER["LS_COLORS"] => no=00:fi=00:di=01;34:ln=01;36:pi=40;33:so=01;35:bd=40;33;01:cd=40;33;01:or=40;31;01:ex=01;32:*.cmd=01;32:*.exe=01;32:*.com=01;32:*.btm=01;32:*.bat=01;32:*.tar=01;31:*.tgz=01;31:*.arj=01;31:*.taz=01;31:*.lzh=01;31:*.zip=01;31:*.bz2=01;31:*.rpm=01;31:*.deb=01;31:*.z=01;31:*.Z=01;31:*.gz=01;31:*.jpg=01;35:*.gif=01;35:*.bmp=01;35:*.ppm=01;35:*.tga=01;35:*.xbm=01;35:*.xpm=01;35:*.tif=01;35:*.mpg=01;37:*.avi=01;37:*.mov=01;37: _SERVER["SUDO_USER"] => jmg _SERVER["OPENWINHOME"] => /usr/openwin _SERVER["SUDO_UID"] => 802 _SERVER["SSH_AUTH_SOCK"] => deleted _SERVER["MAKELEVEL"] => 1 _SERVER["PAGER"] => less _SERVER["MFLAGS"] => _SERVER["MINICOM"] => -c on _SERVER["PATH"] => /usr/local/bin:/sbin:/usr/local/sbin:/bin:/usr/bin:/usr/X11/bin:/usr/contrib/bin:/usr/games:/usr/sbin:/home/jmg/bin:/.html:. _SERVER["MAIL"] => /var/mail/jmg _SERVER["_"] => /usr/local/src/pending/php-5.2.5/sapi/cli/php _SERVER["BLOCKSIZE"] => 1k _SERVER["PWD"] => /usr/local/src/pending/php-5.2.5 _SERVER["EXINIT"] => set autoindent _SERVER["WWW_HOME"] => http://www.interkan.net/ _SERVER["EDITOR"] => pico _SERVER["TEST_PHP_EXECUTABLE"] => /usr/local/src/pending/php-5.2.5/sapi/cli/php _SERVER["ignoreeof"] => _SERVER["SUDO_COMMAND"] => /usr/bin/nice make test _SERVER["HOME"] => /home/jmg _SERVER["SHLVL"] => 3 _SERVER["LS_OPTIONS"] => --color=auto -F -b -T 0 _SERVER["LOGNAME"] => root _SERVER["LESS"] => -M _SERVER["SSH_CONNECTION"] => deleted _SERVER["MOZILLA_HOME"] => /usr/lib/netscape _SERVER["LESSOPEN"] => |lesspipe.sh %s _SERVER["SUDO_GID"] => 69 _SERVER["CC"] => gcc _SERVER["PHP_SELF"] => _SERVER["SCRIPT_NAME"] => _SERVER["SCRIPT_FILENAME"] => _SERVER["PATH_TRANSLATED"] => _SERVER["DOCUMENT_ROOT"] => _SERVER["REQUEST_TIME"] => 1195067325 _SERVER["argv"] => Array ( ) _SERVER["argc"] => 0 _ENV["MANPATH"] => /usr/man:/usr/contrib/man:/usr/share/man:/usr/X11/man:/usr/local/man _ENV["HOSTNAME"] => cpro.us36.net _ENV["TEST_PHP_SRCDIR"] => /usr/local/src/pending/php-5.2.5 _ENV["SHELL"] => /bin/sh _ENV["TERM"] => vt100 _ENV["MAKEFLAGS"] => _ENV["SSH_CLIENT"] => deleted _ENV["SSH_TTY"] => deleted _ENV["USER"] => root _ENV["LS_COLORS"] => no=00:fi=00:di=01;34:ln=01;36:pi=40;33:so=01;35:bd=40;33;01:cd=40;33;01:or=40;31;01:ex=01;32:*.cmd=01;32:*.exe=01;32:*.com=01;32:*.btm=01;32:*.bat=01;32:*.tar=01;31:*.tgz=01;31:*.arj=01;31:*.taz=01;31:*.lzh=01;31:*.zip=01;31:*.bz2=01;31:*.rpm=01;31:*.deb=01;31:*.z=01;31:*.Z=01;31:*.gz=01;31:*.jpg=01;35:*.gif=01;35:*.bmp=01;35:*.ppm=01;35:*.tga=01;35:*.xbm=01;35:*.xpm=01;35:*.tif=01;35:*.mpg=01;37:*.avi=01;37:*.mov=01;37: _ENV["SUDO_USER"] => jmg _ENV["OPENWINHOME"] => /usr/openwin _ENV["SUDO_UID"] => 802 _ENV["SSH_AUTH_SOCK"] => deleted _ENV["MAKELEVEL"] => 1 _ENV["PAGER"] => less _ENV["MFLAGS"] => _ENV["MINICOM"] => -c on _ENV["PATH"] => /usr/local/bin:/sbin:/usr/local/sbin:/bin:/usr/bin:/usr/X11/bin:/usr/contrib/bin:/usr/games:/usr/sbin:/home/jmg/bin:/.html:. _ENV["MAIL"] => /var/mail/jmg _ENV["_"] => /usr/local/src/pending/php-5.2.5/sapi/cli/php _ENV["BLOCKSIZE"] => 1k _ENV["PWD"] => /usr/local/src/pending/php-5.2.5 _ENV["EXINIT"] => set autoindent _ENV["WWW_HOME"] => http://www.interkan.net/ _ENV["EDITOR"] => pico _ENV["TEST_PHP_EXECUTABLE"] => /usr/local/src/pending/php-5.2.5/sapi/cli/php _ENV["ignoreeof"] => _ENV["SUDO_COMMAND"] => /usr/bin/nice make test _ENV["HOME"] => /home/jmg _ENV["SHLVL"] => 3 _ENV["LS_OPTIONS"] => --color=auto -F -b -T 0 _ENV["LOGNAME"] => root _ENV["LESS"] => -M _ENV["SSH_CONNECTION"] => deleted _ENV["MOZILLA_HOME"] => /usr/lib/netscape _ENV["LESSOPEN"] => |lesspipe.sh %s _ENV["SUDO_GID"] => 69 _ENV["CC"] => gcc PHP License This program is free software; you can redistribute it and/or modify it under the terms of the PHP License as published by the PHP Group and included in the distribution in the file: LICENSE This program is distributed in the hope that it will be useful, but WITHOUT ANY WARRANTY; without even the implied warranty of MERCHANTABILITY or FITNESS FOR A PARTICULAR PURPOSE. If you did not receive a copy of the PHP license, or have any questions about PHP licensing, please contact license@php.net.

« previous php.qa (#52028) next »