Test results for 5.2.5 [failed]
| From: | noreply@php.net | Date: | Thu, 15 Nov 2007 05:35:40 +0000 |
| Subject: | Test results for 5.2.5 [failed] | ||
| Groups: | php.qa | ||
| Request: | Send a blank email to php-qa+get-52104@lists.php.net to get a copy of this message | ||
=====================================================================
FAILED TEST SUMMARY
---------------------------------------------------------------------
Test fileperms() & chmod() functions: usage variation - misc. perms
[ext/standard/tests/file/006_variation2.phpt]
Test readlink() and realpath functions: basic functionality - diff. path notation for links(Bug
#42038) [ext/standard/tests/file/readlink_realpath_basic1.phpt]
Test readlink() and realpath() functions: usage variation - linkname/filename stored in object(Bug
#42038) [ext/standard/tests/file/readlink_realpath_variation1.phpt]
Test readlink() and realpath() functions: usage variation - linkname/filename stored in array(Bug
#42038) [ext/standard/tests/file/readlink_realpath_variation2.phpt]
proc_open [ext/standard/tests/general_functions/proc_open02.phpt]
htmlentities() test 2 (setlocale / fr_FR.ISO-8859-15)
[ext/standard/tests/strings/htmlentities02.phpt] (warn: possibly braindead libc)
htmlentities() test 4 (setlocale / ja_JP.EUC-JP) [ext/standard/tests/strings/htmlentities04.phpt]
(warn: possibly braindead libc)
htmlentities() test 15 (setlocale / KOI8-R) [ext/standard/tests/strings/htmlentities15.phpt] (warn:
possibly braindead libc)
money_format test [ext/standard/tests/strings/moneyformat.phpt]
Test setlocale() function : basic functionality - setting system locale to a specific
[ext/standard/tests/strings/setlocale_basic1.phpt]
Test setlocale() function : basic functionality - set locale using an array
[ext/standard/tests/strings/setlocale_basic2.phpt]
Test setlocale() function : basic functionality - passing multiple locales as argument
[ext/standard/tests/strings/setlocale_basic3.phpt]
Test setlocale() function : usage variations - passing multiple valid/invlaid locales as argument
[ext/standard/tests/strings/setlocale_variation1.phpt]
Test setlocale() function : usage variations - Setting all available locales in the platform
[ext/standard/tests/strings/setlocale_variation2.phpt]
Test setlocale() function : usage variations - setting system locale = 0
[ext/standard/tests/strings/setlocale_variation3.phpt]
Test setlocale() function : usage variations - setting system locale as null
[ext/standard/tests/strings/setlocale_variation4.phpt]
Test setlocale() function : usage variations - Setting system locale as empty string
[ext/standard/tests/strings/setlocale_variation5.phpt]
=====================================================================
=====================================================================
TEST RESULT SUMMARY
---------------------------------------------------------------------
Exts skipped : 50
Exts tested : 29
---------------------------------------------------------------------
Number of tests : 4616 3225
Tests skipped : 1391 ( 30.1%) --------
Tests warned : 3 ( 0.1%) ( 0.1%)
Tests failed : 14 ( 0.3%) ( 0.4%)
Tests passed : 3208 ( 69.5%) ( 99.5%)
---------------------------------------------------------------------
Time taken : 274 seconds
=====================================================================
=====================================================================
FAILED TEST SUMMARY
---------------------------------------------------------------------
Test fileperms() & chmod() functions: usage variation - misc. perms
[ext/standard/tests/file/006_variation2.phpt]
Test readlink() and realpath functions: basic functionality - diff. path notation for links(Bug
#42038) [ext/standard/tests/file/readlink_realpath_basic1.phpt]
Test readlink() and realpath() functions: usage variation - linkname/filename stored in object(Bug
#42038) [ext/standard/tests/file/readlink_realpath_variation1.phpt]
Test readlink() and realpath() functions: usage variation - linkname/filename stored in array(Bug
#42038) [ext/standard/tests/file/readlink_realpath_variation2.phpt]
proc_open [ext/standard/tests/general_functions/proc_open02.phpt]
htmlentities() test 2 (setlocale / fr_FR.ISO-8859-15)
[ext/standard/tests/strings/htmlentities02.phpt] (warn: possibly braindead libc)
htmlentities() test 4 (setlocale / ja_JP.EUC-JP) [ext/standard/tests/strings/htmlentities04.phpt]
(warn: possibly braindead libc)
htmlentities() test 15 (setlocale / KOI8-R) [ext/standard/tests/strings/htmlentities15.phpt] (warn:
possibly braindead libc)
money_format test [ext/standard/tests/strings/moneyformat.phpt]
Test setlocale() function : basic functionality - setting system locale to a specific
[ext/standard/tests/strings/setlocale_basic1.phpt]
Test setlocale() function : basic functionality - set locale using an array
[ext/standard/tests/strings/setlocale_basic2.phpt]
Test setlocale() function : basic functionality - passing multiple locales as argument
[ext/standard/tests/strings/setlocale_basic3.phpt]
Test setlocale() function : usage variations - passing multiple valid/invlaid locales as argument
[ext/standard/tests/strings/setlocale_variation1.phpt]
Test setlocale() function : usage variations - Setting all available locales in the platform
[ext/standard/tests/strings/setlocale_variation2.phpt]
Test setlocale() function : usage variations - setting system locale = 0
[ext/standard/tests/strings/setlocale_variation3.phpt]
Test setlocale() function : usage variations - setting system locale as null
[ext/standard/tests/strings/setlocale_variation4.phpt]
Test setlocale() function : usage variations - Setting system locale as empty string
[ext/standard/tests/strings/setlocale_variation5.phpt]
=====================================================================
================================================================================
/home/roomshare/tmp/php-5.2.5/ext/standard/tests/file/006_variation2.phpt
================================================================================
*** Testing fileperms() & chmod() : usage variations ***
*** Testing fileperms(), chmod() with miscellaneous permissions ***
-- Iteration 1 --
Warning: chmod(): Inappropriate file type or format in
/home/roomshare/tmp/php-5.2.5/ext/standard/tests/file/006_variation2.php on line 51
bool(false)
100644
bool(true)
47777
-- Iteration 2 --
bool(true)
100000
bool(true)
40000
-- Iteration 3 --
Warning: chmod(): Inappropriate file type or format in
/home/roomshare/tmp/php-5.2.5/ext/standard/tests/file/006_variation2.php on line 51
bool(false)
100000
bool(true)
41000
-- Iteration 4 --
Warning: chmod(): Inappropriate file type or format in
/home/roomshare/tmp/php-5.2.5/ext/standard/tests/file/006_variation2.php on line 51
bool(false)
100000
bool(true)
41111
-- Iteration 5 --
Warning: chmod(): Inappropriate file type or format in
/home/roomshare/tmp/php-5.2.5/ext/standard/tests/file/006_variation2.php on line 51
bool(false)
100000
bool(true)
47001
-- Iteration 6 --
bool(true)
100001
bool(true)
40001
-- Iteration 7 --
Warning: chmod(): Inappropriate file type or format in
/home/roomshare/tmp/php-5.2.5/ext/standard/tests/file/006_variation2.php on line 51
bool(false)
100001
bool(true)
41411
-- Iteration 8 --
Warning: chmod(): Inappropriate file type or format in
/home/roomshare/tmp/php-5.2.5/ext/standard/tests/file/006_variation2.php on line 51
bool(false)
100001
bool(true)
47141
-- Iteration 9 --
bool(true)
100637
bool(true)
40637
-- Iteration 10 --
Warning: chmod(): Inappropriate file type or format in
/home/roomshare/tmp/php-5.2.5/ext/standard/tests/file/006_variation2.php on line 51
bool(false)
100637
bool(true)
43567
-- Iteration 11 --
Warning: chmod(): Inappropriate file type or format in
/home/roomshare/tmp/php-5.2.5/ext/standard/tests/file/006_variation2.php on line 51
bool(false)
100637
bool(true)
43567
-- Iteration 12 --
bool(true)
100000
bool(true)
40000
-- Iteration 13 --
bool(true)
100000
bool(true)
40000
-- Iteration 14 --
bool(true)
100000
bool(true)
40000
-- Iteration 15 --
bool(true)
100000
bool(true)
40000
*** Done ***
================================================================================
005+
006+ Warning: chmod(): Inappropriate file type or format in
/home/roomshare/tmp/php-5.2.5/ext/standard/tests/file/006_variation2.php on line 51
007+ bool(false)
008+ 100644
006- 107777
007- bool(true)
016- 101000
017- bool(true)
017+
018+ Warning: chmod(): Inappropriate file type or format in
/home/roomshare/tmp/php-5.2.5/ext/standard/tests/file/006_variation2.php on line 51
019+ bool(false)
020+ 100000
021- 101111
022- bool(true)
024+
025+ Warning: chmod(): Inappropriate file type or format in
/home/roomshare/tmp/php-5.2.5/ext/standard/tests/file/006_variation2.php on line 51
026+ bool(false)
027+ 100000
026- 107001
027- bool(true)
031+
032+ Warning: chmod(): Inappropriate file type or format in
/home/roomshare/tmp/php-5.2.5/ext/standard/tests/file/006_variation2.php on line 51
033+ bool(false)
034+ 100000
036- 101411
037- bool(true)
041- 107141
042- bool(true)
043+
044+ Warning: chmod(): Inappropriate file type or format in
/home/roomshare/tmp/php-5.2.5/ext/standard/tests/file/006_variation2.php on line 51
045+ bool(false)
046+ 100001
050+
051+ Warning: chmod(): Inappropriate file type or format in
/home/roomshare/tmp/php-5.2.5/ext/standard/tests/file/006_variation2.php on line 51
052+ bool(false)
053+ 100001
051- 103567
052- bool(true)
053- 43567
054- -- Iteration 11 --
056- 103567
057- bool(true)
062+
063+ Warning: chmod(): Inappropriate file type or format in
/home/roomshare/tmp/php-5.2.5/ext/standard/tests/file/006_variation2.php on line 51
064+ bool(false)
065+ 100637
067+ 43567
068+ -- Iteration 11 --
069+
070+ Warning: chmod(): Inappropriate file type or format in
/home/roomshare/tmp/php-5.2.5/ext/standard/tests/file/006_variation2.php on line 51
071+ bool(false)
072+ 100637
================================================================================
================================================================================
/home/roomshare/tmp/php-5.2.5/ext/standard/tests/file/readlink_realpath_basic1.phpt
================================================================================
*** Testing readlink() and realpath(): with valid and invalid path ***
-- Iteration 1 --
string(112)
"/home/roomshare/tmp/php-5.2.5/ext/standard/tests/file/readlink_realpath_basic1/home/readlink_realpath_basic1.tmp"
string(117)
"/home/roomshare/tmp/php-5.2.5/ext/standard/tests/file/readlink_realpath_basic1/home/readlink_realpath_basic1_link.tmp"
-- Iteration 2 --
string(117)
"/home/roomshare/tmp/php-5.2.5/ext/standard/tests/file/readlink_realpath_basic1/home/test/readlink_realpath_basic1.tmp"
string(122)
"/home/roomshare/tmp/php-5.2.5/ext/standard/tests/file/readlink_realpath_basic1/home/test/readlink_realpath_basic1_link.tmp"
-- Iteration 3 --
string(117)
"/home/roomshare/tmp/php-5.2.5/ext/standard/tests/file/readlink_realpath_basic1/home/test/readlink_realpath_basic1.tmp"
string(117)
"/home/roomshare/tmp/php-5.2.5/ext/standard/tests/file/readlink_realpath_basic1/home/test/readlink_realpath_basic1.tmp"
-- Iteration 4 --
string(112)
"/home/roomshare/tmp/php-5.2.5/ext/standard/tests/file/readlink_realpath_basic1/home/readlink_realpath_basic1.tmp"
string(117)
"/home/roomshare/tmp/php-5.2.5/ext/standard/tests/file/readlink_realpath_basic1/home/readlink_realpath_basic1_link.tmp"
-- Iteration 5 --
Warning: readlink(): No such file or directory in
/home/roomshare/tmp/php-5.2.5/ext/standard/tests/file/readlink_realpath_basic1.php on line 48
bool(false)
bool(false)
-- Iteration 6 --
Warning: readlink(): No such file or directory in
/home/roomshare/tmp/php-5.2.5/ext/standard/tests/file/readlink_realpath_basic1.php on line 48
bool(false)
bool(false)
-- Iteration 7 --
Warning: readlink(): No such file or directory in
/home/roomshare/tmp/php-5.2.5/ext/standard/tests/file/readlink_realpath_basic1.php on line 48
bool(false)
string(114)
"/home/roomshare/tmp/php-5.2.5/ext/standard/tests/file/readlink_realpath_basic1/..readlink_realpath_basic1_link.tmp"
-- Iteration 8 --
Warning: readlink(): Invalid argument in
/home/roomshare/tmp/php-5.2.5/ext/standard/tests/file/readlink_realpath_basic1.php on line 48
bool(false)
string(117)
"/home/roomshare/tmp/php-5.2.5/ext/standard/tests/file/readlink_realpath_basic1/home/test/readlink_realpath_basic1.tmp"
Done
================================================================================
005+ string(117)
"/home/roomshare/tmp/php-5.2.5/ext/standard/tests/file/readlink_realpath_basic1/home/readlink_realpath_basic1_link.tmp"
005- string(%d) "%s/readlink_realpath_basic1/home/readlink_realpath_basic1.tmp"
009+ string(122)
"/home/roomshare/tmp/php-5.2.5/ext/standard/tests/file/readlink_realpath_basic1/home/test/readlink_realpath_basic1_link.tmp"
009- string(%d) "%s/readlink_realpath_basic1/home/test/readlink_realpath_basic1.tmp"
017+ string(117)
"/home/roomshare/tmp/php-5.2.5/ext/standard/tests/file/readlink_realpath_basic1/home/readlink_realpath_basic1_link.tmp"
017- string(%d) "%s/readlink_realpath_basic1/home/readlink_realpath_basic1.tmp"
================================================================================
================================================================================
/home/roomshare/tmp/php-5.2.5/ext/standard/tests/file/readlink_realpath_variation1.phpt
================================================================================
*** Testing readlink() and realpath() : usage variations ***
*** Testing readlink() and realpath() with linkname stored inside a object ***
-- Testing readlink() and realpath() with softlink, linkname stored inside an object --
bool(true)
string(131)
"/home/roomshare/tmp/php-5.2.5/ext/standard/tests/file/readlink_realpath_variation1/home/tests/link/readlink_realpath_variation1.tmp"
string(125)
"/home/roomshare/tmp/php-5.2.5/ext/standard/tests/file/readlink_realpath_variation1/home/readlink_realpath_variation1_link.tmp"
bool(true)
string(131)
"/home/roomshare/tmp/php-5.2.5/ext/standard/tests/file/readlink_realpath_variation1/home/tests/link/readlink_realpath_variation1.tmp"
string(91)
"/home/roomshare/tmp/php-5.2.5/ext/standard/tests/file/readlink_realpath_variation1_link.tmp"
-- Testing readlink() and realpath() with hardlink, linkname stored inside an object --
bool(true)
Warning: readlink(): Invalid argument in
/home/roomshare/tmp/php-5.2.5/ext/standard/tests/file/readlink_realpath_variation1.php on line 45
bool(false)
string(125)
"/home/roomshare/tmp/php-5.2.5/ext/standard/tests/file/readlink_realpath_variation1/home/readlink_realpath_variation1_link.tmp"
bool(true)
Warning: readlink(): Invalid argument in
/home/roomshare/tmp/php-5.2.5/ext/standard/tests/file/readlink_realpath_variation1.php on line 48
bool(false)
string(91)
"/home/roomshare/tmp/php-5.2.5/ext/standard/tests/file/readlink_realpath_variation1_link.tmp"
Done
================================================================================
008+ string(125)
"/home/roomshare/tmp/php-5.2.5/ext/standard/tests/file/readlink_realpath_variation1/home/readlink_realpath_variation1_link.tmp"
008- string(%d)
"%s/readlink_realpath_variation1/home/tests/link/readlink_realpath_variation1.tmp"
011+ string(91)
"/home/roomshare/tmp/php-5.2.5/ext/standard/tests/file/readlink_realpath_variation1_link.tmp"
011- string(%d)
"%s/readlink_realpath_variation1/home/tests/link/readlink_realpath_variation1.tmp"
================================================================================
================================================================================
/home/roomshare/tmp/php-5.2.5/ext/standard/tests/file/readlink_realpath_variation2.phpt
================================================================================
*** Testing readlink() and realpath() : usage variations ***
*** Testing readlink() and realpath() with linkname stored in an array ***
-- Testing readlink() and realpath() with softlink, linkname stored inside an array --
bool(true)
string(131)
"/home/roomshare/tmp/php-5.2.5/ext/standard/tests/file/readlink_realpath_variation2/home/tests/link/readlink_realpath_variation2.tmp"
string(136)
"/home/roomshare/tmp/php-5.2.5/ext/standard/tests/file/readlink_realpath_variation2/home/tests/link/readlink_realpath_variation2_link.tmp"
Warning: symlink(): No such file or directory in
/home/roomshare/tmp/php-5.2.5/ext/standard/tests/file/readlink_realpath_variation2.php on line 29
bool(false)
Warning: readlink(): No such file or directory in
/home/roomshare/tmp/php-5.2.5/ext/standard/tests/file/readlink_realpath_variation2.php on line 30
bool(false)
bool(false)
Warning:
unlink(/home/roomshare/tmp/php-5.2.5/ext/standard/tests/file/./readlink_realpath_variation2/home/../home//tests//..//..//..//home//readlink_realpath_variation2_link.tmp/):
No such file or directory in
/home/roomshare/tmp/php-5.2.5/ext/standard/tests/file/readlink_realpath_variation2.php on line 35
-- Testing readlink() and realpath() with hardlink, linkname stored inside an array --
bool(true)
Warning: readlink(): Invalid argument in
/home/roomshare/tmp/php-5.2.5/ext/standard/tests/file/readlink_realpath_variation2.php on line 40
bool(false)
string(136)
"/home/roomshare/tmp/php-5.2.5/ext/standard/tests/file/readlink_realpath_variation2/home/tests/link/readlink_realpath_variation2_link.tmp"
Warning: link(): No such file or directory in
/home/roomshare/tmp/php-5.2.5/ext/standard/tests/file/readlink_realpath_variation2.php on line 42
bool(false)
Warning: readlink(): No such file or directory in
/home/roomshare/tmp/php-5.2.5/ext/standard/tests/file/readlink_realpath_variation2.php on line 43
bool(false)
bool(false)
Warning:
unlink(/home/roomshare/tmp/php-5.2.5/ext/standard/tests/file/./readlink_realpath_variation2/home/../home//tests//..//..//..//home//readlink_realpath_variation2_link.tmp/):
No such file or directory in
/home/roomshare/tmp/php-5.2.5/ext/standard/tests/file/readlink_realpath_variation2.php on line 48
Done
================================================================================
008+ string(136)
"/home/roomshare/tmp/php-5.2.5/ext/standard/tests/file/readlink_realpath_variation2/home/tests/link/readlink_realpath_variation2_link.tmp"
008- string(%d)
"%s/readlink_realpath_variation2/home/tests/link/readlink_realpath_variation2.tmp"
================================================================================
================================================================================
/home/roomshare/tmp/php-5.2.5/ext/standard/tests/general_functions/proc_open02.phpt
================================================================================
bool(true)
array(8) {
["command"]=>
string(28) "/usr/bin/nohup /bin/sleep 50"
["pid"]=>
int(15299)
["running"]=>
bool(false)
["signaled"]=>
bool(true)
["stopped"]=>
bool(false)
["exitcode"]=>
int(-1)
["termsig"]=>
int(1)
["stopsig"]=>
int(0)
}
bool(false)
array(8) {
["command"]=>
string(28) "/usr/bin/nohup /bin/sleep 50"
["pid"]=>
int(15299)
["running"]=>
bool(false)
["signaled"]=>
bool(false)
["stopped"]=>
bool(false)
["exitcode"]=>
int(-1)
["termsig"]=>
int(0)
["stopsig"]=>
int(0)
}
Done!
================================================================================
008+ bool(false)
009+ ["signaled"]=>
009- ["signaled"]=>
010- bool(false)
016+ int(1)
016- int(0)
020+ bool(false)
020- bool(true)
029+ bool(false)
029- bool(true)
035+ int(0)
035- int(15)
================================================================================
================================================================================
/home/roomshare/tmp/php-5.2.5/ext/standard/tests/strings/htmlentities02.phpt (warn: possibly
braindead libc)
================================================================================
string(24) "¼½¾"
================================================================================
001+ string(24) "¼½¾"
001- string(20) "ŒœŸ"
================================================================================
================================================================================
/home/roomshare/tmp/php-5.2.5/ext/standard/tests/strings/htmlentities04.phpt (warn: possibly
braindead libc)
================================================================================
string(42) "¡¢¡£¡¤"
================================================================================
001+ string(42) "¡¢¡£¡¤"
001- string(6) "¡¢¡£¡¤"
================================================================================
================================================================================
/home/roomshare/tmp/php-5.2.5/ext/standard/tests/strings/htmlentities15.phpt (warn: possibly
braindead libc)
================================================================================
string(9) "ÒÏÓËÏÛÎÙÊ"
string(63)
"ÒÏÓËÏÛÎÙÊ"
================================================================================
002+ string(63)
"ÒÏÓËÏÛÎÙÊ"
002- string(63)
"роскошный"
================================================================================
================================================================================
/home/roomshare/tmp/php-5.2.5/ext/standard/tests/strings/moneyformat.phpt
================================================================================
string(6) "X3.14Y"
Warning: money_format(): Only a single %i or %n token can be used in
/home/roomshare/tmp/php-5.2.5/ext/standard/tests/strings/moneyformat.php on line 4
bool(false)
================================================================================
001+ string(6) "X3.14Y"
001- string(7) "X$3.14Y"
================================================================================
================================================================================
/home/roomshare/tmp/php-5.2.5/ext/standard/tests/strings/setlocale_basic1.phpt
================================================================================
*** Testing setlocale() : basic functionality - set to a specific locale ***
Setting system locale(LC_ALL) to Checking currency settings in the new locale, expected: EUR, Found:
Test FAILED.
Done
================================================================================
003+ Test FAILED.
003- string(%d) %s
004- Checking currency settings in the new locale, expected: %s, Found: %s
005- Test PASSED.
================================================================================
================================================================================
/home/roomshare/tmp/php-5.2.5/ext/standard/tests/strings/setlocale_basic2.phpt
================================================================================
*** Testing setlocale() with an array containing list of locales ***
-- Testing setlocale() : 'category' argument as LC_ALL & 'locale' argument
as an array --
Test FAILED.
Done
================================================================================
003+ Test FAILED.
003- string(%d) "%s"
004- Checking currency settings in the new locale, expected: %s, Found: %s
005- Test PASSED.
================================================================================
================================================================================
/home/roomshare/tmp/php-5.2.5/ext/standard/tests/strings/setlocale_basic3.phpt
================================================================================
*** Testing setlocale() by passing multiple locales as argument ***
Done
================================================================================
002- -- Testing setlocale() by giving 'category' as LC_ALL & multiple
locales(en_US.utf8, Ko_KR.utf8, zh_CN.utf8) --
003- string(%d) "%s"
004- Checking currency settings in the new locale, expected: %s, Found: %s
005- Test PASSED.
================================================================================
================================================================================
/home/roomshare/tmp/php-5.2.5/ext/standard/tests/strings/setlocale_variation1.phpt
================================================================================
*** Testing setlocale() by passing multiple valid/invalid locales as argument ***
Done
================================================================================
002- -- Testing setlocale() by giving 'category' as LC_ALL & multiple
locales(en_US.invalid, en_US.utf8, Ko_KR.utf8, KO_KR.invalid, zh_CN.utf8) --
003- string(%d) "%s"
004- Checking currency settings in the new locale, expected: %s, Found: %s
005- Test PASSED.
================================================================================
================================================================================
/home/roomshare/tmp/php-5.2.5/ext/standard/tests/strings/setlocale_variation2.phpt
================================================================================
*** Testing setlocale() : usage variations ***
-- Test setlocale() with all available locale in the system --
No of locales found on the machine = 231
No of setlocale() success = 221
Expected no of failures = 0
Test FAILED
Names of locale() for which setlocale() failed ...
array(10) {
[0]=>
string(11) "la_LN.ASCII"
[1]=>
string(15) "la_LN.ISO8859-1"
[2]=>
string(16) "la_LN.ISO8859-15"
[3]=>
string(15) "la_LN.ISO8859-2"
[4]=>
string(15) "la_LN.ISO8859-4"
[5]=>
string(16) "la_LN.ISO_8859-1"
[6]=>
string(17) "la_LN.ISO_8859-15"
[7]=>
string(16) "la_LN.ISO_8859-2"
[8]=>
string(16) "la_LN.ISO_8859-4"
[9]=>
string(14) "la_LN.US-ASCII"
}
Done
================================================================================
006+ Test FAILED
007+ Names of locale() for which setlocale() failed ...
006- Test PASSED
007- Done
008+ array(10) {
009+ [0]=>
010+ string(11) "la_LN.ASCII"
011+ [1]=>
012+ string(15) "la_LN.ISO8859-1"
013+ [2]=>
014+ string(16) "la_LN.ISO8859-15"
015+ [3]=>
016+ string(15) "la_LN.ISO8859-2"
017+ [4]=>
018+ string(15) "la_LN.ISO8859-4"
019+ [5]=>
020+ string(16) "la_LN.ISO_8859-1"
021+ [6]=>
022+ string(17) "la_LN.ISO_8859-15"
023+ [7]=>
024+ string(16) "la_LN.ISO_8859-2"
025+ [8]=>
026+ string(16) "la_LN.ISO_8859-4"
027+ [9]=>
028+ string(14) "la_LN.US-ASCII"
029+ }
030+ Done
================================================================================
================================================================================
/home/roomshare/tmp/php-5.2.5/ext/standard/tests/strings/setlocale_variation3.phpt
================================================================================
*** Testing setlocale() : usage variations - setting system locale = 0 ***
Locale info, before setting the locale
array(18) {
["decimal_point"]=>
string(1) "."
["thousands_sep"]=>
string(0) ""
["int_curr_symbol"]=>
string(0) ""
["currency_symbol"]=>
string(0) ""
["mon_decimal_point"]=>
string(0) ""
["mon_thousands_sep"]=>
string(0) ""
["positive_sign"]=>
string(0) ""
["negative_sign"]=>
string(0) ""
["int_frac_digits"]=>
int(127)
["frac_digits"]=>
int(127)
["p_cs_precedes"]=>
int(127)
["p_sep_by_space"]=>
int(127)
["n_cs_precedes"]=>
int(127)
["n_sep_by_space"]=>
int(127)
["p_sign_posn"]=>
int(127)
["n_sign_posn"]=>
int(127)
["grouping"]=>
array(1) {
[0]=>
int(127)
}
["mon_grouping"]=>
array(1) {
[0]=>
int(127)
}
}
Setting system locale, category = LC_ALL and locale = 0
Locale info, after setting the locale
array(18) {
["decimal_point"]=>
string(1) "."
["thousands_sep"]=>
string(0) ""
["int_curr_symbol"]=>
string(0) ""
["currency_symbol"]=>
string(0) ""
["mon_decimal_point"]=>
string(0) ""
["mon_thousands_sep"]=>
string(0) ""
["positive_sign"]=>
string(0) ""
["negative_sign"]=>
string(0) ""
["int_frac_digits"]=>
int(127)
["frac_digits"]=>
int(127)
["p_cs_precedes"]=>
int(127)
["p_sep_by_space"]=>
int(127)
["n_cs_precedes"]=>
int(127)
["n_sep_by_space"]=>
int(127)
["p_sign_posn"]=>
int(127)
["n_sign_posn"]=>
int(127)
["grouping"]=>
array(1) {
[0]=>
int(127)
}
["mon_grouping"]=>
array(1) {
[0]=>
int(127)
}
}
Checking locale in the system, Expected : no change in the existing locale
Test PASSED.
Done
================================================================================
007+ string(0) ""
007- string(1) ","
009+ string(0) ""
009- string(4) "USD "
011+ string(0) ""
011- string(1) "$"
013+ string(0) ""
013- string(1) "."
015+ string(0) ""
015- string(1) ","
019+ string(0) ""
019- string(1) "-"
021+ int(127)
021- int(2)
023+ int(127)
023- int(2)
025+ int(127)
025- int(1)
027+ int(127)
027- int(0)
029+ int(127)
029- int(1)
031+ int(127)
031- int(0)
033+ int(127)
033- int(1)
035+ int(127)
035- int(1)
037+ array(1) {
037- array(2) {
039+ int(127)
039- int(3)
040- [1]=>
041- int(3)
042+ array(1) {
044+ int(127)
044- array(2) {
046- int(3)
047- [1]=>
048- int(3)
053+ string(0) ""
055+ string(0) ""
057+ string(0) ""
057- string(1) ","
059+ string(0) ""
059- string(4) "USD "
061+ string(0) ""
061- string(1) "$"
063- string(1) "."
065+ string(0) ""
065- string(1) ","
067+ int(127)
069+ int(127)
069- string(1) "-"
071+ int(127)
071- int(2)
073+ int(127)
073- int(2)
075+ int(127)
075- int(1)
077+ int(127)
077- int(0)
079+ int(127)
079- int(1)
081+ int(127)
081- int(0)
083+ array(1) {
083- int(1)
085+ int(127)
085- int(1)
087- array(2) {
088+ array(1) {
089- int(3)
090- [1]=>
091- int(3)
090+ int(127)
094- array(2) {
096- int(3)
097- [1]=>
098- int(3)
================================================================================
================================================================================
/home/roomshare/tmp/php-5.2.5/ext/standard/tests/strings/setlocale_variation4.phpt
================================================================================
*** Testing setlocale() : usage variations - Setting system locale = null ***
Locale info, before setting the locale
array(18) {
["decimal_point"]=>
string(1) "."
["thousands_sep"]=>
string(0) ""
["int_curr_symbol"]=>
string(0) ""
["currency_symbol"]=>
string(0) ""
["mon_decimal_point"]=>
string(0) ""
["mon_thousands_sep"]=>
string(0) ""
["positive_sign"]=>
string(0) ""
["negative_sign"]=>
string(0) ""
["int_frac_digits"]=>
int(127)
["frac_digits"]=>
int(127)
["p_cs_precedes"]=>
int(127)
["p_sep_by_space"]=>
int(127)
["n_cs_precedes"]=>
int(127)
["n_sep_by_space"]=>
int(127)
["p_sign_posn"]=>
int(127)
["n_sign_posn"]=>
int(127)
["grouping"]=>
array(1) {
[0]=>
int(127)
}
["mon_grouping"]=>
array(1) {
[0]=>
int(127)
}
}
Setting system locale, category = LC_ALL and locale = null
Locale info, after setting the locale
array(18) {
["decimal_point"]=>
string(1) "."
["thousands_sep"]=>
string(0) ""
["int_curr_symbol"]=>
string(0) ""
["currency_symbol"]=>
string(0) ""
["mon_decimal_point"]=>
string(0) ""
["mon_thousands_sep"]=>
string(0) ""
["positive_sign"]=>
string(0) ""
["negative_sign"]=>
string(0) ""
["int_frac_digits"]=>
int(127)
["frac_digits"]=>
int(127)
["p_cs_precedes"]=>
int(127)
["p_sep_by_space"]=>
int(127)
["n_cs_precedes"]=>
int(127)
["n_sep_by_space"]=>
int(127)
["p_sign_posn"]=>
int(127)
["n_sign_posn"]=>
int(127)
["grouping"]=>
array(1) {
[0]=>
int(127)
}
["mon_grouping"]=>
array(1) {
[0]=>
int(127)
}
}
Checking new locale in the system, Expected : the locale names will be set from the values of
environment variables
Test FAILED.
Done
================================================================================
007+ string(0) ""
007- string(1) ","
009+ string(0) ""
009- string(4) "AUD "
011+ string(0) ""
011- string(1) "$"
013+ string(0) ""
013- string(1) "."
015+ string(0) ""
015- string(1) ","
019+ string(0) ""
019- string(1) "-"
021+ int(127)
021- int(2)
023+ int(127)
023- int(2)
025+ int(127)
025- int(1)
027+ int(127)
027- int(0)
029+ int(127)
029- int(1)
031+ int(127)
031- int(0)
033+ int(127)
033- int(1)
035+ int(127)
035- int(1)
037+ array(1) {
037- array(2) {
039+ int(127)
039- int(3)
040- [1]=>
041- int(3)
042+ array(1) {
044+ int(127)
044- array(2) {
046- int(3)
047- [1]=>
048- int(3)
053+ string(0) ""
055+ string(0) ""
057+ string(0) ""
057- string(1) ","
059+ string(0) ""
059- string(4) "USD "
061+ string(0) ""
061- string(1) "$"
063- string(1) "."
065+ string(0) ""
065- string(1) ","
067+ int(127)
069+ int(127)
069- string(1) "-"
071+ int(127)
071- int(2)
073+ int(127)
073- int(2)
075+ int(127)
075- int(1)
077+ int(127)
077- int(0)
079+ int(127)
079- int(1)
081+ int(127)
081- int(0)
083+ array(1) {
083- int(1)
085+ int(127)
085- int(1)
087- array(2) {
088+ array(1) {
089- int(3)
090- [1]=>
091- int(3)
090+ int(127)
094+ Test FAILED.
094- array(2) {
096- int(3)
097- [1]=>
098- int(3)
102- Test PASSED.
================================================================================
================================================================================
/home/roomshare/tmp/php-5.2.5/ext/standard/tests/strings/setlocale_variation5.phpt
================================================================================
*** Testing setlocale() : usage variations - setting system locale = "" ***
Locale info, before setting the locale
array(18) {
["decimal_point"]=>
string(1) "."
["thousands_sep"]=>
string(0) ""
["int_curr_symbol"]=>
string(0) ""
["currency_symbol"]=>
string(0) ""
["mon_decimal_point"]=>
string(0) ""
["mon_thousands_sep"]=>
string(0) ""
["positive_sign"]=>
string(0) ""
["negative_sign"]=>
string(0) ""
["int_frac_digits"]=>
int(127)
["frac_digits"]=>
int(127)
["p_cs_precedes"]=>
int(127)
["p_sep_by_space"]=>
int(127)
["n_cs_precedes"]=>
int(127)
["n_sep_by_space"]=>
int(127)
["p_sign_posn"]=>
int(127)
["n_sign_posn"]=>
int(127)
["grouping"]=>
array(1) {
[0]=>
int(127)
}
["mon_grouping"]=>
array(1) {
[0]=>
int(127)
}
}
Setting system locale, category = LC_ALL and locale = ""
Locale info, after setting the locale
array(18) {
["decimal_point"]=>
string(1) "."
["thousands_sep"]=>
string(0) ""
["int_curr_symbol"]=>
string(0) ""
["currency_symbol"]=>
string(0) ""
["mon_decimal_point"]=>
string(0) ""
["mon_thousands_sep"]=>
string(0) ""
["positive_sign"]=>
string(0) ""
["negative_sign"]=>
string(0) ""
["int_frac_digits"]=>
int(127)
["frac_digits"]=>
int(127)
["p_cs_precedes"]=>
int(127)
["p_sep_by_space"]=>
int(127)
["n_cs_precedes"]=>
int(127)
["n_sep_by_space"]=>
int(127)
["p_sign_posn"]=>
int(127)
["n_sign_posn"]=>
int(127)
["grouping"]=>
array(1) {
[0]=>
int(127)
}
["mon_grouping"]=>
array(1) {
[0]=>
int(127)
}
}
Checking new locale in the system, Expected : the locale names will be set from the values of
environment variables
Test FAILED.
Done
================================================================================
007+ string(0) ""
007- string(1) ","
009+ string(0) ""
009- string(4) "AUD "
011+ string(0) ""
011- string(1) "$"
013+ string(0) ""
013- string(1) "."
015+ string(0) ""
015- string(1) ","
019+ string(0) ""
019- string(1) "-"
021+ int(127)
021- int(2)
023+ int(127)
023- int(2)
025+ int(127)
025- int(1)
027+ int(127)
027- int(0)
029+ int(127)
029- int(1)
031+ int(127)
031- int(0)
033+ int(127)
033- int(1)
035+ int(127)
035- int(1)
037+ array(1) {
037- array(2) {
039+ int(127)
039- int(3)
040- [1]=>
041- int(3)
042+ array(1) {
044+ int(127)
044- array(2) {
046- int(3)
047- [1]=>
048- int(3)
053+ string(0) ""
055+ string(0) ""
057+ string(0) ""
057- string(1) ","
059+ string(0) ""
059- string(4) "USD "
061+ string(0) ""
061- string(1) "$"
063- string(1) "."
065+ string(0) ""
065- string(1) ","
067+ int(127)
069+ int(127)
069- string(1) "-"
071+ int(127)
071- int(2)
073+ int(127)
073- int(2)
075+ int(127)
075- int(1)
077+ int(127)
077- int(0)
079+ int(127)
079- int(1)
081+ int(127)
081- int(0)
083+ array(1) {
083- int(1)
085+ int(127)
085- int(1)
087- array(2) {
088+ array(1) {
089- int(3)
090- [1]=>
091- int(3)
090+ int(127)
094+ Test FAILED.
094- array(2) {
096- int(3)
097- [1]=>
098- int(3)
102- Test PASSED.
================================================================================
================================================================================
BUILD ENVIRONMENT
================================================================================
OS:
FreeBSD - FreeBSD www517.sakura.ne.jp 6.1-RELEASE-p20 FreeBSD 6.1-RELEASE-p20 #0: Thu Nov 15
09:39:44 JST 2007 root@www517.sakura.ne.jp:/usr/src/sys/i386/compile/SAKURA9 i386
Autoconf:
Bundled Libtool:
ltmain.sh (GNU libtool) 1.5.20 (1.1220.2.287 2005/08/31 18:54:15)
Copyright (C) 2005 Free Software Foundation, Inc.
This is free software; see the source for copying conditions. There is NO
warranty; not even for MERCHANTABILITY or FITNESS FOR A PARTICULAR PURPOSE.
System Libtool:
ltmain.sh (GNU libtool) 1.5.22 (1.1220.2.365 2005/12/18 22:14:06)
Copyright (C) 2005 Free Software Foundation, Inc.
This is free software; see the source for copying conditions. There is NO
warranty; not even for MERCHANTABILITY or FITNESS FOR A PARTICULAR PURPOSE.
Compiler:
Using built-in specs.
Configured with: FreeBSD/i386 system compiler
Thread model: posix
gcc version 3.4.4 [FreeBSD] 20050518
Bison:
Libraries:
/home/roomshare/tmp/php-5.2.5/sapi/cli/php:
libcrypt.so.3 => /lib/libcrypt.so.3 (0x28584000)
libmysqlclient.so.12 => /usr/local/lib/mysql/libmysqlclient.so.12 (0x2859c000)
libz.so.3 => /lib/libz.so.3 (0x285d9000)
libm.so.4 => /lib/libm.so.4 (0x285e9000)
libfreetype.so.9 => /usr/local/lib/libfreetype.so.9 (0x285ff000)
libpng.so.5 => /usr/local/lib/libpng.so.5 (0x28663000)
libjpeg.so.9 => /usr/local/lib/libjpeg.so.9 (0x28685000)
libssl.so.4 => /usr/lib/libssl.so.4 (0x286a3000)
libcrypto.so.4 => /lib/libcrypto.so.4 (0x286d1000)
libcurl.so.4 => /usr/local/lib/libcurl.so.4 (0x287c3000)
libxml2.so.5 => /usr/local/lib/libxml2.so.5 (0x287f8000)
libiconv.so.3 => /usr/local/lib/libiconv.so.3 (0x28904000)
libc.so.6 => /lib/libc.so.6 (0x289f1000)
User's E-mail: akky at php dot net
================================================================================
PHPINFO
================================================================================
phpinfo()
PHP Version => 5.2.5
System => FreeBSD www517.sakura.ne.jp 6.1-RELEASE-p20 FreeBSD 6.1-RELEASE-p20 #0: Thu Nov 15
09:39:44 JST 2007 root@www517.sakura.ne.jp:/usr/src/sys/i386/compile/SAKURA9 i386
Build Date => Nov 15 2007 14:27:58
Configure Command => './configure' '--prefix=/home/roomshare/php'
'--with-config-file-path=/home/roomshare/php/php.ini'
'--with-pear=/home/roomshare/php/share/pear' '--enable-force-cgi-redirect'
'--enable-mbstring=all' '--enable-mbregex' '--enable-mbstr-enc-trans'
'--enable-versioning' '--enable-trans-sid' '--with-mysql'
'--with-openssl=/usr' '--with-soap=yes' '--with-zlib'
'--with-gd' '--with-jpeg-dir' '--with-png-dir'
'--with-zlib-dir' '--with-ttf' '--with-freetype-dir=/usr/local'
'--enable-gd-native-ttf' '--enable-gd-jis-conv' '--with-curl'
'--with-pdo' '--with-pdo-mysql=/usr/local/bin/mysql'
Server API => Command Line Interface
Virtual Directory Support => disabled
Configuration File (php.ini) Path => /home/roomshare/php/php.ini
Loaded Configuration File => (none)
PHP API => 20041225
PHP Extension => 20060613
Zend Extension => 220060519
Debug Build => no
Thread Safety => disabled
Zend Memory Manager => enabled
IPv6 Support => enabled
Registered PHP Streams => php, file, data, http, ftp, compress.zlib, https, ftps
Registered Stream Socket Transports => tcp, udp, unix, udg, ssl, sslv3, sslv2, tls
Registered Stream Filters => string.rot13, string.toupper, string.tolower, string.strip_tags,
convert.*, consumed, convert.iconv.*, zlib.*
This program makes use of the Zend Scripting Language Engine:
Zend Engine v2.2.0, Copyright (c) 1998-2007 Zend Technologies
_______________________________________________________________________
Configuration
PHP Core
Directive => Local Value => Master Value
allow_call_time_pass_reference => On => On
allow_url_fopen => On => On
allow_url_include => Off => Off
always_populate_raw_post_data => Off => Off
arg_separator.input => & => &
arg_separator.output => & => &
asp_tags => Off => Off
auto_append_file => no value => no value
auto_globals_jit => On => On
auto_prepend_file => no value => no value
browscap => no value => no value
default_charset => no value => no value
default_mimetype => text/html => text/html
define_syslog_variables => Off => Off
disable_classes => no value => no value
disable_functions => no value => no value
display_errors => STDOUT => STDOUT
display_startup_errors => Off => Off
doc_root => no value => no value
docref_ext => no value => no value
docref_root => no value => no value
enable_dl => On => On
error_append_string => no value => no value
error_log => no value => no value
error_prepend_string => no value => no value
error_reporting => no value => no value
expose_php => On => On
extension_dir => /home/roomshare/php/lib/php/extensions/no-debug-non-zts-20060613 =>
/home/roomshare/php/lib/php/extensions/no-debug-non-zts-20060613
file_uploads => On => On
highlight.bg => <font style="color: #FFFFFF">#FFFFFF</font> => <font
style="color: #FFFFFF">#FFFFFF</font>
highlight.comment => <font style="color: #FF8000">#FF8000</font> =>
<font style="color: #FF8000">#FF8000</font>
highlight.default => <font style="color: #0000BB">#0000BB</font> =>
<font style="color: #0000BB">#0000BB</font>
highlight.html => <font style="color: #000000">#000000</font> =>
<font style="color: #000000">#000000</font>
highlight.keyword => <font style="color: #007700">#007700</font> =>
<font style="color: #007700">#007700</font>
highlight.string => <font style="color: #DD0000">#DD0000</font> =>
<font style="color: #DD0000">#DD0000</font>
html_errors => Off => Off
ignore_repeated_errors => Off => Off
ignore_repeated_source => Off => Off
ignore_user_abort => Off => Off
implicit_flush => On => On
include_path => .:/home/roomshare/php/share/pear => .:/home/roomshare/php/share/pear
log_errors => Off => Off
log_errors_max_len => 1024 => 1024
magic_quotes_gpc => On => On
magic_quotes_runtime => Off => Off
magic_quotes_sybase => Off => Off
mail.force_extra_parameters => no value => no value
max_execution_time => 0 => 0
max_input_nesting_level => 64 => 64
max_input_time => -1 => -1
memory_limit => 128M => 128M
open_basedir => no value => no value
output_buffering => 0 => 0
output_handler => no value => no value
post_max_size => 8M => 8M
precision => 14 => 14
realpath_cache_size => 16K => 16K
realpath_cache_ttl => 120 => 120
register_argc_argv => On => On
register_globals => Off => Off
register_long_arrays => On => On
report_memleaks => On => On
report_zend_debug => Off => Off
safe_mode => Off => Off
safe_mode_exec_dir => /usr/local/php/bin => /usr/local/php/bin
safe_mode_gid => Off => Off
safe_mode_include_dir => no value => no value
sendmail_from => no value => no value
sendmail_path => /usr/sbin/sendmail -t -i => /usr/sbin/sendmail -t -i
serialize_precision => 100 => 100
short_open_tag => On => On
SMTP => localhost => localhost
smtp_port => 25 => 25
sql.safe_mode => Off => Off
track_errors => Off => Off
unserialize_callback_func => no value => no value
upload_max_filesize => 2M => 2M
upload_tmp_dir => no value => no value
user_dir => no value => no value
variables_order => EGPCS => EGPCS
xmlrpc_error_number => 0 => 0
xmlrpc_errors => Off => Off
y2k_compliance => On => On
zend.ze1_compatibility_mode => Off => Off
ctype
ctype functions => enabled
curl
cURL support => enabled
cURL Information => libcurl/7.16.3 OpenSSL/0.9.7e zlib/1.2.2
date
date/time support => enabled
"Olson" Timezone Database Version => 2007.9
Timezone Database => internal
Default timezone => Asia/Tokyo
Directive => Local Value => Master Value
date.default_latitude => 31.7667 => 31.7667
date.default_longitude => 35.2333 => 35.2333
date.sunrise_zenith => 90.583333 => 90.583333
date.sunset_zenith => 90.583333 => 90.583333
date.timezone => no value => no value
dom
DOM/XML => enabled
DOM/XML API Version => 20031129
libxml Version => 2.6.27
HTML Support => enabled
XPath Support => enabled
XPointer Support => enabled
Schema Support => enabled
RelaxNG Support => enabled
filter
Input Validation and Filtering => enabled
Revision => $Revision: 1.52.2.39 $
Directive => Local Value => Master Value
filter.default => unsafe_raw => unsafe_raw
filter.default_flags => no value => no value
gd
GD Support => enabled
GD Version => bundled (2.0.34 compatible)
FreeType Support => enabled
FreeType Linkage => with freetype
FreeType Version => 2.2.1
GIF Read Support => enabled
GIF Create Support => enabled
JPG Support => enabled
PNG Support => enabled
WBMP Support => enabled
XBM Support => enabled
JIS-mapped Japanese Font Support => enabled
hash
hash support => enabled
Hashing Engines => md2 md4 md5 sha1 sha256 sha384 sha512 ripemd128 ripemd160 ripemd256 ripemd320
whirlpool tiger128,3 tiger160,3 tiger192,3 tiger128,4 tiger160,4 tiger192,4 snefru gost adler32
crc32 crc32b haval128,3 haval160,3 haval192,3 haval224,3 haval256,3 haval128,4 haval160,4 haval192,4
haval224,4 haval256,4 haval128,5 haval160,5 haval192,5 haval224,5 haval256,5
iconv
iconv support => enabled
iconv implementation => libiconv
iconv library version => 1.9
Directive => Local Value => Master Value
iconv.input_encoding => ISO-8859-1 => ISO-8859-1
iconv.internal_encoding => ISO-8859-1 => ISO-8859-1
iconv.output_encoding => ISO-8859-1 => ISO-8859-1
json
json support => enabled
json version => 1.2.1
libxml
libXML support => active
libXML Version => 2.6.27
libXML streams => enabled
mbstring
Multibyte Support => enabled
Multibyte string engine => libmbfl
Multibyte (japanese) regex support => enabled
Multibyte regex (oniguruma) version => 4.4.4
Multibyte regex (oniguruma) backtrack check => On
mbstring extension makes use of "streamable kanji code filter and converter", which is
distributed under the GNU Lesser General Public License version 2.1.
Directive => Local Value => Master Value
mbstring.detect_order => no value => no value
mbstring.encoding_translation => Off => Off
mbstring.func_overload => 0 => 0
mbstring.http_input => pass => pass
mbstring.http_output => pass => pass
mbstring.internal_encoding => ISO-8859-1 => no value
mbstring.language => neutral => neutral
mbstring.strict_detection => Off => Off
mbstring.substitute_character => no value => no value
mysql
MySQL Support => enabled
Active Persistent Links => 0
Active Links => 0
Client API version => 4.0.27
MYSQL_MODULE_TYPE => external
MYSQL_SOCKET => /tmp/mysql.sock
MYSQL_INCLUDE => -I/usr/local/include/mysql
MYSQL_LIBS => -L/usr/local/lib/mysql -lmysqlclient
Directive => Local Value => Master Value
mysql.allow_persistent => On => On
mysql.connect_timeout => 60 => 60
mysql.default_host => no value => no value
mysql.default_password => no value => no value
mysql.default_port => no value => no value
mysql.default_socket => no value => no value
mysql.default_user => no value => no value
mysql.max_links => Unlimited => Unlimited
mysql.max_persistent => Unlimited => Unlimited
mysql.trace_mode => Off => Off
openssl
OpenSSL support => enabled
OpenSSL Version => OpenSSL 0.9.7e-p1 25 Oct 2004
pcre
PCRE (Perl Compatible Regular Expressions) Support => enabled
PCRE Library Version => 7.3 2007-08-28
Directive => Local Value => Master Value
pcre.backtrack_limit => 100000 => 100000
pcre.recursion_limit => 100000 => 100000
PDO
PDO support => enabled
PDO drivers => sqlite2, sqlite, mysql
pdo_mysql
PDO Driver for MySQL, client library version => 4.0.27
pdo_sqlite
PDO Driver for SQLite 3.x => enabled
PECL Module version => (bundled) 1.0.1 $Id: pdo_sqlite.c,v 1.10.2.6.2.2 2007/03/23 14:30:00 wez
Exp $
SQLite Library => 3.3.17
posix
Revision => $Revision: 1.70.2.3.2.16 $
Reflection
Reflection => enabled
Version => $Id: php_reflection.c,v 1.164.2.33.2.47 2007/10/28 13:47:14 iliaa Exp $
session
Session Support => enabled
Registered save handlers => files user sqlite
Registered serializer handlers => php php_binary
Directive => Local Value => Master Value
session.auto_start => Off => Off
session.bug_compat_42 => On => On
session.bug_compat_warn => On => On
session.cache_expire => 180 => 180
session.cache_limiter => nocache => nocache
session.cookie_domain => no value => no value
session.cookie_httponly => Off => Off
session.cookie_lifetime => 0 => 0
session.cookie_path => / => /
session.cookie_secure => Off => Off
session.entropy_file => no value => no value
session.entropy_length => 0 => 0
session.gc_divisor => 100 => 100
session.gc_maxlifetime => 1440 => 1440
session.gc_probability => 1 => 1
session.hash_bits_per_character => 4 => 4
session.hash_function => 0 => 0
session.name => PHPSESSID => PHPSESSID
session.referer_check => no value => no value
session.save_handler => files => files
session.save_path => no value => no value
session.serialize_handler => php => php
session.use_cookies => On => On
session.use_only_cookies => Off => Off
session.use_trans_sid => 0 => 0
SimpleXML
Simplexml support => enabled
Revision => $Revision: 1.151.2.22.2.35 $
Schema support => enabled
SPL
SPL support => enabled
Interfaces => Countable, OuterIterator, RecursiveIterator, SeekableIterator, SplObserver,
SplSubject
Classes => AppendIterator, ArrayIterator, ArrayObject, BadFunctionCallException,
BadMethodCallException, CachingIterator, DirectoryIterator, DomainException, EmptyIterator,
FilterIterator, InfiniteIterator, InvalidArgumentException, IteratorIterator, LengthException,
LimitIterator, LogicException, NoRewindIterator, OutOfBoundsException, OutOfRangeException,
OverflowException, ParentIterator, RangeException, RecursiveArrayIterator, RecursiveCachingIterator,
RecursiveDirectoryIterator, RecursiveFilterIterator, RecursiveIteratorIterator,
RecursiveRegexIterator, RegexIterator, RuntimeException, SimpleXMLIterator, SplFileInfo,
SplFileObject, SplObjectStorage, SplTempFileObject, UnderflowException, UnexpectedValueException
SQLite
SQLite support => enabled
PECL Module version => 2.0-dev $Id: sqlite.c,v 1.166.2.13.2.9 2007/05/19 17:58:22 iliaa Exp $
SQLite Library => 2.8.17
SQLite Encoding => iso8859
Directive => Local Value => Master Value
sqlite.assoc_case => 0 => 0
standard
Regex Library => Bundled library enabled
Dynamic Library Support => enabled
Path to sendmail => /usr/sbin/sendmail -t -i
Directive => Local Value => Master Value
assert.active => 1 => 1
assert.bail => 0 => 0
assert.callback => no value => no value
assert.quiet_eval => 0 => 0
assert.warning => 1 => 1
auto_detect_line_endings => 0 => 0
default_socket_timeout => 60 => 60
safe_mode_allowed_env_vars => PHP_ => PHP_
safe_mode_protected_env_vars => LD_LIBRARY_PATH => LD_LIBRARY_PATH
url_rewriter.tags => a=href,area=href,frame=src,form=,fieldset= =>
a=href,area=href,frame=src,form=,fieldset=
user_agent => no value => no value
tokenizer
Tokenizer Support => enabled
xml
XML Support => active
XML Namespace Support => active
libxml2 Version => 2.6.27
xmlreader
XMLReader => enabled
xmlwriter
XMLWriter => enabled
zlib
ZLib Support => enabled
Stream Wrapper support => compress.zlib://
Stream Filter support => zlib.inflate, zlib.deflate
Compiled Version => 1.2.2
Linked Version => 1.2.2
Directive => Local Value => Master Value
zlib.output_compression => Off => Off
zlib.output_compression_level => -1 => -1
zlib.output_handler => no value => no value
Additional Modules
Module Name
Environment
Variable => Value
USER => roomshare
SSH_CLIENT => deleted
MACHTYPE => i386
MAIL => /var/mail/roomshare
PHP_PEAR_CACHE_DIR => /home/roomshare/php/pear/cache
VENDOR => intel
SHLVL => 1
HOME => /home/roomshare
TEST_PHP_SRCDIR => /home/roomshare/tmp/php-5.2.5
SSH_TTY => deleted
PKG_DBDIR => /home/roomshare/db/pkg
PAGER => more
GROUP => users
LOGNAME => roomshare
TEST_PHP_EXECUTABLE => /home/roomshare/tmp/php-5.2.5/sapi/cli/php
TERM => xterm
BLOCKSIZE => K
PATH =>
/sbin:/bin:/usr/sbin:/usr/bin:/usr/games:/usr/local/sbin:/usr/local/bin:/usr/X11R6/bin:/home/roomshare/bin:/home/roomshare/local/bin
REMOTEHOST => 203.112.24.227
SSH_AUTH_SOCK => deleted
SHELL => /bin/csh
HOST => www517.sakura.ne.jp
__MKLVL__ => 1
OSTYPE => FreeBSD
PWD => /home/roomshare/tmp/php-5.2.5
SSH_CONNECTION => deleted
FTP_PASSIVE_MODE => YES
CC => gcc
HOSTTYPE => FreeBSD
EDITOR => vi
PHP Variables
Variable => Value
_SERVER["USER"] => roomshare
_SERVER["SSH_CLIENT"] => deleted
_SERVER["MACHTYPE"] => i386
_SERVER["MAIL"] => /var/mail/roomshare
_SERVER["PHP_PEAR_CACHE_DIR"] => /home/roomshare/php/pear/cache
_SERVER["VENDOR"] => intel
_SERVER["SHLVL"] => 1
_SERVER["HOME"] => /home/roomshare
_SERVER["TEST_PHP_SRCDIR"] => /home/roomshare/tmp/php-5.2.5
_SERVER["SSH_TTY"] => deleted
_SERVER["PKG_DBDIR"] => /home/roomshare/db/pkg
_SERVER["PAGER"] => more
_SERVER["GROUP"] => users
_SERVER["LOGNAME"] => roomshare
_SERVER["TEST_PHP_EXECUTABLE"] => /home/roomshare/tmp/php-5.2.5/sapi/cli/php
_SERVER["TERM"] => xterm
_SERVER["BLOCKSIZE"] => K
_SERVER["PATH"] =>
/sbin:/bin:/usr/sbin:/usr/bin:/usr/games:/usr/local/sbin:/usr/local/bin:/usr/X11R6/bin:/home/roomshare/bin:/home/roomshare/local/bin
_SERVER["REMOTEHOST"] => 203.112.24.227
_SERVER["SSH_AUTH_SOCK"] => deleted
_SERVER["SHELL"] => /bin/csh
_SERVER["HOST"] => www517.sakura.ne.jp
_SERVER["__MKLVL__"] => 1
_SERVER["OSTYPE"] => FreeBSD
_SERVER["PWD"] => /home/roomshare/tmp/php-5.2.5
_SERVER["SSH_CONNECTION"] => deleted
_SERVER["FTP_PASSIVE_MODE"] => YES
_SERVER["CC"] => gcc
_SERVER["HOSTTYPE"] => FreeBSD
_SERVER["EDITOR"] => vi
_SERVER["PHP_SELF"] =>
_SERVER["SCRIPT_NAME"] =>
_SERVER["SCRIPT_FILENAME"] =>
_SERVER["PATH_TRANSLATED"] =>
_SERVER["DOCUMENT_ROOT"] =>
_SERVER["REQUEST_TIME"] => 1195104937
_SERVER["argv"] => Array
(
)
_SERVER["argc"] => 0
_ENV["USER"] => roomshare
_ENV["SSH_CLIENT"] => deleted
_ENV["MACHTYPE"] => i386
_ENV["MAIL"] => /var/mail/roomshare
_ENV["PHP_PEAR_CACHE_DIR"] => /home/roomshare/php/pear/cache
_ENV["VENDOR"] => intel
_ENV["SHLVL"] => 1
_ENV["HOME"] => /home/roomshare
_ENV["TEST_PHP_SRCDIR"] => /home/roomshare/tmp/php-5.2.5
_ENV["SSH_TTY"] => deleted
_ENV["PKG_DBDIR"] => /home/roomshare/db/pkg
_ENV["PAGER"] => more
_ENV["GROUP"] => users
_ENV["LOGNAME"] => roomshare
_ENV["TEST_PHP_EXECUTABLE"] => /home/roomshare/tmp/php-5.2.5/sapi/cli/php
_ENV["TERM"] => xterm
_ENV["BLOCKSIZE"] => K
_ENV["PATH"] =>
/sbin:/bin:/usr/sbin:/usr/bin:/usr/games:/usr/local/sbin:/usr/local/bin:/usr/X11R6/bin:/home/roomshare/bin:/home/roomshare/local/bin
_ENV["REMOTEHOST"] => 203.112.24.227
_ENV["SSH_AUTH_SOCK"] => deleted
_ENV["SHELL"] => /bin/csh
_ENV["HOST"] => www517.sakura.ne.jp
_ENV["__MKLVL__"] => 1
_ENV["OSTYPE"] => FreeBSD
_ENV["PWD"] => /home/roomshare/tmp/php-5.2.5
_ENV["SSH_CONNECTION"] => deleted
_ENV["FTP_PASSIVE_MODE"] => YES
_ENV["CC"] => gcc
_ENV["HOSTTYPE"] => FreeBSD
_ENV["EDITOR"] => vi
PHP License
This program is free software; you can redistribute it and/or modify
it under the terms of the PHP License as published by the PHP Group
and included in the distribution in the file: LICENSE
This program is distributed in the hope that it will be useful,
but WITHOUT ANY WARRANTY; without even the implied warranty of
MERCHANTABILITY or FITNESS FOR A PARTICULAR PURPOSE.
If you did not receive a copy of the PHP license, or have any
questions about PHP licensing, please contact license@php.net.