Test results for 5.2.5 [failed]

From: Date: Thu, 15 Nov 2007 20:39:28 +0000
Subject: Test results for 5.2.5 [failed]
Groups: php.qa 
Request: Send a blank email to php-qa+get-52229@lists.php.net to get a copy of this message
===================================================================== FAILED TEST SUMMARY --------------------------------------------------------------------- Error message handling (with ZendOptimizer) [tests/run-test/test008.phpt] Convert warnings to exceptions [tests/lang/038.phpt] Bug #32828 (Throwing exception in output_callback function with ob_start and ob_end_clean leads to segfault) [tests/lang/bug32828.phpt] Bug #32290 (calling call_user_func_array() ends in infinite loop within child class) [Zend/tests/bug32290.phpt] Bug #36268 (Object destructors called even after fatal errors) [Zend/tests/bug36268.phpt] Bug #41421 (Uncaught exception from a stream wrapper segfaults) [Zend/tests/bug41421.phpt] iconv stream filter [ext/iconv/tests/iconv_stream_filter.phpt] SPL: spl_autoload() with methods [ext/spl/tests/spl_autoload_005.phpt] SPL: spl_autoload() with inaccessible methods [ext/spl/tests/spl_autoload_007.phpt] SPL: spl_autoload() with exceptions [ext/spl/tests/spl_autoload_008.phpt] Test array_map() function [ext/standard/tests/array/array_map.phpt] Bug #35821 (array_map() segfaults when exception is throwed from the callback) [ext/standard/tests/array/bug35821.phpt] Bug #38450 (constructor is not called for classes used in userspace stream wrappers) [ext/standard/tests/file/bug38450_2.phpt] proc_open() regression test 1 (proc_open() leak) [ext/standard/tests/file/proc_open01.phpt] register_shutdown_function() & __call [ext/standard/tests/general_functions/010.phpt] Bug #32647 (Using register_shutdown_function() with invalid callback can crash PHP) [ext/standard/tests/general_functions/bug32647.phpt] Bug #40398 (parent and self callback functions erroneously called statically) [ext/standard/tests/general_functions/bug40398.phpt] Test is_callable() function [ext/standard/tests/general_functions/is_callable.phpt] Test setlocale() function : basic functionality - setting system locale to a specific [ext/standard/tests/strings/setlocale_basic1.phpt] Test setlocale() function : basic functionality - set locale using an array [ext/standard/tests/strings/setlocale_basic2.phpt] Test setlocale() function : basic functionality - passing multiple locales as argument [ext/standard/tests/strings/setlocale_basic3.phpt] Test setlocale() function : usage variations - passing multiple valid/invlaid locales as argument [ext/standard/tests/strings/setlocale_variation1.phpt] Test setlocale() function : usage variations - setting system locale = 0 [ext/standard/tests/strings/setlocale_variation3.phpt] Test setlocale() function : usage variations - setting system locale as null [ext/standard/tests/strings/setlocale_variation4.phpt] Test setlocale() function : usage variations - Setting system locale as empty string [ext/standard/tests/strings/setlocale_variation5.phpt] Bug #32001 (xml_parse*() goes into infinite loop when autodetection in effect), using UTF-* [ext/xml/tests/bug32001.phpt] CLI long options [sapi/cli/tests/015.phpt] ===================================================================== ===================================================================== TEST RESULT SUMMARY --------------------------------------------------------------------- Exts skipped : 57 Exts tested : 23 --------------------------------------------------------------------- Number of tests : 4566 2985 Tests skipped : 1581 ( 34.6%) -------- Tests warned : 0 ( 0.0%) ( 0.0%) Tests failed : 27 ( 0.6%) ( 0.9%) Tests passed : 2958 ( 64.8%) ( 99.1%) --------------------------------------------------------------------- Time taken : 907 seconds ===================================================================== ===================================================================== FAILED TEST SUMMARY --------------------------------------------------------------------- Error message handling (with ZendOptimizer) [tests/run-test/test008.phpt] Convert warnings to exceptions [tests/lang/038.phpt] Bug #32828 (Throwing exception in output_callback function with ob_start and ob_end_clean leads to segfault) [tests/lang/bug32828.phpt] Bug #32290 (calling call_user_func_array() ends in infinite loop within child class) [Zend/tests/bug32290.phpt] Bug #36268 (Object destructors called even after fatal errors) [Zend/tests/bug36268.phpt] Bug #41421 (Uncaught exception from a stream wrapper segfaults) [Zend/tests/bug41421.phpt] iconv stream filter [ext/iconv/tests/iconv_stream_filter.phpt] SPL: spl_autoload() with methods [ext/spl/tests/spl_autoload_005.phpt] SPL: spl_autoload() with inaccessible methods [ext/spl/tests/spl_autoload_007.phpt] SPL: spl_autoload() with exceptions [ext/spl/tests/spl_autoload_008.phpt] Test array_map() function [ext/standard/tests/array/array_map.phpt] Bug #35821 (array_map() segfaults when exception is throwed from the callback) [ext/standard/tests/array/bug35821.phpt] Bug #38450 (constructor is not called for classes used in userspace stream wrappers) [ext/standard/tests/file/bug38450_2.phpt] proc_open() regression test 1 (proc_open() leak) [ext/standard/tests/file/proc_open01.phpt] register_shutdown_function() & __call [ext/standard/tests/general_functions/010.phpt] Bug #32647 (Using register_shutdown_function() with invalid callback can crash PHP) [ext/standard/tests/general_functions/bug32647.phpt] Bug #40398 (parent and self callback functions erroneously called statically) [ext/standard/tests/general_functions/bug40398.phpt] Test is_callable() function [ext/standard/tests/general_functions/is_callable.phpt] Test setlocale() function : basic functionality - setting system locale to a specific [ext/standard/tests/strings/setlocale_basic1.phpt] Test setlocale() function : basic functionality - set locale using an array [ext/standard/tests/strings/setlocale_basic2.phpt] Test setlocale() function : basic functionality - passing multiple locales as argument [ext/standard/tests/strings/setlocale_basic3.phpt] Test setlocale() function : usage variations - passing multiple valid/invlaid locales as argument [ext/standard/tests/strings/setlocale_variation1.phpt] Test setlocale() function : usage variations - setting system locale = 0 [ext/standard/tests/strings/setlocale_variation3.phpt] Test setlocale() function : usage variations - setting system locale as null [ext/standard/tests/strings/setlocale_variation4.phpt] Test setlocale() function : usage variations - Setting system locale as empty string [ext/standard/tests/strings/setlocale_variation5.phpt] Bug #32001 (xml_parse*() goes into infinite loop when autodetection in effect), using UTF-* [ext/xml/tests/bug32001.phpt] CLI long options [sapi/cli/tests/015.phpt] ===================================================================== ================================================================================ /usr/local/src/php-5.2.5/tests/run-test/test008.phpt ================================================================================ string(1) "1" string(4) "8191" string(1) "0" string(1) "1" string(1) "0" NULL string(16) "Division by zero" ================================================================================ 001- %s: %sivision by zero in %s on line %d 006+ NULL 008- string(%d) "%sivision by zer%s" ================================================================================ ================================================================================ /usr/local/src/php-5.2.5/tests/lang/038.phpt ================================================================================ string(15) "Error2Exception" Fatal error: Uncaught exception 'MyException' with message 'Undefined offset: 1' in :0 Stack trace: #0 /usr/local/src/php-5.2.5/tests/lang/038.php(29): Error2Exception(8, 'Undefined offse...', '/usr/local/src/...', 29, Array) #1 {main} thrown in on line 1077252432 ================================================================================ 002+ 003+ Fatal error: Uncaught exception 'MyException' with message 'Undefined offset: 1' in :0 002- string(5) "fopen" 003- ===DONE=== 004+ Stack trace: 005+ #0 /usr/local/src/php-5.2.5/tests/lang/038.php(29): Error2Exception(8, 'Undefined offse...', '/usr/local/src/...', 29, Array) 006+ #1 {main} 007+ thrown in on line 1077252432 ================================================================================ ================================================================================ /usr/local/src/php-5.2.5/tests/lang/bug32828.phpt ================================================================================ Fatal error: Uncaught exception 'Exception' in /usr/local/src/php-5.2.5/tests/lang/bug32828.php:5 Stack trace: #0 /usr/local/src/php-5.2.5/tests/lang/bug32828.php(10): output_handler('', 5) #1 {main} thrown in /usr/local/src/php-5.2.5/tests/lang/bug32828.php on line 5 ================================================================================ 003+ #0 /usr/local/src/php-5.2.5/tests/lang/bug32828.php(10): output_handler('', 5) 004+ #1 {main} 003- #0 [internal function]: output_handler('', %d) 004- #1 %s(%d): ob_end_clean() 005- #2 {main} ================================================================================ ================================================================================ /usr/local/src/php-5.2.5/Zend/tests/bug32290.phpt ================================================================================ ===A=== TestB::doSomething(1) Strict Standards: Non-static method TestA::doSomething() cannot be called statically, assuming $this from compatible context TestB in /usr/local/src/php-5.2.5/Zend/tests/bug32290.php on line 43 Strict Standards: Non-static method TestA::doSomething() cannot be called statically, assuming $this from compatible context TestB in /usr/local/src/php-5.2.5/Zend/tests/bug32290.php on line 43 TestA::doSomething(2) int(1) ===B=== TestB::doSomethingThis(1) TestA::doSomethingThis(2) int(1) ===C=== TestB::doSomethingParent(1) Strict Standards: Non-static method TestA::doSomethingParent() cannot be called statically, assuming $this from compatible context TestB in /usr/local/src/php-5.2.5/Zend/tests/bug32290.php on line 59 Strict Standards: Non-static method TestA::doSomethingParent() cannot be called statically, assuming $this from compatible context TestB in /usr/local/src/php-5.2.5/Zend/tests/bug32290.php on line 59 TestA::doSomethingParent(2) int(1) ===D=== TestB::doSomethingParentThis(1) TestA::doSomethingParentThis(2) int(1) ===E=== TestB::doSomethingStatic(1) TestA::doSomethingStatic(2) int(1) ===DONE=== ================================================================================ 005+ 006+ Strict Standards: Non-static method TestA::doSomething() cannot be called statically, assuming $this from compatible context TestB in /usr/local/src/php-5.2.5/Zend/tests/bug32290.php on line 43 019+ 020+ Strict Standards: Non-static method TestA::doSomethingParent() cannot be called statically, assuming $this from compatible context TestB in /usr/local/src/php-5.2.5/Zend/tests/bug32290.php on line 59 ================================================================================ ================================================================================ /usr/local/src/php-5.2.5/Zend/tests/bug36268.phpt ================================================================================ Fatal error: Call to undefined function bar() in /usr/local/src/php-5.2.5/Zend/tests/bug36268.php on line 8 ================================================================================ 001+ Fatal error: Call to undefined function bar() in /usr/local/src/php-5.2.5/Zend/tests/bug36268.php on line 8 001- Fatal error: Call to undefined function bar() in %sbug36268.php on line 8 ================================================================================ ================================================================================ /usr/local/src/php-5.2.5/Zend/tests/bug41421.phpt ================================================================================ Warning: feof(): wrapper::stream_eof is not implemented! Assuming EOF in /usr/local/src/php-5.2.5/Zend/tests/bug41421.php on line 18 Fatal error: Uncaught exception 'Exception' in /usr/local/src/php-5.2.5/Zend/tests/bug41421.php:8 Stack trace: #0 /usr/local/src/php-5.2.5/Zend/tests/bug41421.php(14): wrapper->stream_eof() #1 {main} thrown in /usr/local/src/php-5.2.5/Zend/tests/bug41421.php on line 8 ================================================================================ 005+ #0 /usr/local/src/php-5.2.5/Zend/tests/bug41421.php(14): wrapper->stream_eof() 006+ #1 {main} 005- #0 [internal function]: wrapper->stream_eof() 006- #1 %s(%d): feof(Resource id #6) 007- #2 {main} ================================================================================ ================================================================================ /usr/local/src/php-5.2.5/ext/iconv/tests/iconv_stream_filter.phpt ================================================================================ string(20) "1b244224332473244b24" string(10) "41244f1b28" string(2) "42" string(20) "a4b3a4f3a4cba4c1a4cf" string(10) "69636f6e76" string(2) "0a" string(20) "1b244f24332466245824" string(10) "4e24421b28" string(2) "4f" ================================================================================ 007+ string(20) "1b244f24332466245824" 008+ string(10) "4e24421b28" 009+ string(2) "4f" 007- 008- Warning: fread(): iconv stream filter ("ISO-2022-JP"=>"EUC-JP"): invalid multibyte sequence in %s on line %d 009- string(0) "" 010- string(0) "" 011- string(0) "" ================================================================================ ================================================================================ /usr/local/src/php-5.2.5/ext/spl/tests/spl_autoload_005.phpt ================================================================================ Strict Standards: Non-static method MyAutoLoader::autoLoad() cannot be called statically in /usr/local/src/php-5.2.5/ext/spl/tests/spl_autoload_005.php on line 19 Exception: Passed array specifies a non static method but no object MyAutoLoader::autoLoad(TestClass) MyAutoLoader::autoThrow(TestClass) Exception: Unavailable ===DONE=== ================================================================================ 001+ Strict Standards: Non-static method MyAutoLoader::autoLoad() cannot be called statically in /usr/local/src/php-5.2.5/ext/spl/tests/spl_autoload_005.php on line 19 ================================================================================ ================================================================================ /usr/local/src/php-5.2.5/ext/spl/tests/spl_autoload_007.phpt ================================================================================ string(22) "MyAutoLoader::notExist" Function 'MyAutoLoader::notExist' not found string(22) "MyAutoLoader::noAccess" Function 'MyAutoLoader::noAccess' not callable string(22) "MyAutoLoader::autoLoad" ok string(22) "MyAutoLoader::dynaLoad" Function 'MyAutoLoader::dynaLoad' not callable array(2) { [0]=> string(12) "MyAutoLoader" [1]=> string(8) "notExist" } MyAutoLoader::autoLoad(321o67vfigy0) MyAutoLoader::autoLoad(321o67vfigy0) Passed array does not specify an existing static method array(2) { [0]=> string(12) "MyAutoLoader" [1]=> string(8) "noAccess" } Passed array does not specify a callable static method array(2) { [0]=> string(12) "MyAutoLoader" [1]=> string(8) "autoLoad" } ok array(2) { [0]=> string(12) "MyAutoLoader" [1]=> string(8) "dynaLoad" } Strict Standards: Non-static method MyAutoLoader::dynaLoad() cannot be called statically in /usr/local/src/php-5.2.5/ext/spl/tests/spl_autoload_007.php on line 41 Passed array specifies a non static method but no object array(2) { [0]=> object(MyAutoLoader)#1 (0) { } [1]=> string(8) "notExist" } Passed array does not specify an existing method array(2) { [0]=> object(MyAutoLoader)#1 (0) { } [1]=> string(8) "noAccess" } Passed array does not specify a callable method array(2) { [0]=> object(MyAutoLoader)#1 (0) { } [1]=> string(8) "autoLoad" } ok array(2) { [0]=> object(MyAutoLoader)#1 (0) { } [1]=> string(8) "dynaLoad" } ok ===DONE=== ================================================================================ 019+ MyAutoLoader::autoLoad(321o67vfigy0) 020+ MyAutoLoader::autoLoad(321o67vfigy0) 045+ 046+ Strict Standards: Non-static method MyAutoLoader::dynaLoad() cannot be called statically in /usr/local/src/php-5.2.5/ext/spl/tests/spl_autoload_007.php on line 41 ================================================================================ ================================================================================ /usr/local/src/php-5.2.5/ext/spl/tests/spl_autoload_008.phpt ================================================================================ ====0==== string(10) "MyAutoLoad" registered MyAutoLoad(NoExistingTestClass) Exception: Bla int(0) ====1==== string(22) "MyAutoLoader::autoLoad" registered MyAutoLoader::autoLoad(NoExistingTestClass) Exception: Bla int(0) ====2==== string(22) "MyAutoLoader::dynaLoad" LogicException: Function 'MyAutoLoader::dynaLoad' not callable int(0) ====3==== array(2) { [0]=> string(12) "MyAutoLoader" [1]=> string(8) "autoLoad" } registered MyAutoLoader::autoLoad(NoExistingTestClass) Exception: Bla int(0) ====4==== array(2) { [0]=> string(12) "MyAutoLoader" [1]=> string(8) "dynaLoad" } Strict Standards: Non-static method MyAutoLoader::dynaLoad() cannot be called statically in /usr/local/src/php-5.2.5/ext/spl/tests/spl_autoload_008.php on line 43 LogicException: Passed array specifies a non static method but no object int(0) ====5==== array(2) { [0]=> object(MyAutoLoader)#1 (0) { } [1]=> string(8) "autoLoad" } registered MyAutoLoader::autoLoad(NoExistingTestClass) Exception: Bla int(0) ====6==== array(2) { [0]=> object(MyAutoLoader)#1 (0) { } [1]=> string(8) "dynaLoad" } registered MyAutoLoader::dynaLoad(NoExistingTestClass) Exception: Bla int(0) ===DONE=== ================================================================================ 035+ 036+ Strict Standards: Non-static method MyAutoLoader::dynaLoad() cannot be called statically in /usr/local/src/php-5.2.5/ext/spl/tests/spl_autoload_008.php on line 43 ================================================================================ ================================================================================ /usr/local/src/php-5.2.5/ext/standard/tests/array/array_map.phpt ================================================================================ *** Testing basic operations *** array(0) { } array(0) { } array(3) { [0]=> array(2) { [0]=> int(1) [1]=> int(1) } [1]=> array(2) { [0]=> int(2) [1]=> int(2) } [2]=> array(2) { [0]=> int(3) [1]=> int(3) } } array(4) { [0]=> array(2) { [0]=> int(1) [1]=> int(1) } [1]=> array(2) { [0]=> int(2) [1]=> int(2) } [2]=> array(2) { [0]=> NULL [1]=> int(3) } [3]=> array(2) { [0]=> NULL [1]=> int(4) } } array(3) { [0]=> array(2) { [0]=> string(3) "Jan" [1]=> string(2) "31" } [1]=> array(2) { [0]=> string(3) "Feb" [1]=> string(2) "28" } [2]=> array(2) { [0]=> string(5) "March" [1]=> string(2) "31" } } array(3) { [0]=> array(2) { [0]=> string(4) "Text" [1]=> int(4) } [1]=> array(2) { [0]=> string(5) "Words" [1]=> int(5) } [2]=> array(2) { [0]=> string(6) "Lineup" [1]=> int(6) } } array(4) { [0]=> array(2) { [0]=> string(1) "a" [1]=> NULL } [1]=> array(2) { [0]=> string(2) "ab" [1]=> NULL } [2]=> array(2) { [0]=> string(3) "abc" [1]=> NULL } [3]=> array(2) { [0]=> string(4) "abcd" [1]=> NULL } } array(3) { [0]=> array(2) { [0]=> string(2) "01" [1]=> string(3) "Jan" } [1]=> array(2) { [0]=> string(2) "02" [1]=> string(3) "Feb" } [2]=> array(2) { [0]=> string(2) "03" [1]=> string(5) "March" } } array(3) { ["key1"]=> int(1) ["key2"]=> int(4) ["key3"]=> int(9) } *** Testing possible variations *** array(5) { [0]=> int(6) [1]=> int(8) [2]=> int(10) [3]=> int(8) [4]=> int(9) } array(2) { [0]=> array(2) { [0]=> string(5) "Hello" [1]=> string(5) "World" } [1]=> array(2) { [0]=> string(4) "Good" [1]=> string(3) "Day" } } Array ( [0] => 1 [1] => 4 [2] => 9 ) array(3) { [0]=> int(1) [1]=> int(4) [2]=> array(4) { [0]=> int(9) [1]=> int(16) [2]=> array(2) { [0]=> int(25) [1]=> int(4) } [3]=> array(0) { } } } array(3) { [0]=> int(1) [1]=> int(4) [2]=> int(9) } array(3) { [0]=> int(1) [1]=> int(4) [2]=> int(9) } *** Testing error conditions *** Warning: array_map(): Argument #2 should be an array in /usr/local/src/php-5.2.5/ext/standard/tests/array/array_map.php on line 70 NULL Warning: array_map(): Argument #2 should be an array in /usr/local/src/php-5.2.5/ext/standard/tests/array/array_map.php on line 71 NULL Warning: array_map(): Argument #2 should be an array in /usr/local/src/php-5.2.5/ext/standard/tests/array/array_map.php on line 72 NULL Warning: Wrong parameter count for array_map() in /usr/local/src/php-5.2.5/ext/standard/tests/array/array_map.php on line 75 NULL Warning: array_map(): The first argument, 'echo', should be either NULL or a valid callback in /usr/local/src/php-5.2.5/ext/standard/tests/array/array_map.php on line 79 NULL Warning: array_map(): The first argument, 'array', should be either NULL or a valid callback in /usr/local/src/php-5.2.5/ext/standard/tests/array/array_map.php on line 80 NULL Warning: array_map(): The first argument, 'empty', should be either NULL or a valid callback in /usr/local/src/php-5.2.5/ext/standard/tests/array/array_map.php on line 81 NULL Warning: array_map(): The first argument, 'eval', should be either NULL or a valid callback in /usr/local/src/php-5.2.5/ext/standard/tests/array/array_map.php on line 82 NULL Warning: array_map(): The first argument, 'exit', should be either NULL or a valid callback in /usr/local/src/php-5.2.5/ext/standard/tests/array/array_map.php on line 83 NULL Warning: array_map(): The first argument, 'isset', should be either NULL or a valid callback in /usr/local/src/php-5.2.5/ext/standard/tests/array/array_map.php on line 84 NULL Warning: array_map(): The first argument, 'list', should be either NULL or a valid callback in /usr/local/src/php-5.2.5/ext/standard/tests/array/array_map.php on line 85 NULL Warning: array_map(): The first argument, 'print', should be either NULL or a valid callback in /usr/local/src/php-5.2.5/ext/standard/tests/array/array_map.php on line 86 NULL *** Testing operation on objects *** array(3) { [0]=> int(1) [1]=> int(4) [2]=> int(9) } Strict Standards: Non-static method check_array_map::Message() cannot be called statically in /usr/local/src/php-5.2.5/ext/standard/tests/array/array_map.php on line 107 Strict Standards: Non-static method check_array_map::Message() cannot be called statically in /usr/local/src/php-5.2.5/ext/standard/tests/array/array_map.php on line 107 Strict Standards: Non-static method check_array_map::Message() cannot be called statically in /usr/local/src/php-5.2.5/ext/standard/tests/array/array_map.php on line 107 array(1) { [0]=> int(1) } Warning: Wrong parameter count for array_map() in /usr/local/src/php-5.2.5/ext/standard/tests/array/array_map.php on line 111 NULL array(1) { [0]=> string(41) "Static_Function_helloWorld(): Hello World" } Done ================================================================================ 293+ 294+ Strict Standards: Non-static method check_array_map::Message() cannot be called statically in /usr/local/src/php-5.2.5/ext/standard/tests/array/array_map.php on line 107 ================================================================================ ================================================================================ /usr/local/src/php-5.2.5/ext/standard/tests/array/bug35821.phpt ================================================================================ Warning: array_map(): An error occurred while invoking the map callback in /usr/local/src/php-5.2.5/ext/standard/tests/array/bug35821.php on line 21 Fatal error: Uncaught exception 'Exception' in /usr/local/src/php-5.2.5/ext/standard/tests/array/bug35821.php:7 Stack trace: #0 /usr/local/src/php-5.2.5/ext/standard/tests/array/bug35821.php(12): Element->ThrowException() #1 /usr/local/src/php-5.2.5/ext/standard/tests/array/bug35821.php(17): Element::CallBack(Object(Element)) #2 {main} thrown in /usr/local/src/php-5.2.5/ext/standard/tests/array/bug35821.php on line 7 ================================================================================ 006+ #1 /usr/local/src/php-5.2.5/ext/standard/tests/array/bug35821.php(17): Element::CallBack(Object(Element)) 007+ #2 {main} 006- #1 [internal function]: Element::CallBack(Object(Element)) 007- #2 %s(%d): array_map(Array, Array) 008- #3 {main} ================================================================================ ================================================================================ /usr/local/src/php-5.2.5/ext/standard/tests/file/bug38450_2.phpt ================================================================================ Warning: Missing argument 1 for VariableStream::__construct() in /usr/local/src/php-5.2.5/ext/standard/tests/file/bug38450_2.php on line 7 Warning: fopen(var://myvar): failed to open stream: "VariableStream::stream_open" call failed in /usr/local/src/php-5.2.5/ext/standard/tests/file/bug38450_2.php on line 101 Fatal error: Uncaught exception 'Exception' with message 'constructor' in /usr/local/src/php-5.2.5/ext/standard/tests/file/bug38450_2.php:8 Stack trace: #0 /usr/local/src/php-5.2.5/ext/standard/tests/file/bug38450_2.php(86): VariableStream->__construct() #1 {main} thrown in /usr/local/src/php-5.2.5/ext/standard/tests/file/bug38450_2.php on line 8 ================================================================================ 007+ #0 /usr/local/src/php-5.2.5/ext/standard/tests/file/bug38450_2.php(86): VariableStream->__construct() 008+ #1 {main} 007- #0 [internal function]: VariableStream->__construct() 008- #1 %s(%d): fopen('var://myvar', 'r+') 009- #2 {main} ================================================================================ ================================================================================ /usr/local/src/php-5.2.5/ext/standard/tests/file/proc_open01.phpt ================================================================================ array(2) { [0]=> resource(4) of type (stream) [1]=> resource(5) of type (stream) } terminated after 1000 iterations string(0) "" array(3) { [0]=> int(1) [1]=> int(2) [2]=> int(3) } ================================================================================ 007+ terminated after 1000 iterations 008+ string(0) "" 007- string(5) "yay! 008- " ================================================================================ ================================================================================ /usr/local/src/php-5.2.5/ext/standard/tests/general_functions/010.phpt ================================================================================ Strict Standards: Non-static method test::__call() cannot be called statically in /usr/local/src/php-5.2.5/ext/standard/tests/general_functions/010.php on line 11 Strict Standards: Non-static method test::__call() cannot be called statically in /usr/local/src/php-5.2.5/ext/standard/tests/general_functions/010.php on line 11 NULL Done Strict Standards: Non-static method test::__call() cannot be called statically in Unknown on line 0 Fatal error: Non-static method test::__call() cannot be called statically in Unknown on line 0 ================================================================================ 002+ 003+ Strict Standards: Non-static method test::__call() cannot be called statically in /usr/local/src/php-5.2.5/ext/standard/tests/general_functions/010.php on line 11 ================================================================================ ================================================================================ /usr/local/src/php-5.2.5/ext/standard/tests/general_functions/bug32647.phpt ================================================================================ Notice: Undefined variable: obj in /usr/local/src/php-5.2.5/ext/standard/tests/general_functions/bug32647.php on line 15 Warning: register_shutdown_function(): Invalid shutdown callback 'Array' passed in /usr/local/src/php-5.2.5/ext/standard/tests/general_functions/bug32647.php on line 15 Notice: Undefined variable: obj in /usr/local/src/php-5.2.5/ext/standard/tests/general_functions/bug32647.php on line 16 Warning: register_shutdown_function(): Invalid shutdown callback 'Array' passed in /usr/local/src/php-5.2.5/ext/standard/tests/general_functions/bug32647.php on line 16 Warning: register_shutdown_function(): Invalid shutdown callback 'Array' passed in /usr/local/src/php-5.2.5/ext/standard/tests/general_functions/bug32647.php on line 17 Warning: register_shutdown_function(): Invalid shutdown callback 'bar::foo' passed in /usr/local/src/php-5.2.5/ext/standard/tests/general_functions/bug32647.php on line 18 Warning: register_shutdown_function(): Invalid shutdown callback 'Array' passed in /usr/local/src/php-5.2.5/ext/standard/tests/general_functions/bug32647.php on line 19 Warning: register_shutdown_function(): Invalid shutdown callback 'bar' passed in /usr/local/src/php-5.2.5/ext/standard/tests/general_functions/bug32647.php on line 20 Strict Standards: Non-static method bar::barfoo() cannot be called statically in /usr/local/src/php-5.2.5/ext/standard/tests/general_functions/bug32647.php on line 22 Strict Standards: Non-static method bar::barfoo() cannot be called statically in /usr/local/src/php-5.2.5/ext/standard/tests/general_functions/bug32647.php on line 22 Warning: register_shutdown_function(): Invalid shutdown callback 'bar::foobar' passed in /usr/local/src/php-5.2.5/ext/standard/tests/general_functions/bug32647.php on line 25 foo! Strict Standards: Non-static method bar::barfoo() cannot be called statically in Unknown on line 0 Strict Standards: Non-static method bar::barfoo() cannot be called statically in Unknown on line 0 bar! bar! ================================================================================ 019+ Strict Standards: Non-static method bar::barfoo() cannot be called statically in /usr/local/src/php-5.2.5/ext/standard/tests/general_functions/bug32647.php on line 22 020+ ================================================================================ ================================================================================ /usr/local/src/php-5.2.5/ext/standard/tests/general_functions/bug40398.phpt ================================================================================ Base::__construct(1) Base::__construct(2) Warning: call_user_func_array(): First argument is expected to be a valid callback, 'Base::__construct' was given in /usr/local/src/php-5.2.5/ext/standard/tests/general_functions/bug40398.php on line 34 Warning: call_user_func_array(): First argument is expected to be a valid callback, 'parent::__construct' was given in /usr/local/src/php-5.2.5/ext/standard/tests/general_functions/bug40398.php on line 43 Strict Standards: Non-static method Base::__construct() cannot be called statically, assuming $this from compatible context Derived_5 in /usr/local/src/php-5.2.5/ext/standard/tests/general_functions/bug40398.php on line 52 Strict Standards: Non-static method Base::__construct() cannot be called statically, assuming $this from compatible context Derived_5 in /usr/local/src/php-5.2.5/ext/standard/tests/general_functions/bug40398.php on line 52 Base::__construct(5) Strict Standards: Non-static method Base::__construct() cannot be called statically, assuming $this from compatible context Derived_6 in /usr/local/src/php-5.2.5/ext/standard/tests/general_functions/bug40398.php on line 61 Strict Standards: Non-static method Base::__construct() cannot be called statically, assuming $this from compatible context Derived_6 in /usr/local/src/php-5.2.5/ext/standard/tests/general_functions/bug40398.php on line 61 Base::__construct(6) ===DONE=== ================================================================================ 009+ 010+ Strict Standards: Non-static method Base::__construct() cannot be called statically, assuming $this from compatible context Derived_5 in /usr/local/src/php-5.2.5/ext/standard/tests/general_functions/bug40398.php on line 52 014+ 015+ Strict Standards: Non-static method Base::__construct() cannot be called statically, assuming $this from compatible context Derived_6 in /usr/local/src/php-5.2.5/ext/standard/tests/general_functions/bug40398.php on line 61 ================================================================================ ================================================================================ /usr/local/src/php-5.2.5/ext/standard/tests/general_functions/is_callable.phpt ================================================================================ *** Testing is_callable() on defined functions *** -- Iteration 1 -- bool(true) bool(true) bool(true) bool(true) bool(true) someFunction -- Iteration 2 -- bool(true) bool(true) bool(true) bool(true) bool(true) x123 -- Iteration 3 -- bool(true) bool(true) bool(true) bool(true) bool(true) NULL -- Iteration 4 -- bool(true) bool(true) bool(true) bool(true) bool(true) false -- Iteration 5 -- bool(true) bool(true) bool(true) bool(true) bool(true) Hello_World *** Testing is_callable() on undefined functions *** -- Iteration 1 -- bool(false) bool(true) bool(true) bool(false) bool(false) -- Iteration 2 -- bool(false) bool(true) bool(true) bool(false) bool(false) -- Iteration 3 -- bool(false) bool(true) bool(true) bool(false) bool(false) -- Iteration 4 -- bool(false) bool(true) bool(true) bool(false) bool(false) -- Iteration 5 -- bool(false) bool(true) bool(true) bool(false) bool(false) 12356 -- Iteration 6 -- bool(false) bool(true) bool(true) bool(false) bool(false) -- Iteration 7 -- bool(false) bool(true) bool(true) bool(false) bool(false) \0 -- Iteration 8 -- bool(false) bool(true) bool(true) bool(false) bool(false) hello world -- Iteration 9 -- bool(false) bool(true) bool(true) bool(false) bool(false) hello world -- Iteration 10 -- bool(false) bool(true) bool(true) bool(false) bool(false) welcome -- Iteration 11 -- bool(false) bool(true) bool(true) bool(false) bool(false) welcome\0 -- Iteration 12 -- bool(false) bool(true) bool(true) bool(false) bool(false) ==%%%***$$$@@@!! -- Iteration 13 -- bool(true) bool(true) bool(true) bool(true) bool(true) false -- Iteration 14 -- bool(false) bool(true) bool(true) bool(false) bool(false) 8 -- Iteration 15 -- bool(false) bool(true) bool(true) bool(false) bool(false) \t -- Iteration 16 -- bool(false) bool(true) bool(true) bool(false) bool(false) \007 -- Iteration 17 -- bool(false) bool(true) bool(true) bool(false) bool(false) 123 -- Iteration 18 -- bool(false) bool(true) bool(true) bool(false) bool(false) echo() *** Testing is_callable() on objects *** ** Testing behavior of is_callable() on static methods ** bool(true) bool(false) ** Testing normal operations of is_callable() on objects ** --- Outerloop iteration 1 --- -- Innerloop iteration 1 of Outerloop iteration 1 -- bool(true) bool(true) bool(true) bool(true) bool(true) object_class::foo1 -- Innerloop iteration 2 of Outerloop iteration 1 -- bool(false) bool(true) bool(false) bool(true) bool(false) object_class::foo2 -- Innerloop iteration 3 of Outerloop iteration 1 -- bool(false) bool(true) bool(false) bool(true) bool(false) object_class::foo3 -- Innerloop iteration 4 of Outerloop iteration 1 -- bool(true) bool(true) bool(true) bool(true) bool(true) object_class::x123 -- Innerloop iteration 5 of Outerloop iteration 1 -- bool(true) bool(true) bool(true) bool(true) bool(true) object_class::null -- Innerloop iteration 6 of Outerloop iteration 1 -- bool(true) bool(true) bool(true) bool(true) bool(true) object_class::TRUE -- Innerloop iteration 7 of Outerloop iteration 1 -- bool(false) bool(true) bool(false) bool(true) bool(false) object_class::123 -- Innerloop iteration 8 of Outerloop iteration 1 -- bool(false) bool(false) bool(false) bool(false) bool(false) Array -- Innerloop iteration 9 of Outerloop iteration 1 -- bool(false) bool(true) bool(false) bool(true) bool(false) object_class::func -- Innerloop iteration 10 of Outerloop iteration 1 -- Strict Standards: Non-static method object_class::foo1() cannot be called statically in /usr/local/src/php-5.2.5/ext/standard/tests/general_functions/is_callable.php on line 35 Strict Standards: Non-static method object_class::foo1() cannot be called statically in /usr/local/src/php-5.2.5/ext/standard/tests/general_functions/is_callable.php on line 35 bool(true) Strict Standards: Non-static method object_class::foo1() cannot be called statically in /usr/local/src/php-5.2.5/ext/standard/tests/general_functions/is_callable.php on line 36 bool(true) Strict Standards: Non-static method object_class::foo1() cannot be called statically in /usr/local/src/php-5.2.5/ext/standard/tests/general_functions/is_callable.php on line 37 Strict Standards: Non-static method object_class::foo1() cannot be called statically in /usr/local/src/php-5.2.5/ext/standard/tests/general_functions/is_callable.php on line 37 bool(true) Strict Standards: Non-static method object_class::foo1() cannot be called statically in /usr/local/src/php-5.2.5/ext/standard/tests/general_functions/is_callable.php on line 38 bool(true) Strict Standards: Non-static method object_class::foo1() cannot be called statically in /usr/local/src/php-5.2.5/ext/standard/tests/general_functions/is_callable.php on line 39 Strict Standards: Non-static method object_class::foo1() cannot be called statically in /usr/local/src/php-5.2.5/ext/standard/tests/general_functions/is_callable.php on line 39 bool(true) object_class::foo1 --- Outerloop iteration 2 --- -- Innerloop iteration 1 of Outerloop iteration 2 -- bool(false) bool(true) bool(false) bool(true) bool(false) no_member_class::foo1 -- Innerloop iteration 2 of Outerloop iteration 2 -- bool(false) bool(true) bool(false) bool(true) bool(false) no_member_class::foo2 -- Innerloop iteration 3 of Outerloop iteration 2 -- bool(false) bool(true) bool(false) bool(true) bool(false) no_member_class::foo3 -- Innerloop iteration 4 of Outerloop iteration 2 -- bool(false) bool(true) bool(false) bool(true) bool(false) no_member_class::x123 -- Innerloop iteration 5 of Outerloop iteration 2 -- bool(false) bool(true) bool(false) bool(true) bool(false) no_member_class::null -- Innerloop iteration 6 of Outerloop iteration 2 -- bool(false) bool(true) bool(false) bool(true) bool(false) no_member_class::TRUE -- Innerloop iteration 7 of Outerloop iteration 2 -- bool(false) bool(true) bool(false) bool(true) bool(false) no_member_class::123 -- Innerloop iteration 8 of Outerloop iteration 2 -- bool(false) bool(false) bool(false) bool(false) bool(false) Array -- Innerloop iteration 9 of Outerloop iteration 2 -- bool(false) bool(true) bool(false) bool(true) bool(false) no_member_class::func -- Innerloop iteration 10 of Outerloop iteration 2 -- Strict Standards: Non-static method object_class::foo1() cannot be called statically in /usr/local/src/php-5.2.5/ext/standard/tests/general_functions/is_callable.php on line 35 Strict Standards: Non-static method object_class::foo1() cannot be called statically in /usr/local/src/php-5.2.5/ext/standard/tests/general_functions/is_callable.php on line 35 bool(true) Strict Standards: Non-static method object_class::foo1() cannot be called statically in /usr/local/src/php-5.2.5/ext/standard/tests/general_functions/is_callable.php on line 36 bool(true) Strict Standards: Non-static method object_class::foo1() cannot be called statically in /usr/local/src/php-5.2.5/ext/standard/tests/general_functions/is_callable.php on line 37 Strict Standards: Non-static method object_class::foo1() cannot be called statically in /usr/local/src/php-5.2.5/ext/standard/tests/general_functions/is_callable.php on line 37 bool(true) Strict Standards: Non-static method object_class::foo1() cannot be called statically in /usr/local/src/php-5.2.5/ext/standard/tests/general_functions/is_callable.php on line 38 bool(true) Strict Standards: Non-static method object_class::foo1() cannot be called statically in /usr/local/src/php-5.2.5/ext/standard/tests/general_functions/is_callable.php on line 39 Strict Standards: Non-static method object_class::foo1() cannot be called statically in /usr/local/src/php-5.2.5/ext/standard/tests/general_functions/is_callable.php on line 39 bool(true) object_class::foo1 --- Outerloop iteration 3 --- -- Innerloop iteration 1 of Outerloop iteration 3 -- bool(false) bool(true) bool(false) bool(true) bool(false) contains_object_class::foo1 -- Innerloop iteration 2 of Outerloop iteration 3 -- bool(false) bool(true) bool(false) bool(true) bool(false) contains_object_class::foo2 -- Innerloop iteration 3 of Outerloop iteration 3 -- bool(false) bool(true) bool(false) bool(true) bool(false) contains_object_class::foo3 -- Innerloop iteration 4 of Outerloop iteration 3 -- bool(false) bool(true) bool(false) bool(true) bool(false) contains_object_class::x123 -- Innerloop iteration 5 of Outerloop iteration 3 -- bool(false) bool(true) bool(false) bool(true) bool(false) contains_object_class::null -- Innerloop iteration 6 of Outerloop iteration 3 -- bool(false) bool(true) bool(false) bool(true) bool(false) contains_object_class::TRUE -- Innerloop iteration 7 of Outerloop iteration 3 -- bool(false) bool(true) bool(false) bool(true) bool(false) contains_object_class::123 -- Innerloop iteration 8 of Outerloop iteration 3 -- bool(false) bool(false) bool(false) bool(false) bool(false) Array -- Innerloop iteration 9 of Outerloop iteration 3 -- bool(true) bool(true) bool(true) bool(true) bool(true) contains_object_class::func -- Innerloop iteration 10 of Outerloop iteration 3 -- Strict Standards: Non-static method object_class::foo1() cannot be called statically in /usr/local/src/php-5.2.5/ext/standard/tests/general_functions/is_callable.php on line 35 Strict Standards: Non-static method object_class::foo1() cannot be called statically in /usr/local/src/php-5.2.5/ext/standard/tests/general_functions/is_callable.php on line 35 bool(true) Strict Standards: Non-static method object_class::foo1() cannot be called statically in /usr/local/src/php-5.2.5/ext/standard/tests/general_functions/is_callable.php on line 36 bool(true) Strict Standards: Non-static method object_class::foo1() cannot be called statically in /usr/local/src/php-5.2.5/ext/standard/tests/general_functions/is_callable.php on line 37 Strict Standards: Non-static method object_class::foo1() cannot be called statically in /usr/local/src/php-5.2.5/ext/standard/tests/general_functions/is_callable.php on line 37 bool(true) Strict Standards: Non-static method object_class::foo1() cannot be called statically in /usr/local/src/php-5.2.5/ext/standard/tests/general_functions/is_callable.php on line 38 bool(true) Strict Standards: Non-static method object_class::foo1() cannot be called statically in /usr/local/src/php-5.2.5/ext/standard/tests/general_functions/is_callable.php on line 39 Strict Standards: Non-static method object_class::foo1() cannot be called statically in /usr/local/src/php-5.2.5/ext/standard/tests/general_functions/is_callable.php on line 39 bool(true) object_class::foo1 --- Outerloop iteration 4 --- -- Innerloop iteration 1 of Outerloop iteration 4 -- bool(false) bool(true) bool(false) bool(true) bool(false) contains_object_class::foo1 -- Innerloop iteration 2 of Outerloop iteration 4 -- bool(false) bool(true) bool(false) bool(true) bool(false) contains_object_class::foo2 -- Innerloop iteration 3 of Outerloop iteration 4 -- bool(false) bool(true) bool(false) bool(true) bool(false) contains_object_class::foo3 -- Innerloop iteration 4 of Outerloop iteration 4 -- bool(false) bool(true) bool(false) bool(true) bool(false) contains_object_class::x123 -- Innerloop iteration 5 of Outerloop iteration 4 -- bool(false) bool(true) bool(false) bool(true) bool(false) contains_object_class::null -- Innerloop iteration 6 of Outerloop iteration 4 -- bool(false) bool(true) bool(false) bool(true) bool(false) contains_object_class::TRUE -- Innerloop iteration 7 of Outerloop iteration 4 -- bool(false) bool(true) bool(false) bool(true) bool(false) contains_object_class::123 -- Innerloop iteration 8 of Outerloop iteration 4 -- bool(false) bool(false) bool(false) bool(false) bool(false) Array -- Innerloop iteration 9 of Outerloop iteration 4 -- bool(true) bool(true) bool(true) bool(true) bool(true) contains_object_class::func -- Innerloop iteration 10 of Outerloop iteration 4 -- Strict Standards: Non-static method object_class::foo1() cannot be called statically in /usr/local/src/php-5.2.5/ext/standard/tests/general_functions/is_callable.php on line 35 Strict Standards: Non-static method object_class::foo1() cannot be called statically in /usr/local/src/php-5.2.5/ext/standard/tests/general_functions/is_callable.php on line 35 bool(true) Strict Standards: Non-static method object_class::foo1() cannot be called statically in /usr/local/src/php-5.2.5/ext/standard/tests/general_functions/is_callable.php on line 36 bool(true) Strict Standards: Non-static method object_class::foo1() cannot be called statically in /usr/local/src/php-5.2.5/ext/standard/tests/general_functions/is_callable.php on line 37 Strict Standards: Non-static method object_class::foo1() cannot be called statically in /usr/local/src/php-5.2.5/ext/standard/tests/general_functions/is_callable.php on line 37 bool(true) Strict Standards: Non-static method object_class::foo1() cannot be called statically in /usr/local/src/php-5.2.5/ext/standard/tests/general_functions/is_callable.php on line 38 bool(true) Strict Standards: Non-static method object_class::foo1() cannot be called statically in /usr/local/src/php-5.2.5/ext/standard/tests/general_functions/is_callable.php on line 39 Strict Standards: Non-static method object_class::foo1() cannot be called statically in /usr/local/src/php-5.2.5/ext/standard/tests/general_functions/is_callable.php on line 39 bool(true) object_class::foo1 --- Outerloop iteration 5 --- -- Innerloop iteration 1 of Outerloop iteration 5 -- bool(true) bool(true) bool(true) bool(true) bool(true) object_class::foo1 -- Innerloop iteration 2 of Outerloop iteration 5 -- bool(false) bool(true) bool(false) bool(true) bool(false) object_class::foo2 -- Innerloop iteration 3 of Outerloop iteration 5 -- bool(false) bool(true) bool(false) bool(true) bool(false) object_class::foo3 -- Innerloop iteration 4 of Outerloop iteration 5 -- bool(true) bool(true) bool(true) bool(true) bool(true) object_class::x123 -- Innerloop iteration 5 of Outerloop iteration 5 -- bool(true) bool(true) bool(true) bool(true) bool(true) object_class::null -- Innerloop iteration 6 of Outerloop iteration 5 -- bool(true) bool(true) bool(true) bool(true) bool(true) object_class::TRUE -- Innerloop iteration 7 of Outerloop iteration 5 -- bool(false) bool(true) bool(false) bool(true) bool(false) object_class::123 -- Innerloop iteration 8 of Outerloop iteration 5 -- bool(false) bool(false) bool(false) bool(false) bool(false) Array -- Innerloop iteration 9 of Outerloop iteration 5 -- bool(false) bool(true) bool(false) bool(true) bool(false) object_class::func -- Innerloop iteration 10 of Outerloop iteration 5 -- Strict Standards: Non-static method object_class::foo1() cannot be called statically in /usr/local/src/php-5.2.5/ext/standard/tests/general_functions/is_callable.php on line 35 Strict Standards: Non-static method object_class::foo1() cannot be called statically in /usr/local/src/php-5.2.5/ext/standard/tests/general_functions/is_callable.php on line 35 bool(true) Strict Standards: Non-static method object_class::foo1() cannot be called statically in /usr/local/src/php-5.2.5/ext/standard/tests/general_functions/is_callable.php on line 36 bool(true) Strict Standards: Non-static method object_class::foo1() cannot be called statically in /usr/local/src/php-5.2.5/ext/standard/tests/general_functions/is_callable.php on line 37 Strict Standards: Non-static method object_class::foo1() cannot be called statically in /usr/local/src/php-5.2.5/ext/standard/tests/general_functions/is_callable.php on line 37 bool(true) Strict Standards: Non-static method object_class::foo1() cannot be called statically in /usr/local/src/php-5.2.5/ext/standard/tests/general_functions/is_callable.php on line 38 bool(true) Strict Standards: Non-static method object_class::foo1() cannot be called statically in /usr/local/src/php-5.2.5/ext/standard/tests/general_functions/is_callable.php on line 39 Strict Standards: Non-static method object_class::foo1() cannot be called statically in /usr/local/src/php-5.2.5/ext/standard/tests/general_functions/is_callable.php on line 39 bool(true) object_class::foo1 --- Outerloop iteration 6 --- -- Innerloop iteration 1 of Outerloop iteration 6 -- bool(false) bool(true) bool(false) bool(true) bool(false) no_member_class::foo1 -- Innerloop iteration 2 of Outerloop iteration 6 -- bool(false) bool(true) bool(false) bool(true) bool(false) no_member_class::foo2 -- Innerloop iteration 3 of Outerloop iteration 6 -- bool(false) bool(true) bool(false) bool(true) bool(false) no_member_class::foo3 -- Innerloop iteration 4 of Outerloop iteration 6 -- bool(false) bool(true) bool(false) bool(true) bool(false) no_member_class::x123 -- Innerloop iteration 5 of Outerloop iteration 6 -- bool(false) bool(true) bool(false) bool(true) bool(false) no_member_class::null -- Innerloop iteration 6 of Outerloop iteration 6 -- bool(false) bool(true) bool(false) bool(true) bool(false) no_member_class::TRUE -- Innerloop iteration 7 of Outerloop iteration 6 -- bool(false) bool(true) bool(false) bool(true) bool(false) no_member_class::123 -- Innerloop iteration 8 of Outerloop iteration 6 -- bool(false) bool(false) bool(false) bool(false) bool(false) Array -- Innerloop iteration 9 of Outerloop iteration 6 -- bool(false) bool(true) bool(false) bool(true) bool(false) no_member_class::func -- Innerloop iteration 10 of Outerloop iteration 6 -- Strict Standards: Non-static method object_class::foo1() cannot be called statically in /usr/local/src/php-5.2.5/ext/standard/tests/general_functions/is_callable.php on line 35 Strict Standards: Non-static method object_class::foo1() cannot be called statically in /usr/local/src/php-5.2.5/ext/standard/tests/general_functions/is_callable.php on line 35 bool(true) Strict Standards: Non-static method object_class::foo1() cannot be called statically in /usr/local/src/php-5.2.5/ext/standard/tests/general_functions/is_callable.php on line 36 bool(true) Strict Standards: Non-static method object_class::foo1() cannot be called statically in /usr/local/src/php-5.2.5/ext/standard/tests/general_functions/is_callable.php on line 37 Strict Standards: Non-static method object_class::foo1() cannot be called statically in /usr/local/src/php-5.2.5/ext/standard/tests/general_functions/is_callable.php on line 37 bool(true) Strict Standards: Non-static method object_class::foo1() cannot be called statically in /usr/local/src/php-5.2.5/ext/standard/tests/general_functions/is_callable.php on line 38 bool(true) Strict Standards: Non-static method object_class::foo1() cannot be called statically in /usr/local/src/php-5.2.5/ext/standard/tests/general_functions/is_callable.php on line 39 Strict Standards: Non-static method object_class::foo1() cannot be called statically in /usr/local/src/php-5.2.5/ext/standard/tests/general_functions/is_callable.php on line 39 bool(true) object_class::foo1 --- Outerloop iteration 7 --- -- Innerloop iteration 1 of Outerloop iteration 7 -- bool(true) bool(true) bool(true) bool(true) bool(true) object_class::foo1 -- Innerloop iteration 2 of Outerloop iteration 7 -- bool(false) bool(true) bool(false) bool(true) bool(false) object_class::foo2 -- Innerloop iteration 3 of Outerloop iteration 7 -- bool(false) bool(true) bool(false) bool(true) bool(false) object_class::foo3 -- Innerloop iteration 4 of Outerloop iteration 7 -- bool(true) bool(true) bool(true) bool(true) bool(true) object_class::x123 -- Innerloop iteration 5 of Outerloop iteration 7 -- bool(true) bool(true) bool(true) bool(true) bool(true) object_class::null -- Innerloop iteration 6 of Outerloop iteration 7 -- bool(true) bool(true) bool(true) bool(true) bool(true) object_class::TRUE -- Innerloop iteration 7 of Outerloop iteration 7 -- bool(false) bool(true) bool(false) bool(true) bool(false) object_class::123 -- Innerloop iteration 8 of Outerloop iteration 7 -- bool(false) bool(false) bool(false) bool(false) bool(false) Array -- Innerloop iteration 9 of Outerloop iteration 7 -- bool(false) bool(true) bool(false) bool(true) bool(false) object_class::func -- Innerloop iteration 10 of Outerloop iteration 7 -- Strict Standards: Non-static method object_class::foo1() cannot be called statically in /usr/local/src/php-5.2.5/ext/standard/tests/general_functions/is_callable.php on line 35 Strict Standards: Non-static method object_class::foo1() cannot be called statically in /usr/local/src/php-5.2.5/ext/standard/tests/general_functions/is_callable.php on line 35 bool(true) Strict Standards: Non-static method object_class::foo1() cannot be called statically in /usr/local/src/php-5.2.5/ext/standard/tests/general_functions/is_callable.php on line 36 bool(true) Strict Standards: Non-static method object_class::foo1() cannot be called statically in /usr/local/src/php-5.2.5/ext/standard/tests/general_functions/is_callable.php on line 37 Strict Standards: Non-static method object_class::foo1() cannot be called statically in /usr/local/src/php-5.2.5/ext/standard/tests/general_functions/is_callable.php on line 37 bool(true) Strict Standards: Non-static method object_class::foo1() cannot be called statically in /usr/local/src/php-5.2.5/ext/standard/tests/general_functions/is_callable.php on line 38 bool(true) Strict Standards: Non-static method object_class::foo1() cannot be called statically in /usr/local/src/php-5.2.5/ext/standard/tests/general_functions/is_callable.php on line 39 Strict Standards: Non-static method object_class::foo1() cannot be called statically in /usr/local/src/php-5.2.5/ext/standard/tests/general_functions/is_callable.php on line 39 bool(true) object_class::foo1 --- Outerloop iteration 8 --- -- Innerloop iteration 1 of Outerloop iteration 8 -- bool(false) bool(false) bool(false) bool(false) bool(false) Array -- Innerloop iteration 2 of Outerloop iteration 8 -- bool(false) bool(false) bool(false) bool(false) bool(false) Array -- Innerloop iteration 3 of Outerloop iteration 8 -- bool(false) bool(false) bool(false) bool(false) bool(false) Array -- Innerloop iteration 4 of Outerloop iteration 8 -- bool(false) bool(false) bool(false) bool(false) bool(false) Array -- Innerloop iteration 5 of Outerloop iteration 8 -- bool(false) bool(false) bool(false) bool(false) bool(false) Array -- Innerloop iteration 6 of Outerloop iteration 8 -- bool(false) bool(false) bool(false) bool(false) bool(false) Array -- Innerloop iteration 7 of Outerloop iteration 8 -- bool(false) bool(false) bool(false) bool(false) bool(false) Array -- Innerloop iteration 8 of Outerloop iteration 8 -- bool(false) bool(false) bool(false) bool(false) bool(false) Array -- Innerloop iteration 9 of Outerloop iteration 8 -- bool(false) bool(false) bool(false) bool(false) bool(false) Array -- Innerloop iteration 10 of Outerloop iteration 8 -- Strict Standards: Non-static method object_class::foo1() cannot be called statically in /usr/local/src/php-5.2.5/ext/standard/tests/general_functions/is_callable.php on line 35 Strict Standards: Non-static method object_class::foo1() cannot be called statically in /usr/local/src/php-5.2.5/ext/standard/tests/general_functions/is_callable.php on line 35 bool(true) Strict Standards: Non-static method object_class::foo1() cannot be called statically in /usr/local/src/php-5.2.5/ext/standard/tests/general_functions/is_callable.php on line 36 bool(true) Strict Standards: Non-static method object_class::foo1() cannot be called statically in /usr/local/src/php-5.2.5/ext/standard/tests/general_functions/is_callable.php on line 37 Strict Standards: Non-static method object_class::foo1() cannot be called statically in /usr/local/src/php-5.2.5/ext/standard/tests/general_functions/is_callable.php on line 37 bool(true) Strict Standards: Non-static method object_class::foo1() cannot be called statically in /usr/local/src/php-5.2.5/ext/standard/tests/general_functions/is_callable.php on line 38 bool(true) Strict Standards: Non-static method object_class::foo1() cannot be called statically in /usr/local/src/php-5.2.5/ext/standard/tests/general_functions/is_callable.php on line 39 Strict Standards: Non-static method object_class::foo1() cannot be called statically in /usr/local/src/php-5.2.5/ext/standard/tests/general_functions/is_callable.php on line 39 bool(true) object_class::foo1 *** Testing is_callable() on invalid function names *** -- Iteration 1 -- bool(false) bool(false) bool(false) bool(false) bool(false) -- Iteration 2 -- bool(false) bool(false) bool(false) bool(false) bool(false) 0 -- Iteration 3 -- bool(false) bool(false) bool(false) bool(false) bool(false) 1234567890 -- Iteration 4 -- bool(false) bool(false) bool(false) bool(false) bool(false) -100123456782 -- Iteration 5 -- bool(false) bool(false) bool(false) bool(false) bool(false) -2 -- Iteration 6 -- bool(false) bool(false) bool(false) bool(false) bool(false) 0.567 -- Iteration 7 -- bool(false) bool(false) bool(false) bool(false) bool(false) -- Iteration 8 -- bool(false) bool(false) bool(false) bool(false) bool(false) Array -- Iteration 9 -- bool(false) bool(false) bool(false) bool(false) bool(false) -- Iteration 10 -- bool(false) bool(false) bool(false) bool(false) bool(false) -- Iteration 11 -- bool(false) bool(false) bool(false) bool(false) bool(false) Resource id #5 *** Testing error conditions *** Warning: Wrong parameter count for is_callable() in /usr/local/src/php-5.2.5/ext/standard/tests/general_functions/is_callable.php on line 228 NULL Warning: Wrong parameter count for is_callable() in /usr/local/src/php-5.2.5/ext/standard/tests/general_functions/is_callable.php on line 230 NULL Done ================================================================================ 240+ 241+ Strict Standards: Non-static method object_class::foo1() cannot be called statically in /usr/local/src/php-5.2.5/ext/standard/tests/general_functions/is_callable.php on line 35 240- bool(true) 245- bool(true) 246+ 247+ Strict Standards: Non-static method object_class::foo1() cannot be called statically in /usr/local/src/php-5.2.5/ext/standard/tests/general_functions/is_callable.php on line 37 251+ 252+ Strict Standards: Non-static method object_class::foo1() cannot be called statically in /usr/local/src/php-5.2.5/ext/standard/tests/general_functions/is_callable.php on line 38 253+ bool(true) 254+ 255+ Strict Standards: Non-static method object_class::foo1() cannot be called statically in /usr/local/src/php-5.2.5/ext/standard/tests/general_functions/is_callable.php on line 39 256+ 257+ Strict Standards: Non-static method object_class::foo1() cannot be called statically in /usr/local/src/php-5.2.5/ext/standard/tests/general_functions/is_callable.php on line 39 258+ bool(true) 317- bool(true) 322- bool(true) 327+ 328+ Strict Standards: Non-static method object_class::foo1() cannot be called statically in /usr/local/src/php-5.2.5/ext/standard/tests/general_functions/is_callable.php on line 35 333+ 334+ Strict Standards: Non-static method object_class::foo1() cannot be called statically in /usr/local/src/php-5.2.5/ext/standard/tests/general_functions/is_callable.php on line 37 338+ 339+ Strict Standards: Non-static method object_class::foo1() cannot be called statically in /usr/local/src/php-5.2.5/ext/standard/tests/general_functions/is_callable.php on line 38 340+ bool(true) 341+ 342+ Strict Standards: Non-static method object_class::foo1() cannot be called statically in /usr/local/src/php-5.2.5/ext/standard/tests/general_functions/is_callable.php on line 39 343+ 344+ Strict Standards: Non-static method object_class::foo1() cannot be called statically in /usr/local/src/php-5.2.5/ext/standard/tests/general_functions/is_callable.php on line 39 345+ bool(true) 394- bool(true) 399- bool(true) 414+ 415+ Strict Standards: Non-static method object_class::foo1() cannot be called statically in /usr/local/src/php-5.2.5/ext/standard/tests/general_functions/is_callable.php on line 35 420+ 421+ Strict Standards: Non-static method object_class::foo1() cannot be called statically in /usr/local/src/php-5.2.5/ext/standard/tests/general_functions/is_callable.php on line 37 425+ 426+ Strict Standards: Non-static method object_class::foo1() cannot be called statically in /usr/local/src/php-5.2.5/ext/standard/tests/general_functions/is_callable.php on line 38 427+ bool(true) 428+ 429+ Strict Standards: Non-static method object_class::foo1() cannot be called statically in /usr/local/src/php-5.2.5/ext/standard/tests/general_functions/is_callable.php on line 39 430+ 431+ Strict Standards: Non-static method object_class::foo1() cannot be called statically in /usr/local/src/php-5.2.5/ext/standard/tests/general_functions/is_callable.php on line 39 432+ bool(true) 471- bool(true) 476- bool(true) 501+ 502+ Strict Standards: Non-static method object_class::foo1() cannot be called statically in /usr/local/src/php-5.2.5/ext/standard/tests/general_functions/is_callable.php on line 35 507+ 508+ Strict Standards: Non-static method object_class::foo1() cannot be called statically in /usr/local/src/php-5.2.5/ext/standard/tests/general_functions/is_callable.php on line 37 512+ 513+ Strict Standards: Non-static method object_class::foo1() cannot be called statically in /usr/local/src/php-5.2.5/ext/standard/tests/general_functions/is_callable.php on line 38 514+ bool(true) 515+ 516+ Strict Standards: Non-static method object_class::foo1() cannot be called statically in /usr/local/src/php-5.2.5/ext/standard/tests/general_functions/is_callable.php on line 39 517+ 518+ Strict Standards: Non-static method object_class::foo1() cannot be called statically in /usr/local/src/php-5.2.5/ext/standard/tests/general_functions/is_callable.php on line 39 519+ bool(true) 548- bool(true) 553- bool(true) 588+ 589+ Strict Standards: Non-static method object_class::foo1() cannot be called statically in /usr/local/src/php-5.2.5/ext/standard/tests/general_functions/is_callable.php on line 35 594+ 595+ Strict Standards: Non-static method object_class::foo1() cannot be called statically in /usr/local/src/php-5.2.5/ext/standard/tests/general_functions/is_callable.php on line 37 599+ 600+ Strict Standards: Non-static method object_class::foo1() cannot be called statically in /usr/local/src/php-5.2.5/ext/standard/tests/general_functions/is_callable.php on line 38 601+ bool(true) 602+ 603+ Strict Standards: Non-static method object_class::foo1() cannot be called statically in /usr/local/src/php-5.2.5/ext/standard/tests/general_functions/is_callable.php on line 39 604+ 605+ Strict Standards: Non-static method object_class::foo1() cannot be called statically in /usr/local/src/php-5.2.5/ext/standard/tests/general_functions/is_callable.php on line 39 606+ bool(true) 625- bool(true) 630- bool(true) 675+ 676+ Strict Standards: Non-static method object_class::foo1() cannot be called statically in /usr/local/src/php-5.2.5/ext/standard/tests/general_functions/is_callable.php on line 35 681+ 682+ Strict Standards: Non-static method object_class::foo1() cannot be called statically in /usr/local/src/php-5.2.5/ext/standard/tests/general_functions/is_callable.php on line 37 686+ 687+ Strict Standards: Non-static method object_class::foo1() cannot be called statically in /usr/local/src/php-5.2.5/ext/standard/tests/general_functions/is_callable.php on line 38 688+ bool(true) 689+ 690+ Strict Standards: Non-static method object_class::foo1() cannot be called statically in /usr/local/src/php-5.2.5/ext/standard/tests/general_functions/is_callable.php on line 39 691+ 692+ Strict Standards: Non-static method object_class::foo1() cannot be called statically in /usr/local/src/php-5.2.5/ext/standard/tests/general_functions/is_callable.php on line 39 693+ bool(true) 702- bool(true) 707- bool(true) 762+ 763+ Strict Standards: Non-static method object_class::foo1() cannot be called statically in /usr/local/src/php-5.2.5/ext/standard/tests/general_functions/is_callable.php on line 35 768+ 769+ Strict Standards: Non-static method object_class::foo1() cannot be called statically in /usr/local/src/php-5.2.5/ext/standard/tests/general_functions/is_callable.php on line 37 773+ 774+ Strict Standards: Non-static method object_class::foo1() cannot be called statically in /usr/local/src/php-5.2.5/ext/standard/tests/general_functions/is_callable.php on line 38 775+ bool(true) 776+ 777+ Strict Standards: Non-static method object_class::foo1() cannot be called statically in /usr/local/src/php-5.2.5/ext/standard/tests/general_functions/is_callable.php on line 39 778+ 779+ Strict Standards: Non-static method object_class::foo1() cannot be called statically in /usr/local/src/php-5.2.5/ext/standard/tests/general_functions/is_callable.php on line 39 780+ bool(true) 779- bool(true) 784- bool(true) 849+ 850+ Strict Standards: Non-static method object_class::foo1() cannot be called statically in /usr/local/src/php-5.2.5/ext/standard/tests/general_functions/is_callable.php on line 35 855+ 856+ Strict Standards: Non-static method object_class::foo1() cannot be called statically in /usr/local/src/php-5.2.5/ext/standard/tests/general_functions/is_callable.php on line 37 860+ 861+ Strict Standards: Non-static method object_class::foo1() cannot be called statically in /usr/local/src/php-5.2.5/ext/standard/tests/general_functions/is_callable.php on line 38 862+ bool(true) 863+ 864+ Strict Standards: Non-static method object_class::foo1() cannot be called statically in /usr/local/src/php-5.2.5/ext/standard/tests/general_functions/is_callable.php on line 39 865+ 866+ Strict Standards: Non-static method object_class::foo1() cannot be called statically in /usr/local/src/php-5.2.5/ext/standard/tests/general_functions/is_callable.php on line 39 867+ bool(true) ================================================================================ ================================================================================ /usr/local/src/php-5.2.5/ext/standard/tests/strings/setlocale_basic1.phpt ================================================================================ *** Testing setlocale() : basic functionality - set to a specific locale *** Setting system locale(LC_ALL) to Checking currency settings in the new locale, expected: EUR, Found: Test FAILED. Done ================================================================================ 003+ Test FAILED. 003- string(%d) %s 004- Checking currency settings in the new locale, expected: %s, Found: %s 005- Test PASSED. ================================================================================ ================================================================================ /usr/local/src/php-5.2.5/ext/standard/tests/strings/setlocale_basic2.phpt ================================================================================ *** Testing setlocale() with an array containing list of locales *** -- Testing setlocale() : 'category' argument as LC_ALL & 'locale' argument as an array -- Test FAILED. Done ================================================================================ 003+ Test FAILED. 003- string(%d) "%s" 004- Checking currency settings in the new locale, expected: %s, Found: %s 005- Test PASSED. ================================================================================ ================================================================================ /usr/local/src/php-5.2.5/ext/standard/tests/strings/setlocale_basic3.phpt ================================================================================ *** Testing setlocale() by passing multiple locales as argument *** Done ================================================================================ 002- -- Testing setlocale() by giving 'category' as LC_ALL & multiple locales(en_US.utf8, Ko_KR.utf8, zh_CN.utf8) -- 003- string(%d) "%s" 004- Checking currency settings in the new locale, expected: %s, Found: %s 005- Test PASSED. ================================================================================ ================================================================================ /usr/local/src/php-5.2.5/ext/standard/tests/strings/setlocale_variation1.phpt ================================================================================ *** Testing setlocale() by passing multiple valid/invalid locales as argument *** Done ================================================================================ 002- -- Testing setlocale() by giving 'category' as LC_ALL & multiple locales(en_US.invalid, en_US.utf8, Ko_KR.utf8, KO_KR.invalid, zh_CN.utf8) -- 003- string(%d) "%s" 004- Checking currency settings in the new locale, expected: %s, Found: %s 005- Test PASSED. ================================================================================ ================================================================================ /usr/local/src/php-5.2.5/ext/standard/tests/strings/setlocale_variation3.phpt ================================================================================ *** Testing setlocale() : usage variations - setting system locale = 0 *** Locale info, before setting the locale array(18) { ["decimal_point"]=> string(1) "." ["thousands_sep"]=> string(0) "" ["int_curr_symbol"]=> string(0) "" ["currency_symbol"]=> string(0) "" ["mon_decimal_point"]=> string(0) "" ["mon_thousands_sep"]=> string(0) "" ["positive_sign"]=> string(0) "" ["negative_sign"]=> string(0) "" ["int_frac_digits"]=> int(127) ["frac_digits"]=> int(127) ["p_cs_precedes"]=> int(127) ["p_sep_by_space"]=> int(127) ["n_cs_precedes"]=> int(127) ["n_sep_by_space"]=> int(127) ["p_sign_posn"]=> int(127) ["n_sign_posn"]=> int(127) ["grouping"]=> array(0) { } ["mon_grouping"]=> array(0) { } } Setting system locale, category = LC_ALL and locale = 0 Locale info, after setting the locale array(18) { ["decimal_point"]=> string(1) "." ["thousands_sep"]=> string(0) "" ["int_curr_symbol"]=> string(0) "" ["currency_symbol"]=> string(0) "" ["mon_decimal_point"]=> string(0) "" ["mon_thousands_sep"]=> string(0) "" ["positive_sign"]=> string(0) "" ["negative_sign"]=> string(0) "" ["int_frac_digits"]=> int(127) ["frac_digits"]=> int(127) ["p_cs_precedes"]=> int(127) ["p_sep_by_space"]=> int(127) ["n_cs_precedes"]=> int(127) ["n_sep_by_space"]=> int(127) ["p_sign_posn"]=> int(127) ["n_sign_posn"]=> int(127) ["grouping"]=> array(0) { } ["mon_grouping"]=> array(0) { } } Checking locale in the system, Expected : no change in the existing locale Test PASSED. Done ================================================================================ 007+ string(0) "" 007- string(1) "," 009+ string(0) "" 009- string(4) "USD " 011+ string(0) "" 011- string(1) "$" 013+ string(0) "" 013- string(1) "." 015+ string(0) "" 015- string(1) "," 019+ string(0) "" 019- string(1) "-" 021+ int(127) 021- int(2) 023+ int(127) 023- int(2) 025+ int(127) 025- int(1) 027+ int(127) 027- int(0) 029+ int(127) 029- int(1) 031+ int(127) 031- int(0) 033+ int(127) 033- int(1) 035+ int(127) 035- int(1) 037+ array(0) { 037- array(2) { 038- [0]=> 039- int(3) 040- [1]=> 041- int(3) 040+ array(0) { 044- array(2) { 045- [0]=> 046- int(3) 047- [1]=> 048- int(3) 049+ string(0) "" 051+ string(0) "" 053+ string(0) "" 055+ string(0) "" 057+ string(0) "" 057- string(1) "," 059- string(4) "USD " 061+ string(0) "" 061- string(1) "$" 063+ int(127) 063- string(1) "." 065+ int(127) 065- string(1) "," 067+ int(127) 069+ int(127) 069- string(1) "-" 071+ int(127) 071- int(2) 073+ int(127) 073- int(2) 075+ int(127) 075- int(1) 077+ int(127) 077- int(0) 079+ array(0) { 079- int(1) 081- int(0) 082+ array(0) { 083- int(1) 085- int(1) 087- array(2) { 088- [0]=> 089- int(3) 090- [1]=> 091- int(3) 094- array(2) { 095- [0]=> 096- int(3) 097- [1]=> 098- int(3) ================================================================================ ================================================================================ /usr/local/src/php-5.2.5/ext/standard/tests/strings/setlocale_variation4.phpt ================================================================================ *** Testing setlocale() : usage variations - Setting system locale = null *** Locale info, before setting the locale array(18) { ["decimal_point"]=> string(1) "." ["thousands_sep"]=> string(0) "" ["int_curr_symbol"]=> string(0) "" ["currency_symbol"]=> string(0) "" ["mon_decimal_point"]=> string(0) "" ["mon_thousands_sep"]=> string(0) "" ["positive_sign"]=> string(0) "" ["negative_sign"]=> string(0) "" ["int_frac_digits"]=> int(127) ["frac_digits"]=> int(127) ["p_cs_precedes"]=> int(127) ["p_sep_by_space"]=> int(127) ["n_cs_precedes"]=> int(127) ["n_sep_by_space"]=> int(127) ["p_sign_posn"]=> int(127) ["n_sign_posn"]=> int(127) ["grouping"]=> array(0) { } ["mon_grouping"]=> array(0) { } } Setting system locale, category = LC_ALL and locale = null Locale info, after setting the locale array(18) { ["decimal_point"]=> string(1) "." ["thousands_sep"]=> string(0) "" ["int_curr_symbol"]=> string(0) "" ["currency_symbol"]=> string(0) "" ["mon_decimal_point"]=> string(0) "" ["mon_thousands_sep"]=> string(0) "" ["positive_sign"]=> string(0) "" ["negative_sign"]=> string(0) "" ["int_frac_digits"]=> int(127) ["frac_digits"]=> int(127) ["p_cs_precedes"]=> int(127) ["p_sep_by_space"]=> int(127) ["n_cs_precedes"]=> int(127) ["n_sep_by_space"]=> int(127) ["p_sign_posn"]=> int(127) ["n_sign_posn"]=> int(127) ["grouping"]=> array(0) { } ["mon_grouping"]=> array(0) { } } Checking new locale in the system, Expected : the locale names will be set from the values of environment variables Test FAILED. Done ================================================================================ 007+ string(0) "" 007- string(1) "," 009+ string(0) "" 009- string(4) "AUD " 011+ string(0) "" 011- string(1) "$" 013+ string(0) "" 013- string(1) "." 015+ string(0) "" 015- string(1) "," 019+ string(0) "" 019- string(1) "-" 021+ int(127) 021- int(2) 023+ int(127) 023- int(2) 025+ int(127) 025- int(1) 027+ int(127) 027- int(0) 029+ int(127) 029- int(1) 031+ int(127) 031- int(0) 033+ int(127) 033- int(1) 035+ int(127) 035- int(1) 037+ array(0) { 037- array(2) { 038- [0]=> 039- int(3) 040- [1]=> 041- int(3) 040+ array(0) { 044- array(2) { 045- [0]=> 046- int(3) 047- [1]=> 048- int(3) 049+ string(0) "" 051+ string(0) "" 053+ string(0) "" 055+ string(0) "" 057+ string(0) "" 057- string(1) "," 059- string(4) "USD " 061+ string(0) "" 061- string(1) "$" 063+ int(127) 063- string(1) "." 065+ int(127) 065- string(1) "," 067+ int(127) 069+ int(127) 069- string(1) "-" 071+ int(127) 071- int(2) 073+ int(127) 073- int(2) 075+ int(127) 075- int(1) 077+ int(127) 077- int(0) 079+ array(0) { 079- int(1) 081- int(0) 082+ array(0) { 083- int(1) 085- int(1) 086+ Test FAILED. 087- array(2) { 088- [0]=> 089- int(3) 090- [1]=> 091- int(3) 094- array(2) { 095- [0]=> 096- int(3) 097- [1]=> 098- int(3) 102- Test PASSED. ================================================================================ ================================================================================ /usr/local/src/php-5.2.5/ext/standard/tests/strings/setlocale_variation5.phpt ================================================================================ *** Testing setlocale() : usage variations - setting system locale = "" *** Locale info, before setting the locale array(18) { ["decimal_point"]=> string(1) "." ["thousands_sep"]=> string(0) "" ["int_curr_symbol"]=> string(0) "" ["currency_symbol"]=> string(0) "" ["mon_decimal_point"]=> string(0) "" ["mon_thousands_sep"]=> string(0) "" ["positive_sign"]=> string(0) "" ["negative_sign"]=> string(0) "" ["int_frac_digits"]=> int(127) ["frac_digits"]=> int(127) ["p_cs_precedes"]=> int(127) ["p_sep_by_space"]=> int(127) ["n_cs_precedes"]=> int(127) ["n_sep_by_space"]=> int(127) ["p_sign_posn"]=> int(127) ["n_sign_posn"]=> int(127) ["grouping"]=> array(0) { } ["mon_grouping"]=> array(0) { } } Setting system locale, category = LC_ALL and locale = "" Locale info, after setting the locale array(18) { ["decimal_point"]=> string(1) "." ["thousands_sep"]=> string(0) "" ["int_curr_symbol"]=> string(0) "" ["currency_symbol"]=> string(0) "" ["mon_decimal_point"]=> string(0) "" ["mon_thousands_sep"]=> string(0) "" ["positive_sign"]=> string(0) "" ["negative_sign"]=> string(0) "" ["int_frac_digits"]=> int(127) ["frac_digits"]=> int(127) ["p_cs_precedes"]=> int(127) ["p_sep_by_space"]=> int(127) ["n_cs_precedes"]=> int(127) ["n_sep_by_space"]=> int(127) ["p_sign_posn"]=> int(127) ["n_sign_posn"]=> int(127) ["grouping"]=> array(0) { } ["mon_grouping"]=> array(0) { } } Checking new locale in the system, Expected : the locale names will be set from the values of environment variables Test FAILED. Done ================================================================================ 007+ string(0) "" 007- string(1) "," 009+ string(0) "" 009- string(4) "AUD " 011+ string(0) "" 011- string(1) "$" 013+ string(0) "" 013- string(1) "." 015+ string(0) "" 015- string(1) "," 019+ string(0) "" 019- string(1) "-" 021+ int(127) 021- int(2) 023+ int(127) 023- int(2) 025+ int(127) 025- int(1) 027+ int(127) 027- int(0) 029+ int(127) 029- int(1) 031+ int(127) 031- int(0) 033+ int(127) 033- int(1) 035+ int(127) 035- int(1) 037+ array(0) { 037- array(2) { 038- [0]=> 039- int(3) 040- [1]=> 041- int(3) 040+ array(0) { 044- array(2) { 045- [0]=> 046- int(3) 047- [1]=> 048- int(3) 049+ string(0) "" 051+ string(0) "" 053+ string(0) "" 055+ string(0) "" 057+ string(0) "" 057- string(1) "," 059- string(4) "USD " 061+ string(0) "" 061- string(1) "$" 063+ int(127) 063- string(1) "." 065+ int(127) 065- string(1) "," 067+ int(127) 069+ int(127) 069- string(1) "-" 071+ int(127) 071- int(2) 073+ int(127) 073- int(2) 075+ int(127) 075- int(1) 077+ int(127) 077- int(0) 079+ array(0) { 079- int(1) 081- int(0) 082+ array(0) { 083- int(1) 085- int(1) 086+ Test FAILED. 087- array(2) { 088- [0]=> 089- int(3) 090- [1]=> 091- int(3) 094- array(2) { 095- [0]=> 096- int(3) 097- [1]=> 098- int(3) 102- Test PASSED. ================================================================================ ================================================================================ /usr/local/src/php-5.2.5/ext/xml/tests/bug32001.phpt ================================================================================ libxml2 Version => 2.6.27 Encoding: UTF-8 XML Prologue: present Chunk size: all data at once BOM: not prepended array(3) { [0]=> string(128) "e38386e382b9e383883ae38386e382b9e3838831: 687474703a2f2f7777772e6578616d706c652e636f6d2fe38386e382b9e383882f, e38386e382b9e38388" [1]=> string(60) "e38386e382b9e383883ae38386e382b9e3838832: e38386e382b9e38388" [2]=> string(42) "e38386e382b9e383883ae38386e382b9e3838833: " } Encoding: UTF-8 XML Prologue: not present Chunk size: all data at once BOM: not prepended array(3) { [0]=> string(128) "e38386e382b9e383883ae38386e382b9e3838831: 687474703a2f2f7777772e6578616d706c652e636f6d2fe38386e382b9e383882f, e38386e382b9e38388" [1]=> string(60) "e38386e382b9e383883ae38386e382b9e3838832: e38386e382b9e38388" [2]=> string(42) "e38386e382b9e383883ae38386e382b9e3838833: " } Encoding: UTF-8 XML Prologue: present Chunk size: all data at once BOM: prepended array(3) { [0]=> string(128) "e38386e382b9e383883ae38386e382b9e3838831: 687474703a2f2f7777772e6578616d706c652e636f6d2fe38386e382b9e383882f, e38386e382b9e38388" [1]=> string(60) "e38386e382b9e383883ae38386e382b9e3838832: e38386e382b9e38388" [2]=> string(42) "e38386e382b9e383883ae38386e382b9e3838833: " } Encoding: UTF-8 XML Prologue: not present Chunk size: all data at once BOM: prepended array(3) { [0]=> string(128) "e38386e382b9e383883ae38386e382b9e3838831: 687474703a2f2f7777772e6578616d706c652e636f6d2fe38386e382b9e383882f, e38386e382b9e38388" [1]=> string(60) "e38386e382b9e383883ae38386e382b9e3838832: e38386e382b9e38388" [2]=> string(42) "e38386e382b9e383883ae38386e382b9e3838833: " } Encoding: UTF-16BE XML Prologue: present Chunk size: all data at once BOM: not prepended array(3) { [0]=> string(128) "e38386e382b9e383883ae38386e382b9e3838831: 687474703a2f2f7777772e6578616d706c652e636f6d2fe38386e382b9e383882f, e38386e382b9e38388" [1]=> string(60) "e38386e382b9e383883ae38386e382b9e3838832: e38386e382b9e38388" [2]=> string(42) "e38386e382b9e383883ae38386e382b9e3838833: " } Encoding: UTF-16BE XML Prologue: present Chunk size: all data at once BOM: prepended array(3) { [0]=> string(128) "e38386e382b9e383883ae38386e382b9e3838831: 687474703a2f2f7777772e6578616d706c652e636f6d2fe38386e382b9e383882f, e38386e382b9e38388" [1]=> string(60) "e38386e382b9e383883ae38386e382b9e3838832: e38386e382b9e38388" [2]=> string(42) "e38386e382b9e383883ae38386e382b9e3838833: " } Encoding: UTF-16BE XML Prologue: not present Chunk size: all data at once BOM: prepended array(3) { [0]=> string(128) "e38386e382b9e383883ae38386e382b9e3838831: 687474703a2f2f7777772e6578616d706c652e636f6d2fe38386e382b9e383882f, e38386e382b9e38388" [1]=> string(60) "e38386e382b9e383883ae38386e382b9e3838832: e38386e382b9e38388" [2]=> string(42) "e38386e382b9e383883ae38386e382b9e3838833: " } Encoding: UTF-16LE XML Prologue: present Chunk size: all data at once BOM: not prepended array(3) { [0]=> string(128) "e38386e382b9e383883ae38386e382b9e3838831: 687474703a2f2f7777772e6578616d706c652e636f6d2fe38386e382b9e383882f, e38386e382b9e38388" [1]=> string(60) "e38386e382b9e383883ae38386e382b9e3838832: e38386e382b9e38388" [2]=> string(42) "e38386e382b9e383883ae38386e382b9e3838833: " } Encoding: UTF-16LE XML Prologue: present Chunk size: all data at once BOM: prepended array(3) { [0]=> string(128) "e38386e382b9e383883ae38386e382b9e3838831: 687474703a2f2f7777772e6578616d706c652e636f6d2fe38386e382b9e383882f, e38386e382b9e38388" [1]=> string(60) "e38386e382b9e383883ae38386e382b9e3838832: e38386e382b9e38388" [2]=> string(42) "e38386e382b9e383883ae38386e382b9e3838833: " } Encoding: UTF-16LE XML Prologue: not present Chunk size: all data at once BOM: prepended array(3) { [0]=> string(128) "e38386e382b9e383883ae38386e382b9e3838831: 687474703a2f2f7777772e6578616d706c652e636f6d2fe38386e382b9e383882f, e38386e382b9e38388" [1]=> string(60) "e38386e382b9e383883ae38386e382b9e3838832: e38386e382b9e38388" [2]=> string(42) "e38386e382b9e383883ae38386e382b9e3838833: " } Encoding: UTF-8 XML Prologue: present Chunk size: 1 byte(s) BOM: not prepended array(3) { [0]=> string(128) "e38386e382b9e383883ae38386e382b9e3838831: 687474703a2f2f7777772e6578616d706c652e636f6d2fe38386e382b9e383882f, e38386e382b9e38388" [1]=> string(60) "e38386e382b9e383883ae38386e382b9e3838832: e38386e382b9e38388" [2]=> string(42) "e38386e382b9e383883ae38386e382b9e3838833: " } ================================================================================ 134- Encoding: UTF-8 135- XML Prologue: not present 136- Chunk size: 1 byte(s) 137- BOM: not prepended 138- array(3) { 139- [0]=> 140- string(128) "e38386e382b9e383883ae38386e382b9e3838831: 687474703a2f2f7777772e6578616d706c652e636f6d2fe38386e382b9e383882f, e38386e382b9e38388" 141- [1]=> 142- string(60) "e38386e382b9e383883ae38386e382b9e3838832: e38386e382b9e38388" 143- [2]=> 144- string(42) "e38386e382b9e383883ae38386e382b9e3838833: " 145- } 146- Encoding: UTF-8 147- XML Prologue: present 148- Chunk size: 1 byte(s) 149- BOM: prepended 150- array(3) { 151- [0]=> 152- string(128) "e38386e382b9e383883ae38386e382b9e3838831: 687474703a2f2f7777772e6578616d706c652e636f6d2fe38386e382b9e383882f, e38386e382b9e38388" 153- [1]=> 154- string(60) "e38386e382b9e383883ae38386e382b9e3838832: e38386e382b9e38388" 155- [2]=> 156- string(42) "e38386e382b9e383883ae38386e382b9e3838833: " 157- } 158- Encoding: UTF-8 159- XML Prologue: not present 160- Chunk size: 1 byte(s) 161- BOM: prepended 162- array(3) { 163- [0]=> 164- string(128) "e38386e382b9e383883ae38386e382b9e3838831: 687474703a2f2f7777772e6578616d706c652e636f6d2fe38386e382b9e383882f, e38386e382b9e38388" 165- [1]=> 166- string(60) "e38386e382b9e383883ae38386e382b9e3838832: e38386e382b9e38388" 167- [2]=> 168- string(42) "e38386e382b9e383883ae38386e382b9e3838833: " 169- } 170- Encoding: UTF-16BE 171- XML Prologue: present 172- Chunk size: 1 byte(s) 173- BOM: not prepended 174- array(3) { 175- [0]=> 176- string(128) "e38386e382b9e383883ae38386e382b9e3838831: 687474703a2f2f7777772e6578616d706c652e636f6d2fe38386e382b9e383882f, e38386e382b9e38388" 177- [1]=> 178- string(60) "e38386e382b9e383883ae38386e382b9e3838832: e38386e382b9e38388" 179- [2]=> 180- string(42) "e38386e382b9e383883ae38386e382b9e3838833: " 181- } 182- Encoding: UTF-16BE 183- XML Prologue: present 184- Chunk size: 1 byte(s) 185- BOM: prepended 186- array(3) { 187- [0]=> 188- string(128) "e38386e382b9e383883ae38386e382b9e3838831: 687474703a2f2f7777772e6578616d706c652e636f6d2fe38386e382b9e383882f, e38386e382b9e38388" 189- [1]=> 190- string(60) "e38386e382b9e383883ae38386e382b9e3838832: e38386e382b9e38388" 191- [2]=> 192- string(42) "e38386e382b9e383883ae38386e382b9e3838833: " 193- } 194- Encoding: UTF-16BE 195- XML Prologue: not present 196- Chunk size: 1 byte(s) 197- BOM: prepended 198- array(3) { 199- [0]=> 200- string(128) "e38386e382b9e383883ae38386e382b9e3838831: 687474703a2f2f7777772e6578616d706c652e636f6d2fe38386e382b9e383882f, e38386e382b9e38388" 201- [1]=> 202- string(60) "e38386e382b9e383883ae38386e382b9e3838832: e38386e382b9e38388" 203- [2]=> 204- string(42) "e38386e382b9e383883ae38386e382b9e3838833: " 205- } 206- Encoding: UTF-16LE 207- XML Prologue: present 208- Chunk size: 1 byte(s) 209- BOM: not prepended 210- array(3) { 211- [0]=> 212- string(128) "e38386e382b9e383883ae38386e382b9e3838831: 687474703a2f2f7777772e6578616d706c652e636f6d2fe38386e382b9e383882f, e38386e382b9e38388" 213- [1]=> 214- string(60) "e38386e382b9e383883ae38386e382b9e3838832: e38386e382b9e38388" 215- [2]=> 216- string(42) "e38386e382b9e383883ae38386e382b9e3838833: " 217- } 218- Encoding: UTF-16LE 219- XML Prologue: present 220- Chunk size: 1 byte(s) 221- BOM: prepended 222- array(3) { 223- [0]=> 224- string(128) "e38386e382b9e383883ae38386e382b9e3838831: 687474703a2f2f7777772e6578616d706c652e636f6d2fe38386e382b9e383882f, e38386e382b9e38388" 225- [1]=> 226- string(60) "e38386e382b9e383883ae38386e382b9e3838832: e38386e382b9e38388" 227- [2]=> 228- string(42) "e38386e382b9e383883ae38386e382b9e3838833: " 229- } 230- Encoding: UTF-16LE 231- XML Prologue: not present 232- Chunk size: 1 byte(s) 233- BOM: prepended 234- array(3) { 235- [0]=> 236- string(128) "e38386e382b9e383883ae38386e382b9e3838831: 687474703a2f2f7777772e6578616d706c652e636f6d2fe38386e382b9e383882f, e38386e382b9e38388" 237- [1]=> 238- string(60) "e38386e382b9e383883ae38386e382b9e3838832: e38386e382b9e38388" 239- [2]=> 240- string(42) "e38386e382b9e383883ae38386e382b9e3838833: " 241- } ================================================================================ ================================================================================ /usr/local/src/php-5.2.5/sapi/cli/tests/015.phpt ================================================================================ PHP 5.2.5 (cli) (built: Nov 15 2007 13:19:03) PHP 5.2.5 (cli) (built: Nov 15 2007 13:19:03) Usage: php [options] [-f] <file> [--] [args...] Done ================================================================================ 002+ 003+ PHP 5.2.5 (cli) (built: Nov 15 2007 13:19:03) 004+ Usage: php [options] [-f] <file> [--] [args...] 005+ Done 002- Array 003- ( 004- [0] => - 005- [1] => foo 006- [2] => bar 007- [3] => baz 008- ) 009- 010- PHP %d.%d.%d%s(cli) (built: %s)%s 011- Usage: %s [options] [-f] <file> [--] [args...] 012- Done ================================================================================ ================================================================================ BUILD ENVIRONMENT ================================================================================ OS: Linux - Linux merlin.caulfield.us 2.4.27-2-686 #1 Wed Aug 17 10:34:09 UTC 2005 i686 Autoconf: autoconf (GNU Autoconf) 2.61 Copyright (C) 2006 Free Software Foundation, Inc. This is free software. You may redistribute copies of it under the terms of the GNU General Public License <http://www.gnu.org/licenses/gpl.html>. There is NO WARRANTY, to the extent permitted by law. Written by David J. MacKenzie and Akim Demaille. Bundled Libtool: ltmain.sh (GNU libtool) 1.5.20 (1.1220.2.287 2005/08/31 18:54:15) Copyright (C) 2005 Free Software Foundation, Inc. This is free software; see the source for copying conditions. There is NO warranty; not even for MERCHANTABILITY or FITNESS FOR A PARTICULAR PURPOSE. System Libtool: N/A Compiler: Using built-in specs. Target: i486-linux-gnu Configured with: ../src/configure -v --enable-languages=c,c++,fortran,objc,obj-c++,treelang --prefix=/usr --enable-shared --with-system-zlib --libexecdir=/usr/lib --without-included-gettext --enable-threads=posix --enable-nls --program-suffix=-4.1 --enable-__cxa_atexit --enable-clocale=gnu --enable-libstdcxx-debug --enable-mpfr --with-tune=i686 --enable-checking=release i486-linux-gnu Thread model: posix gcc version 4.1.2 20061115 (prerelease) (Debian 4.1.1-21) Bison: bison (GNU Bison) 2.3 Written by Robert Corbett and Richard Stallman. Copyright (C) 2006 Free Software Foundation, Inc. This is free software; see the source for copying conditions. There is NO warranty; not even for MERCHANTABILITY or FITNESS FOR A PARTICULAR PURPOSE. Libraries: libcrypt.so.1 => /lib/libcrypt.so.1 (0x4001d000) librt.so.1 => /lib/librt.so.1 (0x4004b000) libresolv.so.2 => /lib/libresolv.so.2 (0x4005e000) libm.so.6 => /lib/libm.so.6 (0x40071000) libdl.so.2 => /lib/libdl.so.2 (0x40095000) libnsl.so.1 => /lib/libnsl.so.1 (0x40099000) libxml2.so.2 => /usr/lib/libxml2.so.2 (0x400ae000) libc.so.6 => /lib/libc.so.6 (0x401c8000) libpthread.so.0 => /lib/libpthread.so.0 (0x402e3000) /lib/ld-linux.so.2 (0x40000000) libz.so.1 => /usr/lib/libz.so.1 (0x40336000) User's E-mail: brendan at caulfield dot us ================================================================================ PHPINFO ================================================================================ phpinfo() PHP Version => 5.2.5 System => Linux merlin.caulfield.us 2.4.27-2-686 #1 Wed Aug 17 10:34:09 UTC 2005 i686 Build Date => Nov 15 2007 13:07:02 Configure Command => './configure' '--with-apxs2=/usr/local/apache2/bin/apxs' Server API => Command Line Interface Virtual Directory Support => disabled Configuration File (php.ini) Path => /usr/local/lib Loaded Configuration File => /usr/local/Zend/etc/php.ini PHP API => 20041225 PHP Extension => 20060613 Zend Extension => 220060519 Debug Build => no Thread Safety => disabled Zend Memory Manager => enabled IPv6 Support => enabled Registered PHP Streams => php, file, data, http, ftp Registered Stream Socket Transports => tcp, udp, unix, udg Registered Stream Filters => string.rot13, string.toupper, string.tolower, string.strip_tags, convert.*, consumed, convert.iconv.* This program makes use of the Zend Scripting Language Engine: Zend Engine v2.2.0, Copyright (c) 1998-2007 Zend Technologies with Zend Extension Manager v1.2.2, Copyright (c) 2003-2007, by Zend Technologies with Zend Optimizer v3.3.0, Copyright (c) 1998-2007, by Zend Technologies _______________________________________________________________________ Configuration PHP Core Directive => Local Value => Master Value allow_call_time_pass_reference => Off => Off allow_url_fopen => On => On allow_url_include => Off => Off always_populate_raw_post_data => Off => Off arg_separator.input => & => & arg_separator.output => & => & asp_tags => Off => Off auto_append_file => no value => no value auto_globals_jit => On => On auto_prepend_file => no value => no value browscap => no value => no value default_charset => no value => no value default_mimetype => text/html => text/html define_syslog_variables => Off => Off disable_classes => no value => no value disable_functions => no value => no value display_errors => STDOUT => STDOUT display_startup_errors => Off => Off doc_root => no value => no value docref_ext => no value => no value docref_root => no value => no value enable_dl => On => On error_append_string => no value => no value error_log => no value => no value error_prepend_string => no value => no value error_reporting => no value => no value expose_php => On => On extension_dir => /usr/local/lib/php/extensions/no-debug-non-zts-20060613 => /usr/local/lib/php/extensions/no-debug-non-zts-20060613 file_uploads => On => On highlight.bg => <font style="color: #FFFFFF">#FFFFFF</font> => <font style="color: #FFFFFF">#FFFFFF</font> highlight.comment => <font style="color: #FF8000">#FF8000</font> => <font style="color: #FF8000">#FF8000</font> highlight.default => <font style="color: #0000BB">#0000BB</font> => <font style="color: #0000BB">#0000BB</font> highlight.html => <font style="color: #000000">#000000</font> => <font style="color: #000000">#000000</font> highlight.keyword => <font style="color: #007700">#007700</font> => <font style="color: #007700">#007700</font> highlight.string => <font style="color: #DD0000">#DD0000</font> => <font style="color: #DD0000">#DD0000</font> html_errors => Off => Off ignore_repeated_errors => Off => Off ignore_repeated_source => Off => Off ignore_user_abort => Off => Off implicit_flush => On => On include_path => .:/usr/local/lib/php => .:/usr/local/lib/php log_errors => Off => Off log_errors_max_len => 1024 => 1024 magic_quotes_gpc => On => On magic_quotes_runtime => Off => Off magic_quotes_sybase => Off => Off mail.force_extra_parameters => no value => no value max_execution_time => 0 => 0 max_input_nesting_level => 64 => 64 max_input_time => -1 => -1 memory_limit => 128M => 128M open_basedir => no value => no value output_buffering => 0 => 0 output_handler => no value => no value post_max_size => 8M => 8M precision => 14 => 14 realpath_cache_size => 16K => 16K realpath_cache_ttl => 120 => 120 register_argc_argv => On => On register_globals => Off => Off register_long_arrays => On => On report_memleaks => On => On report_zend_debug => Off => Off safe_mode => Off => Off safe_mode_exec_dir => /usr/local/php/bin => /usr/local/php/bin safe_mode_gid => Off => Off safe_mode_include_dir => no value => no value sendmail_from => no value => no value sendmail_path => /usr/sbin/sendmail -t -i => /usr/sbin/sendmail -t -i serialize_precision => 100 => 100 short_open_tag => On => On SMTP => localhost => localhost smtp_port => 25 => 25 sql.safe_mode => Off => Off track_errors => Off => Off unserialize_callback_func => no value => no value upload_max_filesize => 2M => 2M upload_tmp_dir => no value => no value user_dir => no value => no value variables_order => EGPCS => EGPCS xmlrpc_error_number => 0 => 0 xmlrpc_errors => Off => Off y2k_compliance => On => On zend.ze1_compatibility_mode => Off => Off ctype ctype functions => enabled date date/time support => enabled "Olson" Timezone Database Version => 2007.9 Timezone Database => internal Default timezone => America/Chicago Directive => Local Value => Master Value date.default_latitude => 31.7667 => 31.7667 date.default_longitude => 35.2333 => 35.2333 date.sunrise_zenith => 90.583333 => 90.583333 date.sunset_zenith => 90.583333 => 90.583333 date.timezone => no value => no value dom DOM/XML => enabled DOM/XML API Version => 20031129 libxml Version => 2.6.27 HTML Support => enabled XPath Support => enabled XPointer Support => enabled Schema Support => enabled RelaxNG Support => enabled filter Input Validation and Filtering => enabled Revision => $Revision: 1.52.2.39 $ Directive => Local Value => Master Value filter.default => unsafe_raw => unsafe_raw filter.default_flags => no value => no value hash hash support => enabled Hashing Engines => md2 md4 md5 sha1 sha256 sha384 sha512 ripemd128 ripemd160 ripemd256 ripemd320 whirlpool tiger128,3 tiger160,3 tiger192,3 tiger128,4 tiger160,4 tiger192,4 snefru gost adler32 crc32 crc32b haval128,3 haval160,3 haval192,3 haval224,3 haval256,3 haval128,4 haval160,4 haval192,4 haval224,4 haval256,4 haval128,5 haval160,5 haval192,5 haval224,5 haval256,5 iconv iconv support => enabled iconv implementation => glibc iconv library version => 2.3.6 Directive => Local Value => Master Value iconv.input_encoding => ISO-8859-1 => ISO-8859-1 iconv.internal_encoding => ISO-8859-1 => ISO-8859-1 iconv.output_encoding => ISO-8859-1 => ISO-8859-1 json json support => enabled json version => 1.2.1 libxml libXML support => active libXML Version => 2.6.27 libXML streams => enabled pcre PCRE (Perl Compatible Regular Expressions) Support => enabled PCRE Library Version => 7.3 2007-08-28 Directive => Local Value => Master Value pcre.backtrack_limit => 100000 => 100000 pcre.recursion_limit => 100000 => 100000 PDO PDO support => enabled PDO drivers => sqlite, sqlite2 pdo_sqlite PDO Driver for SQLite 3.x => enabled PECL Module version => (bundled) 1.0.1 $Id: pdo_sqlite.c,v 1.10.2.6.2.2 2007/03/23 14:30:00 wez Exp $ SQLite Library => 3.3.17 posix Revision => $Revision: 1.70.2.3.2.16 $ Reflection Reflection => enabled Version => $Id: php_reflection.c,v 1.164.2.33.2.47 2007/10/28 13:47:14 iliaa Exp $ session Session Support => enabled Registered save handlers => files user sqlite Registered serializer handlers => php php_binary Directive => Local Value => Master Value session.auto_start => Off => Off session.bug_compat_42 => On => On session.bug_compat_warn => On => On session.cache_expire => 180 => 180 session.cache_limiter => nocache => nocache session.cookie_domain => no value => no value session.cookie_httponly => Off => Off session.cookie_lifetime => 0 => 0 session.cookie_path => / => / session.cookie_secure => Off => Off session.entropy_file => no value => no value session.entropy_length => 0 => 0 session.gc_divisor => 100 => 100 session.gc_maxlifetime => 1440 => 1440 session.gc_probability => 1 => 1 session.hash_bits_per_character => 4 => 4 session.hash_function => 0 => 0 session.name => PHPSESSID => PHPSESSID session.referer_check => no value => no value session.save_handler => files => files session.save_path => no value => no value session.serialize_handler => php => php session.use_cookies => On => On session.use_only_cookies => Off => Off session.use_trans_sid => 0 => 0 SimpleXML Simplexml support => enabled Revision => $Revision: 1.151.2.22.2.35 $ Schema support => enabled SPL SPL support => enabled Interfaces => Countable, OuterIterator, RecursiveIterator, SeekableIterator, SplObserver, SplSubject Classes => AppendIterator, ArrayIterator, ArrayObject, BadFunctionCallException, BadMethodCallException, CachingIterator, DirectoryIterator, DomainException, EmptyIterator, FilterIterator, InfiniteIterator, InvalidArgumentException, IteratorIterator, LengthException, LimitIterator, LogicException, NoRewindIterator, OutOfBoundsException, OutOfRangeException, OverflowException, ParentIterator, RangeException, RecursiveArrayIterator, RecursiveCachingIterator, RecursiveDirectoryIterator, RecursiveFilterIterator, RecursiveIteratorIterator, RecursiveRegexIterator, RegexIterator, RuntimeException, SimpleXMLIterator, SplFileInfo, SplFileObject, SplObjectStorage, SplTempFileObject, UnderflowException, UnexpectedValueException SQLite SQLite support => enabled PECL Module version => 2.0-dev $Id: sqlite.c,v 1.166.2.13.2.9 2007/05/19 17:58:22 iliaa Exp $ SQLite Library => 2.8.17 SQLite Encoding => iso8859 Directive => Local Value => Master Value sqlite.assoc_case => 0 => 0 standard Regex Library => Bundled library enabled Dynamic Library Support => enabled Path to sendmail => /usr/sbin/sendmail -t -i Directive => Local Value => Master Value assert.active => 1 => 1 assert.bail => 0 => 0 assert.callback => no value => no value assert.quiet_eval => 0 => 0 assert.warning => 1 => 1 auto_detect_line_endings => 0 => 0 default_socket_timeout => 60 => 60 safe_mode_allowed_env_vars => PHP_ => PHP_ safe_mode_protected_env_vars => LD_LIBRARY_PATH => LD_LIBRARY_PATH url_rewriter.tags => a=href,area=href,frame=src,form=,fieldset= => a=href,area=href,frame=src,form=,fieldset= user_agent => no value => no value tokenizer Tokenizer Support => enabled xml XML Support => active XML Namespace Support => active libxml2 Version => 2.6.27 xmlreader XMLReader => enabled xmlwriter XMLWriter => enabled Zend Optimizer Optimization Pass 1 => enabled Optimization Pass 2 => enabled Optimization Pass 3 => enabled Optimization Pass 4 => enabled Optimization Pass 9 => enabled Zend Loader => enabled License Path => Obfuscation level => 3 Additional Modules Module Name Environment Variable => Value TEST_PHP_SRCDIR => /usr/local/src/php-5.2.5 SHELL => /bin/bash TERM => xterm MAKEFLAGS => SSH_CLIENT => deleted SSH_TTY => deleted USER => root SSH_AUTH_SOCK => deleted MAKELEVEL => 1 MFLAGS => PATH => /usr/local/sbin:/usr/local/bin:/usr/sbin:/usr/bin:/sbin:/bin:/usr/bin/X11 MAIL => /var/mail/root _ => /usr/local/src/php-5.2.5/sapi/cli/php PWD => /usr/local/src/php-5.2.5 LANG => en_US TEST_PHP_EXECUTABLE => /usr/local/src/php-5.2.5/sapi/cli/php HOME => /root SHLVL => 3 LANGUAGE => en_US:en_GB:en LOGNAME => root SSH_CONNECTION => deleted CC => gcc PHP Variables Variable => Value _SERVER["TEST_PHP_SRCDIR"] => /usr/local/src/php-5.2.5 _SERVER["SHELL"] => /bin/bash _SERVER["TERM"] => xterm _SERVER["MAKEFLAGS"] => _SERVER["SSH_CLIENT"] => deleted _SERVER["SSH_TTY"] => deleted _SERVER["USER"] => root _SERVER["SSH_AUTH_SOCK"] => deleted _SERVER["MAKELEVEL"] => 1 _SERVER["MFLAGS"] => _SERVER["PATH"] => /usr/local/sbin:/usr/local/bin:/usr/sbin:/usr/bin:/sbin:/bin:/usr/bin/X11 _SERVER["MAIL"] => /var/mail/root _SERVER["_"] => /usr/local/src/php-5.2.5/sapi/cli/php _SERVER["PWD"] => /usr/local/src/php-5.2.5 _SERVER["LANG"] => en_US _SERVER["TEST_PHP_EXECUTABLE"] => /usr/local/src/php-5.2.5/sapi/cli/php _SERVER["HOME"] => /root _SERVER["SHLVL"] => 3 _SERVER["LANGUAGE"] => en_US:en_GB:en _SERVER["LOGNAME"] => root _SERVER["SSH_CONNECTION"] => deleted _SERVER["CC"] => gcc _SERVER["PHP_SELF"] => _SERVER["SCRIPT_NAME"] => _SERVER["SCRIPT_FILENAME"] => _SERVER["PATH_TRANSLATED"] => _SERVER["DOCUMENT_ROOT"] => _SERVER["REQUEST_TIME"] => 1195155384 _SERVER["argv"] => Array ( ) _SERVER["argc"] => 0 _ENV["TEST_PHP_SRCDIR"] => /usr/local/src/php-5.2.5 _ENV["SHELL"] => /bin/bash _ENV["TERM"] => xterm _ENV["MAKEFLAGS"] => _ENV["SSH_CLIENT"] => deleted _ENV["SSH_TTY"] => deleted _ENV["USER"] => root _ENV["SSH_AUTH_SOCK"] => deleted _ENV["MAKELEVEL"] => 1 _ENV["MFLAGS"] => _ENV["PATH"] => /usr/local/sbin:/usr/local/bin:/usr/sbin:/usr/bin:/sbin:/bin:/usr/bin/X11 _ENV["MAIL"] => /var/mail/root _ENV["_"] => /usr/local/src/php-5.2.5/sapi/cli/php _ENV["PWD"] => /usr/local/src/php-5.2.5 _ENV["LANG"] => en_US _ENV["TEST_PHP_EXECUTABLE"] => /usr/local/src/php-5.2.5/sapi/cli/php _ENV["HOME"] => /root _ENV["SHLVL"] => 3 _ENV["LANGUAGE"] => en_US:en_GB:en _ENV["LOGNAME"] => root _ENV["SSH_CONNECTION"] => deleted _ENV["CC"] => gcc PHP License This program is free software; you can redistribute it and/or modify it under the terms of the PHP License as published by the PHP Group and included in the distribution in the file: LICENSE This program is distributed in the hope that it will be useful, but WITHOUT ANY WARRANTY; without even the implied warranty of MERCHANTABILITY or FITNESS FOR A PARTICULAR PURPOSE. If you did not receive a copy of the PHP license, or have any questions about PHP licensing, please contact license@php.net.

« previous php.qa (#52229) next »