Test results for 5.2.5 [failed]
| From: | noreply@php.net | Date: | Thu, 15 Nov 2007 21:47:43 +0000 |
| Subject: | Test results for 5.2.5 [failed] | ||
| Groups: | php.qa | ||
| Request: | Send a blank email to php-qa+get-52234@lists.php.net to get a copy of this message | ||
=====================================================================
FAILED TEST SUMMARY
---------------------------------------------------------------------
ctype on integers [ext/ctype/tests/001.phpt]
date_default_timezone_get() function [1] [ext/date/tests/date_default_timezone_get-1.phpt]
date_default_timezone_get() function [2] [ext/date/tests/date_default_timezone_get-2.phpt]
date_default_timezone_set() function [1] [ext/date/tests/date_default_timezone_set-1.phpt]
Localized match [ext/pcre/tests/locales.phpt]
Sort with SORT_LOCALE_STRING [ext/standard/tests/array/locale_sort.phpt]
Test lstat() and stat() functions: usage variations - effects of rename() on link
[ext/standard/tests/file/lstat_stat_variation3.phpt]
Test readlink() and realpath functions: basic functionality - diff. path notation for links(Bug
#42038) [ext/standard/tests/file/readlink_realpath_basic1.phpt]
Test readlink() and realpath() functions: usage variation - linkname/filename stored in object(Bug
#42038) [ext/standard/tests/file/readlink_realpath_variation1.phpt]
Test readlink() and realpath() functions: usage variation - linkname/filename stored in array(Bug
#42038) [ext/standard/tests/file/readlink_realpath_variation2.phpt]
proc_open [ext/standard/tests/general_functions/proc_open02.phpt]
Test variations in usage of acos() [ext/standard/tests/math/acos_variation.phpt]
Test variations in usage of asin() [ext/standard/tests/math/asin_variation.phpt]
Bug #25665 (var_dump () hangs on Nan and INF) [ext/standard/tests/math/bug25665.phpt]
htmlentities() test 2 (setlocale / fr_FR.ISO-8859-15)
[ext/standard/tests/strings/htmlentities02.phpt] (warn: possibly braindead libc)
htmlentities() test 3 (setlocale / de_DE.ISO-8859-1)
[ext/standard/tests/strings/htmlentities03.phpt]
htmlentities() test 4 (setlocale / ja_JP.EUC-JP) [ext/standard/tests/strings/htmlentities04.phpt]
(warn: possibly braindead libc)
htmlentities() test 15 (setlocale / KOI8-R) [ext/standard/tests/strings/htmlentities15.phpt] (warn:
possibly braindead libc)
Test setlocale() function : basic functionality - setting system locale to a specific
[ext/standard/tests/strings/setlocale_basic1.phpt]
Test setlocale() function : basic functionality - set locale using an array
[ext/standard/tests/strings/setlocale_basic2.phpt]
Test setlocale() function : basic functionality - passing multiple locales as argument
[ext/standard/tests/strings/setlocale_basic3.phpt]
Test setlocale() function : error condition [ext/standard/tests/strings/setlocale_error.phpt]
Test setlocale() function : usage variations - passing multiple valid/invlaid locales as argument
[ext/standard/tests/strings/setlocale_variation1.phpt]
Test setlocale() function : usage variations - Setting all available locales in the platform
[ext/standard/tests/strings/setlocale_variation2.phpt]
Test setlocale() function : usage variations - setting system locale = 0
[ext/standard/tests/strings/setlocale_variation3.phpt]
Test setlocale() function : usage variations - setting system locale as null
[ext/standard/tests/strings/setlocale_variation4.phpt]
Test setlocale() function : usage variations - Setting system locale as empty string
[ext/standard/tests/strings/setlocale_variation5.phpt]
Test strtoupper on non-ASCII characters [ext/standard/tests/strings/strtoupper.phpt]
=====================================================================
=====================================================================
TEST RESULT SUMMARY
---------------------------------------------------------------------
Exts skipped : 56
Exts tested : 23
---------------------------------------------------------------------
Number of tests : 4566 3006
Tests skipped : 1560 ( 34.2%) --------
Tests warned : 3 ( 0.1%) ( 0.1%)
Tests failed : 25 ( 0.5%) ( 0.8%)
Tests passed : 2978 ( 65.2%) ( 99.1%)
---------------------------------------------------------------------
Time taken : 750 seconds
=====================================================================
=====================================================================
FAILED TEST SUMMARY
---------------------------------------------------------------------
ctype on integers [ext/ctype/tests/001.phpt]
date_default_timezone_get() function [1] [ext/date/tests/date_default_timezone_get-1.phpt]
date_default_timezone_get() function [2] [ext/date/tests/date_default_timezone_get-2.phpt]
date_default_timezone_set() function [1] [ext/date/tests/date_default_timezone_set-1.phpt]
Localized match [ext/pcre/tests/locales.phpt]
Sort with SORT_LOCALE_STRING [ext/standard/tests/array/locale_sort.phpt]
Test lstat() and stat() functions: usage variations - effects of rename() on link
[ext/standard/tests/file/lstat_stat_variation3.phpt]
Test readlink() and realpath functions: basic functionality - diff. path notation for links(Bug
#42038) [ext/standard/tests/file/readlink_realpath_basic1.phpt]
Test readlink() and realpath() functions: usage variation - linkname/filename stored in object(Bug
#42038) [ext/standard/tests/file/readlink_realpath_variation1.phpt]
Test readlink() and realpath() functions: usage variation - linkname/filename stored in array(Bug
#42038) [ext/standard/tests/file/readlink_realpath_variation2.phpt]
proc_open [ext/standard/tests/general_functions/proc_open02.phpt]
Test variations in usage of acos() [ext/standard/tests/math/acos_variation.phpt]
Test variations in usage of asin() [ext/standard/tests/math/asin_variation.phpt]
Bug #25665 (var_dump () hangs on Nan and INF) [ext/standard/tests/math/bug25665.phpt]
htmlentities() test 2 (setlocale / fr_FR.ISO-8859-15)
[ext/standard/tests/strings/htmlentities02.phpt] (warn: possibly braindead libc)
htmlentities() test 3 (setlocale / de_DE.ISO-8859-1)
[ext/standard/tests/strings/htmlentities03.phpt]
htmlentities() test 4 (setlocale / ja_JP.EUC-JP) [ext/standard/tests/strings/htmlentities04.phpt]
(warn: possibly braindead libc)
htmlentities() test 15 (setlocale / KOI8-R) [ext/standard/tests/strings/htmlentities15.phpt] (warn:
possibly braindead libc)
Test setlocale() function : basic functionality - setting system locale to a specific
[ext/standard/tests/strings/setlocale_basic1.phpt]
Test setlocale() function : basic functionality - set locale using an array
[ext/standard/tests/strings/setlocale_basic2.phpt]
Test setlocale() function : basic functionality - passing multiple locales as argument
[ext/standard/tests/strings/setlocale_basic3.phpt]
Test setlocale() function : error condition [ext/standard/tests/strings/setlocale_error.phpt]
Test setlocale() function : usage variations - passing multiple valid/invlaid locales as argument
[ext/standard/tests/strings/setlocale_variation1.phpt]
Test setlocale() function : usage variations - Setting all available locales in the platform
[ext/standard/tests/strings/setlocale_variation2.phpt]
Test setlocale() function : usage variations - setting system locale = 0
[ext/standard/tests/strings/setlocale_variation3.phpt]
Test setlocale() function : usage variations - setting system locale as null
[ext/standard/tests/strings/setlocale_variation4.phpt]
Test setlocale() function : usage variations - Setting system locale as empty string
[ext/standard/tests/strings/setlocale_variation5.phpt]
Test strtoupper on non-ASCII characters [ext/standard/tests/strings/strtoupper.phpt]
=====================================================================
================================================================================
/home/root/src/php-5.2.5/ext/ctype/tests/001.phpt
================================================================================
ctype_lower 26
ctype_upper 26
ctype_alpha 52
ctype_digit 10
ctype_alnum 62
ctype_cntrl 65
ctype_graph 190
ctype_print 191
ctype_punct 128
ctype_space 6
ctype_xdigit 22
================================================================================
006+ ctype_cntrl 65
007+ ctype_graph 190
008+ ctype_print 191
009+ ctype_punct 128
006- ctype_cntrl 33
007- ctype_graph 94
008- ctype_print 95
009- ctype_punct 32
================================================================================
================================================================================
/home/root/src/php-5.2.5/ext/date/tests/date_default_timezone_get-1.phpt
================================================================================
Strict Standards: date_default_timezone_get(): It is not safe to rely on the system's timezone
settings. Please use the date.timezone setting, the TZ environment variable or the
date_default_timezone_set() function. In case you used any of those methods and you are still
getting this warning, you most likely misspelled the timezone identifier. We selected
'UTC' for 'GMT/0.0/no DST' instead in
/home/root/src/php-5.2.5/ext/date/tests/date_default_timezone_get-1.php on line 3
UTC
Strict Standards: date(): It is not safe to rely on the system's timezone settings. Please use
the date.timezone setting, the TZ environment variable or the date_default_timezone_set() function.
In case you used any of those methods and you are still getting this warning, you most likely
misspelled the timezone identifier. We selected 'UTC' for 'GMT/0.0/no DST'
instead in /home/root/src/php-5.2.5/ext/date/tests/date_default_timezone_get-1.php on line 4
UTC
================================================================================
001+ Strict Standards: date_default_timezone_get(): It is not safe to rely on the system's
timezone settings. Please use the date.timezone setting, the TZ environment variable or the
date_default_timezone_set() function. In case you used any of those methods and you are still
getting this warning, you most likely misspelled the timezone identifier. We selected
'UTC' for 'GMT/0.0/no DST' instead in
/home/root/src/php-5.2.5/ext/date/tests/date_default_timezone_get-1.php on line 3
001- Strict Standards: date_default_timezone_get(): It is not safe to rely on the system's
timezone settings. Please use the date.timezone setting, the TZ environment variable or the
date_default_timezone_set() function. In case you used any of those methods and you are still
getting this warning, you most likely misspelled the timezone identifier. We selected
'UTC' for 'UTC/0.0/no DST' instead in %sdate_default_timezone_get-1.php on line
3
004+ Strict Standards: date(): It is not safe to rely on the system's timezone settings. Please
use the date.timezone setting, the TZ environment variable or the date_default_timezone_set()
function. In case you used any of those methods and you are still getting this warning, you most
likely misspelled the timezone identifier. We selected 'UTC' for 'GMT/0.0/no
DST' instead in /home/root/src/php-5.2.5/ext/date/tests/date_default_timezone_get-1.php on line
4
004- Strict Standards: date(): It is not safe to rely on the system's timezone settings. Please
use the date.timezone setting, the TZ environment variable or the date_default_timezone_set()
function. In case you used any of those methods and you are still getting this warning, you most
likely misspelled the timezone identifier. We selected 'UTC' for 'UTC/0.0/no
DST' instead in %sdate_default_timezone_get-1.php on line 4
================================================================================
================================================================================
/home/root/src/php-5.2.5/ext/date/tests/date_default_timezone_get-2.phpt
================================================================================
Strict Standards: date_default_timezone_get(): It is not safe to rely on the system's timezone
settings. Please use the date.timezone setting, the TZ environment variable or the
date_default_timezone_set() function. In case you used any of those methods and you are still
getting this warning, you most likely misspelled the timezone identifier. We selected
'UTC' for 'GMT/0.0/no DST' instead in
/home/root/src/php-5.2.5/ext/date/tests/date_default_timezone_get-2.php on line 3
UTC
================================================================================
001+ Strict Standards: date_default_timezone_get(): It is not safe to rely on the system's
timezone settings. Please use the date.timezone setting, the TZ environment variable or the
date_default_timezone_set() function. In case you used any of those methods and you are still
getting this warning, you most likely misspelled the timezone identifier. We selected
'UTC' for 'GMT/0.0/no DST' instead in
/home/root/src/php-5.2.5/ext/date/tests/date_default_timezone_get-2.php on line 3
001- Strict Standards: date_default_timezone_get(): It is not safe to rely on the system's
timezone settings. Please use the date.timezone setting, the TZ environment variable or the
date_default_timezone_set() function. In case you used any of those methods and you are still
getting this warning, you most likely misspelled the timezone identifier. We selected
'UTC' for 'UTC/0.0/no DST' instead in %sdate_default_timezone_get-2.php on line
3
================================================================================
================================================================================
/home/root/src/php-5.2.5/ext/date/tests/date_default_timezone_set-1.phpt
================================================================================
Strict Standards: strtotime(): It is not safe to rely on the system's timezone settings. Please
use the date.timezone setting, the TZ environment variable or the date_default_timezone_set()
function. In case you used any of those methods and you are still getting this warning, you most
likely misspelled the timezone identifier. We selected 'UTC' for 'GMT/0.0/no
DST' instead in /home/root/src/php-5.2.5/ext/date/tests/date_default_timezone_set-1.php on line
3
Strict Standards: strtotime(): It is not safe to rely on the system's timezone settings. Please
use the date.timezone setting, the TZ environment variable or the date_default_timezone_set()
function. In case you used any of those methods and you are still getting this warning, you most
likely misspelled the timezone identifier. We selected 'UTC' for 'GMT/0.0/no
DST' instead in /home/root/src/php-5.2.5/ext/date/tests/date_default_timezone_set-1.php on line
4
America/Indiana/Knox
2005-01-12T03:00:00-0500
2005-07-12T03:00:00-0500
2005-01-12T08:00:00-0500
2005-07-12T08:00:00-0500
================================================================================
001+ Strict Standards: strtotime(): It is not safe to rely on the system's timezone settings.
Please use the date.timezone setting, the TZ environment variable or the date_default_timezone_set()
function. In case you used any of those methods and you are still getting this warning, you most
likely misspelled the timezone identifier. We selected 'UTC' for 'GMT/0.0/no
DST' instead in /home/root/src/php-5.2.5/ext/date/tests/date_default_timezone_set-1.php on line
3
001- Strict Standards: strtotime(): It is not safe to rely on the system's timezone settings.
Please use the date.timezone setting, the TZ environment variable or the date_default_timezone_set()
function. In case you used any of those methods and you are still getting this warning, you most
likely misspelled the timezone identifier. We selected 'UTC' for 'UTC/0.0/no
DST' instead in %sdate_default_timezone_set-1.php on line 3
003+ Strict Standards: strtotime(): It is not safe to rely on the system's timezone settings.
Please use the date.timezone setting, the TZ environment variable or the date_default_timezone_set()
function. In case you used any of those methods and you are still getting this warning, you most
likely misspelled the timezone identifier. We selected 'UTC' for 'GMT/0.0/no
DST' instead in /home/root/src/php-5.2.5/ext/date/tests/date_default_timezone_set-1.php on line
4
003- Strict Standards: strtotime(): It is not safe to rely on the system's timezone settings.
Please use the date.timezone setting, the TZ environment variable or the date_default_timezone_set()
function. In case you used any of those methods and you are still getting this warning, you most
likely misspelled the timezone identifier. We selected 'UTC' for 'UTC/0.0/no
DST' instead in %sdate_default_timezone_set-1.php on line 4
================================================================================
================================================================================
/home/root/src/php-5.2.5/ext/pcre/tests/locales.phpt
================================================================================
int(0)
int(0)
int(0)
================================================================================
002+ int(0)
002- int(1)
================================================================================
================================================================================
/home/root/src/php-5.2.5/ext/standard/tests/array/locale_sort.phpt
================================================================================
array(13) {
["AB"]=>
string(7) "Alberta"
["BC"]=>
string(20) "Colombie-Britannique"
["MB"]=>
string(8) "Manitoba"
["NB"]=>
string(17) "Nouveau-Brunswick"
["NS"]=>
string(15) "Nouvelle-Écosse"
["NU"]=>
string(7) "Nunavut"
["ON"]=>
string(7) "Ontario"
["QC"]=>
string(6) "Québec"
["SK"]=>
string(12) "Saskatchewan"
["NL"]=>
string(23) "Terre-Neuve-et-Labrador"
["YT"]=>
string(19) "Territoire du Yukon"
["NT"]=>
string(25) "Territoires du Nord-Ouest"
["PE"]=>
string(21) "Île-du-Prince-Édouard"
}
================================================================================
006- ["PE"]=>
007- string(21) "Île-du-Prince-Édouard"
026+ ["PE"]=>
027+ string(21) "Île-du-Prince-Édouard"
================================================================================
================================================================================
/home/root/src/php-5.2.5/ext/standard/tests/file/lstat_stat_variation3.phpt
================================================================================
*** Testing lstat() for link after being renamed ***
bool(true)
bool(true)
bool(true)
Error: stat1 do not match with stat2 at key value: 10
Error: stat1 do not match with stat2 at key value: ctime
Dumping stat array 1...
array(26) {
[0]=>
int(1030)
[1]=>
int(8477749)
[2]=>
int(41453)
[3]=>
int(1)
[4]=>
int(0)
[5]=>
int(0)
[6]=>
int(33822737)
[7]=>
int(74)
[8]=>
int(1195162881)
[9]=>
int(1195162881)
[10]=>
int(1195162881)
[11]=>
int(16384)
[12]=>
int(4)
["dev"]=>
int(1030)
["ino"]=>
int(8477749)
["mode"]=>
int(41453)
["nlink"]=>
int(1)
["uid"]=>
int(0)
["gid"]=>
int(0)
["rdev"]=>
int(33822737)
["size"]=>
int(74)
["atime"]=>
int(1195162881)
["mtime"]=>
int(1195162881)
["ctime"]=>
int(1195162881)
["blksize"]=>
int(16384)
["blocks"]=>
int(4)
}
Dumping stat array 2...
array(26) {
[0]=>
int(1030)
[1]=>
int(8477749)
[2]=>
int(41453)
[3]=>
int(1)
[4]=>
int(0)
[5]=>
int(0)
[6]=>
int(33822737)
[7]=>
int(74)
[8]=>
int(1195162881)
[9]=>
int(1195162881)
[10]=>
int(1195162882)
[11]=>
int(16384)
[12]=>
int(4)
["dev"]=>
int(1030)
["ino"]=>
int(8477749)
["mode"]=>
int(41453)
["nlink"]=>
int(1)
["uid"]=>
int(0)
["gid"]=>
int(0)
["rdev"]=>
int(33822737)
["size"]=>
int(74)
["atime"]=>
int(1195162881)
["mtime"]=>
int(1195162881)
["ctime"]=>
int(1195162882)
["blksize"]=>
int(16384)
["blocks"]=>
int(4)
}
bool(false)
--- Done ---
================================================================================
005+ Error: stat1 do not match with stat2 at key value: 10
006+ Error: stat1 do not match with stat2 at key value: ctime
005- bool(true)
007- --- Done ---
008+ Dumping stat array 1...
009+ array(26) {
010+ [0]=>
011+ int(1030)
012+ [1]=>
013+ int(8477749)
014+ [2]=>
015+ int(41453)
016+ [3]=>
017+ int(1)
018+ [4]=>
019+ int(0)
020+ [5]=>
021+ int(0)
022+ [6]=>
023+ int(33822737)
024+ [7]=>
025+ int(74)
026+ [8]=>
027+ int(1195162881)
028+ [9]=>
029+ int(1195162881)
030+ [10]=>
031+ int(1195162881)
032+ [11]=>
033+ int(16384)
034+ [12]=>
035+ int(4)
036+ ["dev"]=>
037+ int(1030)
038+ ["ino"]=>
039+ int(8477749)
040+ ["mode"]=>
041+ int(41453)
042+ ["nlink"]=>
043+ int(1)
044+ ["uid"]=>
045+ int(0)
046+ ["gid"]=>
047+ int(0)
048+ ["rdev"]=>
049+ int(33822737)
050+ ["size"]=>
051+ int(74)
052+ ["atime"]=>
053+ int(1195162881)
054+ ["mtime"]=>
055+ int(1195162881)
056+ ["ctime"]=>
057+ int(1195162881)
058+ ["blksize"]=>
059+ int(16384)
060+ ["blocks"]=>
061+ int(4)
062+ }
063+
064+ Dumping stat array 2...
065+ array(26) {
066+ [0]=>
067+ int(1030)
068+ [1]=>
069+ int(8477749)
070+ [2]=>
071+ int(41453)
072+ [3]=>
073+ int(1)
074+ [4]=>
075+ int(0)
076+ [5]=>
077+ int(0)
078+ [6]=>
079+ int(33822737)
080+ [7]=>
081+ int(74)
082+ [8]=>
083+ int(1195162881)
084+ [9]=>
085+ int(1195162881)
086+ [10]=>
087+ int(1195162882)
088+ [11]=>
089+ int(16384)
090+ [12]=>
091+ int(4)
092+ ["dev"]=>
093+ int(1030)
094+ ["ino"]=>
095+ int(8477749)
096+ ["mode"]=>
097+ int(41453)
098+ ["nlink"]=>
099+ int(1)
100+ ["uid"]=>
101+ int(0)
102+ ["gid"]=>
103+ int(0)
104+ ["rdev"]=>
105+ int(33822737)
106+ ["size"]=>
107+ int(74)
108+ ["atime"]=>
109+ int(1195162881)
110+ ["mtime"]=>
111+ int(1195162881)
112+ ["ctime"]=>
113+ int(1195162882)
114+ ["blksize"]=>
115+ int(16384)
116+ ["blocks"]=>
117+ int(4)
118+ }
119+ bool(false)
120+
121+ --- Done ---
================================================================================
================================================================================
/home/root/src/php-5.2.5/ext/standard/tests/file/readlink_realpath_basic1.phpt
================================================================================
*** Testing readlink() and realpath(): with valid and invalid path ***
-- Iteration 1 --
string(107)
"/home/root/src/php-5.2.5/ext/standard/tests/file/readlink_realpath_basic1/home/readlink_realpath_basic1.tmp"
string(112)
"/home/root/src/php-5.2.5/ext/standard/tests/file/readlink_realpath_basic1/home/readlink_realpath_basic1_link.tmp"
-- Iteration 2 --
string(112)
"/home/root/src/php-5.2.5/ext/standard/tests/file/readlink_realpath_basic1/home/test/readlink_realpath_basic1.tmp"
string(117)
"/home/root/src/php-5.2.5/ext/standard/tests/file/readlink_realpath_basic1/home/test/readlink_realpath_basic1_link.tmp"
-- Iteration 3 --
string(112)
"/home/root/src/php-5.2.5/ext/standard/tests/file/readlink_realpath_basic1/home/test/readlink_realpath_basic1.tmp"
string(112)
"/home/root/src/php-5.2.5/ext/standard/tests/file/readlink_realpath_basic1/home/test/readlink_realpath_basic1.tmp"
-- Iteration 4 --
string(107)
"/home/root/src/php-5.2.5/ext/standard/tests/file/readlink_realpath_basic1/home/readlink_realpath_basic1.tmp"
string(112)
"/home/root/src/php-5.2.5/ext/standard/tests/file/readlink_realpath_basic1/home/readlink_realpath_basic1_link.tmp"
-- Iteration 5 --
Warning: readlink(): No such file or directory in
/home/root/src/php-5.2.5/ext/standard/tests/file/readlink_realpath_basic1.php on line 48
bool(false)
bool(false)
-- Iteration 6 --
Warning: readlink(): No such file or directory in
/home/root/src/php-5.2.5/ext/standard/tests/file/readlink_realpath_basic1.php on line 48
bool(false)
bool(false)
-- Iteration 7 --
Warning: readlink(): No such file or directory in
/home/root/src/php-5.2.5/ext/standard/tests/file/readlink_realpath_basic1.php on line 48
bool(false)
string(109)
"/home/root/src/php-5.2.5/ext/standard/tests/file/readlink_realpath_basic1/..readlink_realpath_basic1_link.tmp"
-- Iteration 8 --
Warning: readlink(): Not a directory in
/home/root/src/php-5.2.5/ext/standard/tests/file/readlink_realpath_basic1.php on line 48
bool(false)
string(112)
"/home/root/src/php-5.2.5/ext/standard/tests/file/readlink_realpath_basic1/home/test/readlink_realpath_basic1.tmp"
Done
================================================================================
005+ string(112)
"/home/root/src/php-5.2.5/ext/standard/tests/file/readlink_realpath_basic1/home/readlink_realpath_basic1_link.tmp"
005- string(%d) "%s/readlink_realpath_basic1/home/readlink_realpath_basic1.tmp"
009+ string(117)
"/home/root/src/php-5.2.5/ext/standard/tests/file/readlink_realpath_basic1/home/test/readlink_realpath_basic1_link.tmp"
009- string(%d) "%s/readlink_realpath_basic1/home/test/readlink_realpath_basic1.tmp"
017+ string(112)
"/home/root/src/php-5.2.5/ext/standard/tests/file/readlink_realpath_basic1/home/readlink_realpath_basic1_link.tmp"
017- string(%d) "%s/readlink_realpath_basic1/home/readlink_realpath_basic1.tmp"
================================================================================
================================================================================
/home/root/src/php-5.2.5/ext/standard/tests/file/readlink_realpath_variation1.phpt
================================================================================
*** Testing readlink() and realpath() : usage variations ***
*** Testing readlink() and realpath() with linkname stored inside a object ***
-- Testing readlink() and realpath() with softlink, linkname stored inside an object --
bool(true)
string(126)
"/home/root/src/php-5.2.5/ext/standard/tests/file/readlink_realpath_variation1/home/tests/link/readlink_realpath_variation1.tmp"
string(120)
"/home/root/src/php-5.2.5/ext/standard/tests/file/readlink_realpath_variation1/home/readlink_realpath_variation1_link.tmp"
bool(true)
string(126)
"/home/root/src/php-5.2.5/ext/standard/tests/file/readlink_realpath_variation1/home/tests/link/readlink_realpath_variation1.tmp"
string(86)
"/home/root/src/php-5.2.5/ext/standard/tests/file/readlink_realpath_variation1_link.tmp"
-- Testing readlink() and realpath() with hardlink, linkname stored inside an object --
bool(true)
Warning: readlink(): Invalid argument in
/home/root/src/php-5.2.5/ext/standard/tests/file/readlink_realpath_variation1.php on line 45
bool(false)
string(120)
"/home/root/src/php-5.2.5/ext/standard/tests/file/readlink_realpath_variation1/home/readlink_realpath_variation1_link.tmp"
bool(true)
Warning: readlink(): Invalid argument in
/home/root/src/php-5.2.5/ext/standard/tests/file/readlink_realpath_variation1.php on line 48
bool(false)
string(86)
"/home/root/src/php-5.2.5/ext/standard/tests/file/readlink_realpath_variation1_link.tmp"
Done
================================================================================
008+ string(120)
"/home/root/src/php-5.2.5/ext/standard/tests/file/readlink_realpath_variation1/home/readlink_realpath_variation1_link.tmp"
008- string(%d)
"%s/readlink_realpath_variation1/home/tests/link/readlink_realpath_variation1.tmp"
011+ string(86)
"/home/root/src/php-5.2.5/ext/standard/tests/file/readlink_realpath_variation1_link.tmp"
011- string(%d)
"%s/readlink_realpath_variation1/home/tests/link/readlink_realpath_variation1.tmp"
================================================================================
================================================================================
/home/root/src/php-5.2.5/ext/standard/tests/file/readlink_realpath_variation2.phpt
================================================================================
*** Testing readlink() and realpath() : usage variations ***
*** Testing readlink() and realpath() with linkname stored in an array ***
-- Testing readlink() and realpath() with softlink, linkname stored inside an array --
bool(true)
string(126)
"/home/root/src/php-5.2.5/ext/standard/tests/file/readlink_realpath_variation2/home/tests/link/readlink_realpath_variation2.tmp"
string(131)
"/home/root/src/php-5.2.5/ext/standard/tests/file/readlink_realpath_variation2/home/tests/link/readlink_realpath_variation2_link.tmp"
Warning: symlink(): No such file or directory in
/home/root/src/php-5.2.5/ext/standard/tests/file/readlink_realpath_variation2.php on line 29
bool(false)
Warning: readlink(): No such file or directory in
/home/root/src/php-5.2.5/ext/standard/tests/file/readlink_realpath_variation2.php on line 30
bool(false)
bool(false)
Warning:
unlink(/home/root/src/php-5.2.5/ext/standard/tests/file/./readlink_realpath_variation2/home/../home//tests//..//..//..//home//readlink_realpath_variation2_link.tmp/):
No such file or directory in
/home/root/src/php-5.2.5/ext/standard/tests/file/readlink_realpath_variation2.php on line 35
-- Testing readlink() and realpath() with hardlink, linkname stored inside an array --
bool(true)
Warning: readlink(): Invalid argument in
/home/root/src/php-5.2.5/ext/standard/tests/file/readlink_realpath_variation2.php on line 40
bool(false)
string(131)
"/home/root/src/php-5.2.5/ext/standard/tests/file/readlink_realpath_variation2/home/tests/link/readlink_realpath_variation2_link.tmp"
Warning: link(): No such file or directory in
/home/root/src/php-5.2.5/ext/standard/tests/file/readlink_realpath_variation2.php on line 42
bool(false)
Warning: readlink(): No such file or directory in
/home/root/src/php-5.2.5/ext/standard/tests/file/readlink_realpath_variation2.php on line 43
bool(false)
bool(false)
Warning:
unlink(/home/root/src/php-5.2.5/ext/standard/tests/file/./readlink_realpath_variation2/home/../home//tests//..//..//..//home//readlink_realpath_variation2_link.tmp/):
No such file or directory in
/home/root/src/php-5.2.5/ext/standard/tests/file/readlink_realpath_variation2.php on line 48
Done
================================================================================
008+ string(131)
"/home/root/src/php-5.2.5/ext/standard/tests/file/readlink_realpath_variation2/home/tests/link/readlink_realpath_variation2_link.tmp"
008- string(%d)
"%s/readlink_realpath_variation2/home/tests/link/readlink_realpath_variation2.tmp"
================================================================================
================================================================================
/home/root/src/php-5.2.5/ext/standard/tests/general_functions/proc_open02.phpt
================================================================================
bool(true)
array(8) {
["command"]=>
string(28) "/usr/bin/nohup /bin/sleep 50"
["pid"]=>
int(17616)
["running"]=>
bool(false)
["signaled"]=>
bool(false)
["stopped"]=>
bool(false)
["exitcode"]=>
int(129)
["termsig"]=>
int(0)
["stopsig"]=>
int(0)
}
bool(false)
array(8) {
["command"]=>
string(28) "/usr/bin/nohup /bin/sleep 50"
["pid"]=>
int(17616)
["running"]=>
bool(false)
["signaled"]=>
bool(false)
["stopped"]=>
bool(false)
["exitcode"]=>
int(-1)
["termsig"]=>
int(0)
["stopsig"]=>
int(0)
}
Done!
================================================================================
008+ bool(false)
008- bool(true)
014+ int(129)
014- int(-1)
020+ bool(false)
020- bool(true)
029+ bool(false)
029- bool(true)
035+ int(0)
035- int(15)
================================================================================
================================================================================
/home/root/src/php-5.2.5/ext/standard/tests/math/acos_variation.phpt
================================================================================
float(0)
float(0)
float(0)
float(0)
float(0)
float(0)
float(0)
float(0)
float(0)
float(1.570796327)
float(0)
float(0)
float(1.570796327)
float(0)
float(1.570796327)
================================================================================
001+ float(0)
002+ float(0)
003+ float(0)
004+ float(0)
005+ float(0)
006+ float(0)
007+ float(0)
008+ float(0)
009+ float(0)
001- float(NAN)
002- float(NAN)
003- float(NAN)
004- float(NAN)
005- float(NAN)
006- float(NAN)
007- float(NAN)
008- float(NAN)
009- float(NAN)
011+ float(0)
012+ float(0)
011- float(NAN)
012- float(NAN)
================================================================================
================================================================================
/home/root/src/php-5.2.5/ext/standard/tests/math/asin_variation.phpt
================================================================================
float(0)
float(0)
float(0)
float(0)
float(0)
float(0)
float(0)
float(0)
float(0)
float(0)
float(0)
float(0)
float(0)
float(1.570796327)
float(0)
================================================================================
001+ float(0)
002+ float(0)
003+ float(0)
004+ float(0)
005+ float(0)
006+ float(0)
007+ float(0)
008+ float(0)
009+ float(0)
010+ float(0)
011+ float(0)
012+ float(0)
013+ float(0)
014+ float(1.570796327)
001- float(NAN)
002- float(NAN)
003- float(NAN)
004- float(NAN)
005- float(NAN)
006- float(NAN)
007- float(NAN)
008- float(NAN)
009- float(NAN)
011- float(NAN)
012- float(NAN)
013- float(0)
014- float(1.570796327)
015- float(0)
================================================================================
================================================================================
/home/root/src/php-5.2.5/ext/standard/tests/math/bug25665.phpt
================================================================================
float(0)
float(-INF)
================================================================================
001+ float(0)
001- float(NAN)
================================================================================
================================================================================
/home/root/src/php-5.2.5/ext/standard/tests/strings/htmlentities02.phpt (warn: possibly braindead
libc)
================================================================================
Warning: htmlentities(): charset `646' not supported, assuming iso-8859-1 in
/home/root/src/php-5.2.5/ext/standard/tests/strings/htmlentities02.php on line 3
string(24) "¼½¾"
================================================================================
001+ Warning: htmlentities(): charset `646' not supported, assuming iso-8859-1 in
/home/root/src/php-5.2.5/ext/standard/tests/strings/htmlentities02.php on line 3
001- string(20) "ŒœŸ"
002+ string(24) "¼½¾"
================================================================================
================================================================================
/home/root/src/php-5.2.5/ext/standard/tests/strings/htmlentities03.phpt
================================================================================
Warning: htmlentities(): charset `646' not supported, assuming iso-8859-1 in
/home/root/src/php-5.2.5/ext/standard/tests/strings/htmlentities03.php on line 3
string(18) "äöü"
================================================================================
001+ Warning: htmlentities(): charset `646' not supported, assuming iso-8859-1 in
/home/root/src/php-5.2.5/ext/standard/tests/strings/htmlentities03.php on line 3
================================================================================
================================================================================
/home/root/src/php-5.2.5/ext/standard/tests/strings/htmlentities04.phpt (warn: possibly braindead
libc)
================================================================================
Warning: htmlentities(): charset `646' not supported, assuming iso-8859-1 in
/home/root/src/php-5.2.5/ext/standard/tests/strings/htmlentities04.php on line 3
string(42) "¡¢¡£¡¤"
================================================================================
001+ Warning: htmlentities(): charset `646' not supported, assuming iso-8859-1 in
/home/root/src/php-5.2.5/ext/standard/tests/strings/htmlentities04.php on line 3
001- string(6) "¡¢¡£¡¤"
002+ string(42) "¡¢¡£¡¤"
================================================================================
================================================================================
/home/root/src/php-5.2.5/ext/standard/tests/strings/htmlentities15.phpt (warn: possibly braindead
libc)
================================================================================
Warning: htmlentities(): charset `646' not supported, assuming iso-8859-1 in
/home/root/src/php-5.2.5/ext/standard/tests/strings/htmlentities15.php on line 4
string(9) "ÒÏÓËÏÛÎÙÊ"
string(63)
"ÒÏÓËÏÛÎÙÊ"
================================================================================
001+ Warning: htmlentities(): charset `646' not supported, assuming iso-8859-1 in
/home/root/src/php-5.2.5/ext/standard/tests/strings/htmlentities15.php on line 4
002- string(63)
"роскошный"
003+ string(63)
"ÒÏÓËÏÛÎÙÊ"
================================================================================
================================================================================
/home/root/src/php-5.2.5/ext/standard/tests/strings/setlocale_basic1.phpt
================================================================================
*** Testing setlocale() : basic functionality - set to a specific locale ***
sh: locale: not found
Setting system locale(LC_ALL) to Checking currency settings in the new locale, expected: EUR, Found:
Test FAILED.
Done
================================================================================
002+ sh: locale: not found
003- string(%d) %s
004- Checking currency settings in the new locale, expected: %s, Found: %s
005- Test PASSED.
004+ Test FAILED.
================================================================================
================================================================================
/home/root/src/php-5.2.5/ext/standard/tests/strings/setlocale_basic2.phpt
================================================================================
*** Testing setlocale() with an array containing list of locales ***
sh: locale: not found
-- Testing setlocale() : 'category' argument as LC_ALL & 'locale' argument
as an array --
Test FAILED.
Done
================================================================================
002+ sh: locale: not found
003- string(%d) "%s"
004- Checking currency settings in the new locale, expected: %s, Found: %s
005- Test PASSED.
004+ Test FAILED.
================================================================================
================================================================================
/home/root/src/php-5.2.5/ext/standard/tests/strings/setlocale_basic3.phpt
================================================================================
*** Testing setlocale() by passing multiple locales as argument ***
sh: locale: not found
Done
================================================================================
002+ sh: locale: not found
002- -- Testing setlocale() by giving 'category' as LC_ALL & multiple
locales(en_US.utf8, Ko_KR.utf8, zh_CN.utf8) --
003- string(%d) "%s"
004- Checking currency settings in the new locale, expected: %s, Found: %s
005- Test PASSED.
================================================================================
================================================================================
/home/root/src/php-5.2.5/ext/standard/tests/strings/setlocale_error.phpt
================================================================================
*** Testing setlocale() : error conditions ***
-- Testing setlocale() function with Zero arguments --
Warning: Wrong parameter count for setlocale() in
/home/root/src/php-5.2.5/ext/standard/tests/strings/setlocale_error.php on line 12
NULL
-- Testing setlocale() function with One argument, 'category' = LC_ALL --
Warning: Wrong parameter count for setlocale() in
/home/root/src/php-5.2.5/ext/standard/tests/strings/setlocale_error.php on line 16
NULL
-- Testing setlocale() function with invalid locale array, 'category' = LC_ALL --
string(23) "C/en_US.invalid/C/C/C/C"
-- Testing setlocale() function with invalid multiple locales, 'category' = LC_ALL --
string(23) "C/en_US.invalid/C/C/C/C"
-- Testing setlocale() function with invalid category --
Warning: setlocale(): Passing locale category name as string is deprecated. Use the LC_* -constants
instead in /home/root/src/php-5.2.5/ext/standard/tests/strings/setlocale_error.php on line 30
Warning: setlocale(): Invalid locale category name TEST, must be one of LC_ALL, LC_COLLATE,
LC_CTYPE, LC_MONETARY, LC_NUMERIC, or LC_TIME in
/home/root/src/php-5.2.5/ext/standard/tests/strings/setlocale_error.php on line 30
bool(false)
Done
================================================================================
012+ string(23) "C/en_US.invalid/C/C/C/C"
012- bool(false)
015+ string(23) "C/en_US.invalid/C/C/C/C"
015- bool(false)
================================================================================
================================================================================
/home/root/src/php-5.2.5/ext/standard/tests/strings/setlocale_variation1.phpt
================================================================================
*** Testing setlocale() by passing multiple valid/invalid locales as argument ***
sh: locale: not found
Done
================================================================================
002+ sh: locale: not found
002- -- Testing setlocale() by giving 'category' as LC_ALL & multiple
locales(en_US.invalid, en_US.utf8, Ko_KR.utf8, KO_KR.invalid, zh_CN.utf8) --
003- string(%d) "%s"
004- Checking currency settings in the new locale, expected: %s, Found: %s
005- Test PASSED.
================================================================================
================================================================================
/home/root/src/php-5.2.5/ext/standard/tests/strings/setlocale_variation2.phpt
================================================================================
*** Testing setlocale() : usage variations ***
sh: locale: not found
-- Test setlocale() with all available locale in the system --
No of locales found on the machine = 1
No of setlocale() success = 1
Expected no of failures = 0
Test PASSED
Done
================================================================================
002+ sh: locale: not found
================================================================================
================================================================================
/home/root/src/php-5.2.5/ext/standard/tests/strings/setlocale_variation3.phpt
================================================================================
*** Testing setlocale() : usage variations - setting system locale = 0 ***
Locale info, before setting the locale
array(18) {
["decimal_point"]=>
string(1) "."
["thousands_sep"]=>
string(0) ""
["int_curr_symbol"]=>
string(0) ""
["currency_symbol"]=>
string(0) ""
["mon_decimal_point"]=>
string(0) ""
["mon_thousands_sep"]=>
string(0) ""
["positive_sign"]=>
string(0) ""
["negative_sign"]=>
string(0) ""
["int_frac_digits"]=>
int(127)
["frac_digits"]=>
int(127)
["p_cs_precedes"]=>
int(127)
["p_sep_by_space"]=>
int(127)
["n_cs_precedes"]=>
int(127)
["n_sep_by_space"]=>
int(127)
["p_sign_posn"]=>
int(127)
["n_sign_posn"]=>
int(127)
["grouping"]=>
array(0) {
}
["mon_grouping"]=>
array(0) {
}
}
Setting system locale, category = LC_ALL and locale = 0
Locale info, after setting the locale
array(18) {
["decimal_point"]=>
string(1) "."
["thousands_sep"]=>
string(0) ""
["int_curr_symbol"]=>
string(0) ""
["currency_symbol"]=>
string(0) ""
["mon_decimal_point"]=>
string(0) ""
["mon_thousands_sep"]=>
string(0) ""
["positive_sign"]=>
string(0) ""
["negative_sign"]=>
string(0) ""
["int_frac_digits"]=>
int(127)
["frac_digits"]=>
int(127)
["p_cs_precedes"]=>
int(127)
["p_sep_by_space"]=>
int(127)
["n_cs_precedes"]=>
int(127)
["n_sep_by_space"]=>
int(127)
["p_sign_posn"]=>
int(127)
["n_sign_posn"]=>
int(127)
["grouping"]=>
array(0) {
}
["mon_grouping"]=>
array(0) {
}
}
Checking locale in the system, Expected : no change in the existing locale
Test PASSED.
Done
================================================================================
007+ string(0) ""
007- string(1) ","
009+ string(0) ""
009- string(4) "USD "
011+ string(0) ""
011- string(1) "$"
013+ string(0) ""
013- string(1) "."
015+ string(0) ""
015- string(1) ","
019+ string(0) ""
019- string(1) "-"
021+ int(127)
021- int(2)
023+ int(127)
023- int(2)
025+ int(127)
025- int(1)
027+ int(127)
027- int(0)
029+ int(127)
029- int(1)
031+ int(127)
031- int(0)
033+ int(127)
033- int(1)
035+ int(127)
035- int(1)
037+ array(0) {
037- array(2) {
038- [0]=>
039- int(3)
040- [1]=>
041- int(3)
040+ array(0) {
044- array(2) {
045- [0]=>
046- int(3)
047- [1]=>
048- int(3)
049+ string(0) ""
051+ string(0) ""
053+ string(0) ""
055+ string(0) ""
057+ string(0) ""
057- string(1) ","
059- string(4) "USD "
061+ string(0) ""
061- string(1) "$"
063+ int(127)
063- string(1) "."
065+ int(127)
065- string(1) ","
067+ int(127)
069+ int(127)
069- string(1) "-"
071+ int(127)
071- int(2)
073+ int(127)
073- int(2)
075+ int(127)
075- int(1)
077+ int(127)
077- int(0)
079+ array(0) {
079- int(1)
081- int(0)
082+ array(0) {
083- int(1)
085- int(1)
087- array(2) {
088- [0]=>
089- int(3)
090- [1]=>
091- int(3)
094- array(2) {
095- [0]=>
096- int(3)
097- [1]=>
098- int(3)
================================================================================
================================================================================
/home/root/src/php-5.2.5/ext/standard/tests/strings/setlocale_variation4.phpt
================================================================================
*** Testing setlocale() : usage variations - Setting system locale = null ***
Locale info, before setting the locale
array(18) {
["decimal_point"]=>
string(1) "."
["thousands_sep"]=>
string(0) ""
["int_curr_symbol"]=>
string(0) ""
["currency_symbol"]=>
string(0) ""
["mon_decimal_point"]=>
string(0) ""
["mon_thousands_sep"]=>
string(0) ""
["positive_sign"]=>
string(0) ""
["negative_sign"]=>
string(0) ""
["int_frac_digits"]=>
int(127)
["frac_digits"]=>
int(127)
["p_cs_precedes"]=>
int(127)
["p_sep_by_space"]=>
int(127)
["n_cs_precedes"]=>
int(127)
["n_sep_by_space"]=>
int(127)
["p_sign_posn"]=>
int(127)
["n_sign_posn"]=>
int(127)
["grouping"]=>
array(0) {
}
["mon_grouping"]=>
array(0) {
}
}
Setting system locale, category = LC_ALL and locale = null
Locale info, after setting the locale
array(18) {
["decimal_point"]=>
string(1) "."
["thousands_sep"]=>
string(0) ""
["int_curr_symbol"]=>
string(0) ""
["currency_symbol"]=>
string(0) ""
["mon_decimal_point"]=>
string(0) ""
["mon_thousands_sep"]=>
string(0) ""
["positive_sign"]=>
string(0) ""
["negative_sign"]=>
string(0) ""
["int_frac_digits"]=>
int(127)
["frac_digits"]=>
int(127)
["p_cs_precedes"]=>
int(127)
["p_sep_by_space"]=>
int(127)
["n_cs_precedes"]=>
int(127)
["n_sep_by_space"]=>
int(127)
["p_sign_posn"]=>
int(127)
["n_sign_posn"]=>
int(127)
["grouping"]=>
array(0) {
}
["mon_grouping"]=>
array(0) {
}
}
Checking new locale in the system, Expected : the locale names will be set from the values of
environment variables
Test FAILED.
Done
================================================================================
007+ string(0) ""
007- string(1) ","
009+ string(0) ""
009- string(4) "AUD "
011+ string(0) ""
011- string(1) "$"
013+ string(0) ""
013- string(1) "."
015+ string(0) ""
015- string(1) ","
019+ string(0) ""
019- string(1) "-"
021+ int(127)
021- int(2)
023+ int(127)
023- int(2)
025+ int(127)
025- int(1)
027+ int(127)
027- int(0)
029+ int(127)
029- int(1)
031+ int(127)
031- int(0)
033+ int(127)
033- int(1)
035+ int(127)
035- int(1)
037+ array(0) {
037- array(2) {
038- [0]=>
039- int(3)
040- [1]=>
041- int(3)
040+ array(0) {
044- array(2) {
045- [0]=>
046- int(3)
047- [1]=>
048- int(3)
049+ string(0) ""
051+ string(0) ""
053+ string(0) ""
055+ string(0) ""
057+ string(0) ""
057- string(1) ","
059- string(4) "USD "
061+ string(0) ""
061- string(1) "$"
063+ int(127)
063- string(1) "."
065+ int(127)
065- string(1) ","
067+ int(127)
069+ int(127)
069- string(1) "-"
071+ int(127)
071- int(2)
073+ int(127)
073- int(2)
075+ int(127)
075- int(1)
077+ int(127)
077- int(0)
079+ array(0) {
079- int(1)
081- int(0)
082+ array(0) {
083- int(1)
085- int(1)
086+ Test FAILED.
087- array(2) {
088- [0]=>
089- int(3)
090- [1]=>
091- int(3)
094- array(2) {
095- [0]=>
096- int(3)
097- [1]=>
098- int(3)
102- Test PASSED.
================================================================================
================================================================================
/home/root/src/php-5.2.5/ext/standard/tests/strings/setlocale_variation5.phpt
================================================================================
*** Testing setlocale() : usage variations - setting system locale = "" ***
Locale info, before setting the locale
array(18) {
["decimal_point"]=>
string(1) "."
["thousands_sep"]=>
string(0) ""
["int_curr_symbol"]=>
string(0) ""
["currency_symbol"]=>
string(0) ""
["mon_decimal_point"]=>
string(0) ""
["mon_thousands_sep"]=>
string(0) ""
["positive_sign"]=>
string(0) ""
["negative_sign"]=>
string(0) ""
["int_frac_digits"]=>
int(127)
["frac_digits"]=>
int(127)
["p_cs_precedes"]=>
int(127)
["p_sep_by_space"]=>
int(127)
["n_cs_precedes"]=>
int(127)
["n_sep_by_space"]=>
int(127)
["p_sign_posn"]=>
int(127)
["n_sign_posn"]=>
int(127)
["grouping"]=>
array(0) {
}
["mon_grouping"]=>
array(0) {
}
}
Setting system locale, category = LC_ALL and locale = ""
Locale info, after setting the locale
array(18) {
["decimal_point"]=>
string(1) "."
["thousands_sep"]=>
string(0) ""
["int_curr_symbol"]=>
string(0) ""
["currency_symbol"]=>
string(0) ""
["mon_decimal_point"]=>
string(0) ""
["mon_thousands_sep"]=>
string(0) ""
["positive_sign"]=>
string(0) ""
["negative_sign"]=>
string(0) ""
["int_frac_digits"]=>
int(127)
["frac_digits"]=>
int(127)
["p_cs_precedes"]=>
int(127)
["p_sep_by_space"]=>
int(127)
["n_cs_precedes"]=>
int(127)
["n_sep_by_space"]=>
int(127)
["p_sign_posn"]=>
int(127)
["n_sign_posn"]=>
int(127)
["grouping"]=>
array(0) {
}
["mon_grouping"]=>
array(0) {
}
}
Checking new locale in the system, Expected : the locale names will be set from the values of
environment variables
Test FAILED.
Done
================================================================================
007+ string(0) ""
007- string(1) ","
009+ string(0) ""
009- string(4) "AUD "
011+ string(0) ""
011- string(1) "$"
013+ string(0) ""
013- string(1) "."
015+ string(0) ""
015- string(1) ","
019+ string(0) ""
019- string(1) "-"
021+ int(127)
021- int(2)
023+ int(127)
023- int(2)
025+ int(127)
025- int(1)
027+ int(127)
027- int(0)
029+ int(127)
029- int(1)
031+ int(127)
031- int(0)
033+ int(127)
033- int(1)
035+ int(127)
035- int(1)
037+ array(0) {
037- array(2) {
038- [0]=>
039- int(3)
040- [1]=>
041- int(3)
040+ array(0) {
044- array(2) {
045- [0]=>
046- int(3)
047- [1]=>
048- int(3)
049+ string(0) ""
051+ string(0) ""
053+ string(0) ""
055+ string(0) ""
057+ string(0) ""
057- string(1) ","
059- string(4) "USD "
061+ string(0) ""
061- string(1) "$"
063+ int(127)
063- string(1) "."
065+ int(127)
065- string(1) ","
067+ int(127)
069+ int(127)
069- string(1) "-"
071+ int(127)
071- int(2)
073+ int(127)
073- int(2)
075+ int(127)
075- int(1)
077+ int(127)
077- int(0)
079+ array(0) {
079- int(1)
081- int(0)
082+ array(0) {
083- int(1)
085- int(1)
086+ Test FAILED.
087- array(2) {
088- [0]=>
089- int(3)
090- [1]=>
091- int(3)
094- array(2) {
095- [0]=>
096- int(3)
097- [1]=>
098- int(3)
102- Test PASSED.
================================================================================
================================================================================
/home/root/src/php-5.2.5/ext/standard/tests/strings/strtoupper.phpt
================================================================================
äöü
================================================================================
001+ äöü
001- ÄÖÜ
================================================================================
================================================================================
BUILD ENVIRONMENT
================================================================================
OS:
OpenBSD - OpenBSD grind.trojanedbinaries.com 4.2 tmp#0 i386
Autoconf:
Bundled Libtool:
ltmain.sh (GNU libtool) 1.5.20 (1.1220.2.287 2005/08/31 18:54:15)
Copyright (C) 2005 Free Software Foundation, Inc.
This is free software; see the source for copying conditions. There is NO
warranty; not even for MERCHANTABILITY or FITNESS FOR A PARTICULAR PURPOSE.
System Libtool:
N/A
Compiler:
Reading specs from /usr/lib/gcc-lib/i386-unknown-openbsd4.2/3.3.5/specs
Configured with:
Thread model: single
gcc version 3.3.5 (propolice)
Bison:
bison (GNU Bison) 2.1
Written by Robert Corbett and Richard Stallman.
Copyright (C) 2005 Free Software Foundation, Inc.
This is free software; see the source for copying conditions. There is NO
warranty; not even for MERCHANTABILITY or FITNESS FOR A PARTICULAR PURPOSE.
Libraries:
/home/root/src/php-5.2.5/sapi/cli/php:
Start End Type Open Ref GrpRef Name
00000000 00000000 exe 1 0 0 /home/root/src/php-5.2.5/sapi/cli/php
07afb000 27b29000 rlib 0 1 0 /usr/local/lib/libmysqlclient.so.18.0
0e251000 2e258000 rlib 0 3 0 /usr/lib/libm.so.2.3
0f2a0000 2f2a8000 rlib 0 3 0 /usr/lib/libz.so.4.1
0e57c000 2e5ac000 rlib 0 1 0 /usr/local/lib/libxml2.so.9.6
0bc59000 2bd35000 rlib 0 2 0 /usr/local/lib/libiconv.so.4.0
09af4000 29b28000 rlib 0 1 0 /usr/lib/libc.so.41.0
0651e000 2654d000 rlib 0 1 0 /usr/lib/libcrypto.so.13.0
0a6fa000 2a705000 rlib 0 1 0 /usr/lib/libssl.so.11.0
03e49000 03e49000 rtld 0 1 0 /usr/libexec/ld.so
User's E-mail: eoin dot miller at trojanedbinaries dot com
================================================================================
PHPINFO
================================================================================
phpinfo()
PHP Version => 5.2.5
System => OpenBSD grind.trojanedbinaries.com 4.2 tmp#0 i386
Build Date => Nov 15 2007 16:27:28
Configure Command => './configure' '--with-apxs2=/usr/local/sbin/apxs2'
'--with-mysql'
Server API => Command Line Interface
Virtual Directory Support => disabled
Configuration File (php.ini) Path => /usr/local/lib
Loaded Configuration File => (none)
PHP API => 20041225
PHP Extension => 20060613
Zend Extension => 220060519
Debug Build => no
Thread Safety => disabled
Zend Memory Manager => enabled
IPv6 Support => enabled
Registered PHP Streams => php, file, data, http, ftp
Registered Stream Socket Transports => tcp, udp, unix, udg
Registered Stream Filters => string.rot13, string.toupper, string.tolower, string.strip_tags,
convert.*, consumed, convert.iconv.*
This program makes use of the Zend Scripting Language Engine:
Zend Engine v2.2.0, Copyright (c) 1998-2007 Zend Technologies
_______________________________________________________________________
Configuration
PHP Core
Directive => Local Value => Master Value
allow_call_time_pass_reference => On => On
allow_url_fopen => On => On
allow_url_include => Off => Off
always_populate_raw_post_data => Off => Off
arg_separator.input => & => &
arg_separator.output => & => &
asp_tags => Off => Off
auto_append_file => no value => no value
auto_globals_jit => On => On
auto_prepend_file => no value => no value
browscap => no value => no value
default_charset => no value => no value
default_mimetype => text/html => text/html
define_syslog_variables => Off => Off
disable_classes => no value => no value
disable_functions => no value => no value
display_errors => STDOUT => STDOUT
display_startup_errors => Off => Off
doc_root => no value => no value
docref_ext => no value => no value
docref_root => no value => no value
enable_dl => On => On
error_append_string => no value => no value
error_log => no value => no value
error_prepend_string => no value => no value
error_reporting => no value => no value
expose_php => On => On
extension_dir => /usr/local/lib/php/extensions/no-debug-non-zts-20060613 =>
/usr/local/lib/php/extensions/no-debug-non-zts-20060613
file_uploads => On => On
highlight.bg => <font style="color: #FFFFFF">#FFFFFF</font> => <font
style="color: #FFFFFF">#FFFFFF</font>
highlight.comment => <font style="color: #FF8000">#FF8000</font> =>
<font style="color: #FF8000">#FF8000</font>
highlight.default => <font style="color: #0000BB">#0000BB</font> =>
<font style="color: #0000BB">#0000BB</font>
highlight.html => <font style="color: #000000">#000000</font> =>
<font style="color: #000000">#000000</font>
highlight.keyword => <font style="color: #007700">#007700</font> =>
<font style="color: #007700">#007700</font>
highlight.string => <font style="color: #DD0000">#DD0000</font> =>
<font style="color: #DD0000">#DD0000</font>
html_errors => Off => Off
ignore_repeated_errors => Off => Off
ignore_repeated_source => Off => Off
ignore_user_abort => Off => Off
implicit_flush => On => On
include_path => .:/usr/local/lib/php => .:/usr/local/lib/php
log_errors => Off => Off
log_errors_max_len => 1024 => 1024
magic_quotes_gpc => On => On
magic_quotes_runtime => Off => Off
magic_quotes_sybase => Off => Off
mail.force_extra_parameters => no value => no value
max_execution_time => 0 => 0
max_input_nesting_level => 64 => 64
max_input_time => -1 => -1
memory_limit => 128M => 128M
open_basedir => no value => no value
output_buffering => 0 => 0
output_handler => no value => no value
post_max_size => 8M => 8M
precision => 14 => 14
realpath_cache_size => 16K => 16K
realpath_cache_ttl => 120 => 120
register_argc_argv => On => On
register_globals => Off => Off
register_long_arrays => On => On
report_memleaks => On => On
report_zend_debug => Off => Off
safe_mode => Off => Off
safe_mode_exec_dir => /usr/local/php/bin => /usr/local/php/bin
safe_mode_gid => Off => Off
safe_mode_include_dir => no value => no value
sendmail_from => no value => no value
sendmail_path => /usr/sbin/sendmail -t -i => /usr/sbin/sendmail -t -i
serialize_precision => 100 => 100
short_open_tag => On => On
SMTP => localhost => localhost
smtp_port => 25 => 25
sql.safe_mode => Off => Off
track_errors => Off => Off
unserialize_callback_func => no value => no value
upload_max_filesize => 2M => 2M
upload_tmp_dir => no value => no value
user_dir => no value => no value
variables_order => EGPCS => EGPCS
xmlrpc_error_number => 0 => 0
xmlrpc_errors => Off => Off
y2k_compliance => On => On
zend.ze1_compatibility_mode => Off => Off
ctype
ctype functions => enabled
date
date/time support => enabled
"Olson" Timezone Database Version => 2007.9
Timezone Database => internal
Default timezone => America/New_York
Directive => Local Value => Master Value
date.default_latitude => 31.7667 => 31.7667
date.default_longitude => 35.2333 => 35.2333
date.sunrise_zenith => 90.583333 => 90.583333
date.sunset_zenith => 90.583333 => 90.583333
date.timezone => no value => no value
dom
DOM/XML => enabled
DOM/XML API Version => 20031129
libxml Version => 2.6.29
HTML Support => enabled
XPath Support => enabled
XPointer Support => enabled
Schema Support => enabled
RelaxNG Support => enabled
filter
Input Validation and Filtering => enabled
Revision => $Revision: 1.52.2.39 $
Directive => Local Value => Master Value
filter.default => unsafe_raw => unsafe_raw
filter.default_flags => no value => no value
hash
hash support => enabled
Hashing Engines => md2 md4 md5 sha1 sha256 sha384 sha512 ripemd128 ripemd160 ripemd256 ripemd320
whirlpool tiger128,3 tiger160,3 tiger192,3 tiger128,4 tiger160,4 tiger192,4 snefru gost adler32
crc32 crc32b haval128,3 haval160,3 haval192,3 haval224,3 haval256,3 haval128,4 haval160,4 haval192,4
haval224,4 haval256,4 haval128,5 haval160,5 haval192,5 haval224,5 haval256,5
iconv
iconv support => enabled
iconv implementation => libiconv
iconv library version => 1.9
Directive => Local Value => Master Value
iconv.input_encoding => ISO-8859-1 => ISO-8859-1
iconv.internal_encoding => ISO-8859-1 => ISO-8859-1
iconv.output_encoding => ISO-8859-1 => ISO-8859-1
json
json support => enabled
json version => 1.2.1
libxml
libXML support => active
libXML Version => 2.6.29
libXML streams => enabled
mysql
MySQL Support => enabled
Active Persistent Links => 0
Active Links => 0
Client API version => 5.0.45
MYSQL_MODULE_TYPE => external
MYSQL_SOCKET => /var/run/mysql/mysql.sock
MYSQL_INCLUDE => -I/usr/local/include/mysql
MYSQL_LIBS => -L/usr/local/lib -lmysqlclient
Directive => Local Value => Master Value
mysql.allow_persistent => On => On
mysql.connect_timeout => 60 => 60
mysql.default_host => no value => no value
mysql.default_password => no value => no value
mysql.default_port => no value => no value
mysql.default_socket => no value => no value
mysql.default_user => no value => no value
mysql.max_links => Unlimited => Unlimited
mysql.max_persistent => Unlimited => Unlimited
mysql.trace_mode => Off => Off
pcre
PCRE (Perl Compatible Regular Expressions) Support => enabled
PCRE Library Version => 7.3 2007-08-28
Directive => Local Value => Master Value
pcre.backtrack_limit => 100000 => 100000
pcre.recursion_limit => 100000 => 100000
PDO
PDO support => enabled
PDO drivers => sqlite2, sqlite
pdo_sqlite
PDO Driver for SQLite 3.x => enabled
PECL Module version => (bundled) 1.0.1 $Id: pdo_sqlite.c,v 1.10.2.6.2.2 2007/03/23 14:30:00 wez
Exp $
SQLite Library => 3.3.17
posix
Revision => $Revision: 1.70.2.3.2.16 $
Reflection
Reflection => enabled
Version => $Id: php_reflection.c,v 1.164.2.33.2.47 2007/10/28 13:47:14 iliaa Exp $
session
Session Support => enabled
Registered save handlers => files user sqlite
Registered serializer handlers => php php_binary
Directive => Local Value => Master Value
session.auto_start => Off => Off
session.bug_compat_42 => On => On
session.bug_compat_warn => On => On
session.cache_expire => 180 => 180
session.cache_limiter => nocache => nocache
session.cookie_domain => no value => no value
session.cookie_httponly => Off => Off
session.cookie_lifetime => 0 => 0
session.cookie_path => / => /
session.cookie_secure => Off => Off
session.entropy_file => no value => no value
session.entropy_length => 0 => 0
session.gc_divisor => 100 => 100
session.gc_maxlifetime => 1440 => 1440
session.gc_probability => 1 => 1
session.hash_bits_per_character => 4 => 4
session.hash_function => 0 => 0
session.name => PHPSESSID => PHPSESSID
session.referer_check => no value => no value
session.save_handler => files => files
session.save_path => no value => no value
session.serialize_handler => php => php
session.use_cookies => On => On
session.use_only_cookies => Off => Off
session.use_trans_sid => 0 => 0
SimpleXML
Simplexml support => enabled
Revision => $Revision: 1.151.2.22.2.35 $
Schema support => enabled
SPL
SPL support => enabled
Interfaces => Countable, OuterIterator, RecursiveIterator, SeekableIterator, SplObserver,
SplSubject
Classes => AppendIterator, ArrayIterator, ArrayObject, BadFunctionCallException,
BadMethodCallException, CachingIterator, DirectoryIterator, DomainException, EmptyIterator,
FilterIterator, InfiniteIterator, InvalidArgumentException, IteratorIterator, LengthException,
LimitIterator, LogicException, NoRewindIterator, OutOfBoundsException, OutOfRangeException,
OverflowException, ParentIterator, RangeException, RecursiveArrayIterator, RecursiveCachingIterator,
RecursiveDirectoryIterator, RecursiveFilterIterator, RecursiveIteratorIterator,
RecursiveRegexIterator, RegexIterator, RuntimeException, SimpleXMLIterator, SplFileInfo,
SplFileObject, SplObjectStorage, SplTempFileObject, UnderflowException, UnexpectedValueException
SQLite
SQLite support => enabled
PECL Module version => 2.0-dev $Id: sqlite.c,v 1.166.2.13.2.9 2007/05/19 17:58:22 iliaa Exp $
SQLite Library => 2.8.17
SQLite Encoding => iso8859
Directive => Local Value => Master Value
sqlite.assoc_case => 0 => 0
standard
Regex Library => Bundled library enabled
Dynamic Library Support => enabled
Path to sendmail => /usr/sbin/sendmail -t -i
Directive => Local Value => Master Value
assert.active => 1 => 1
assert.bail => 0 => 0
assert.callback => no value => no value
assert.quiet_eval => 0 => 0
assert.warning => 1 => 1
auto_detect_line_endings => 0 => 0
default_socket_timeout => 60 => 60
safe_mode_allowed_env_vars => PHP_ => PHP_
safe_mode_protected_env_vars => LD_LIBRARY_PATH => LD_LIBRARY_PATH
url_rewriter.tags => a=href,area=href,frame=src,form=,fieldset= =>
a=href,area=href,frame=src,form=,fieldset=
user_agent => no value => no value
tokenizer
Tokenizer Support => enabled
xml
XML Support => active
XML Namespace Support => active
libxml2 Version => 2.6.29
xmlreader
XMLReader => enabled
xmlwriter
XMLWriter => enabled
Additional Modules
Module Name
Environment
Variable => Value
SSH_CONNECTION => deleted
PATH => /bin:/usr/bin:/usr/local/bin:/sbin:/usr/sbin:/usr/local/sbin:/usr/X11R6/bin
SHELL => /usr/local/bin/bash
MAKEFLAGS =>
USER => root
HOME => /root
PWD => /home/root/src/php-5.2.5
SSH_AUTH_SOCK => deleted
OLDPWD => /home/root/src
SSH_CLIENT => deleted
CC => gcc
TERM => xterm
_ => /usr/bin/make
TEST_PHP_EXECUTABLE => /home/root/src/php-5.2.5/sapi/cli/php
SHLVL => 1
TEST_PHP_SRCDIR => /home/root/src/php-5.2.5
SSH_TTY => deleted
LOGNAME => root
PHP Variables
Variable => Value
_SERVER["SSH_CONNECTION"] => deleted
_SERVER["PATH"] =>
/bin:/usr/bin:/usr/local/bin:/sbin:/usr/sbin:/usr/local/sbin:/usr/X11R6/bin
_SERVER["SHELL"] => /usr/local/bin/bash
_SERVER["MAKEFLAGS"] =>
_SERVER["USER"] => root
_SERVER["HOME"] => /root
_SERVER["PWD"] => /home/root/src/php-5.2.5
_SERVER["SSH_AUTH_SOCK"] => deleted
_SERVER["OLDPWD"] => /home/root/src
_SERVER["SSH_CLIENT"] => deleted
_SERVER["CC"] => gcc
_SERVER["TERM"] => xterm
_SERVER["_"] => /usr/bin/make
_SERVER["TEST_PHP_EXECUTABLE"] => /home/root/src/php-5.2.5/sapi/cli/php
_SERVER["SHLVL"] => 1
_SERVER["TEST_PHP_SRCDIR"] => /home/root/src/php-5.2.5
_SERVER["SSH_TTY"] => deleted
_SERVER["LOGNAME"] => root
_SERVER["PHP_SELF"] =>
_SERVER["SCRIPT_NAME"] =>
_SERVER["SCRIPT_FILENAME"] =>
_SERVER["PATH_TRANSLATED"] =>
_SERVER["DOCUMENT_ROOT"] =>
_SERVER["REQUEST_TIME"] => 1195163262
_SERVER["argv"] => Array
(
)
_SERVER["argc"] => 0
_ENV["SSH_CONNECTION"] => deleted
_ENV["PATH"] =>
/bin:/usr/bin:/usr/local/bin:/sbin:/usr/sbin:/usr/local/sbin:/usr/X11R6/bin
_ENV["SHELL"] => /usr/local/bin/bash
_ENV["MAKEFLAGS"] =>
_ENV["USER"] => root
_ENV["HOME"] => /root
_ENV["PWD"] => /home/root/src/php-5.2.5
_ENV["SSH_AUTH_SOCK"] => deleted
_ENV["OLDPWD"] => /home/root/src
_ENV["SSH_CLIENT"] => deleted
_ENV["CC"] => gcc
_ENV["TERM"] => xterm
_ENV["_"] => /usr/bin/make
_ENV["TEST_PHP_EXECUTABLE"] => /home/root/src/php-5.2.5/sapi/cli/php
_ENV["SHLVL"] => 1
_ENV["TEST_PHP_SRCDIR"] => /home/root/src/php-5.2.5
_ENV["SSH_TTY"] => deleted
_ENV["LOGNAME"] => root
PHP License
This program is free software; you can redistribute it and/or modify
it under the terms of the PHP License as published by the PHP Group
and included in the distribution in the file: LICENSE
This program is distributed in the hope that it will be useful,
but WITHOUT ANY WARRANTY; without even the implied warranty of
MERCHANTABILITY or FITNESS FOR A PARTICULAR PURPOSE.
If you did not receive a copy of the PHP license, or have any
questions about PHP licensing, please contact license@php.net.