PHP Test results
| From: | noreply@php.net | Date: | Sat, 11 May 2002 17:47:45 +0000 |
| Subject: | PHP Test results | ||
| Groups: | php.qa | ||
| Request: | Send a blank email to php-qa+get-5390@lists.php.net to get a copy of this message | ||
array (
'user_name' => 'Joerg Behrens',
'email' => 'joerg@php.net',
'package' => '4.2.1RC2',
'testcase' => 'b3',
'status' => 'Fail',
'os' => 'Irix',
'sapi' => 'cgi',
'automake' => '1.4',
'autoconf' => '2.5.2',
'libtool' => '1.4.2',
'bison' => '1.3.0',
'calendar' => 'on',
'dbase' => 'on',
'dbx' => 'on',
'dio' => 'on',
'exif' => 'on',
'ftp' => 'on',
'mysql' => 'on',
'session' => 'on',
'sysvsem' => 'on',
'sysvshm' => 'on',
'wddx' => 'on',
'xslt' => 'on',
'test' => 'dbx_connect (003.phpt)
... failed
dbx_close (004.phpt) ... failed
dbx_query (005.phpt) ... failed
dbx_error (006.phpt) ... failed
dbx_sort (007.phpt) ... failed
dbx_compare (008.phpt) ... failed
Session Object Serialization (001.phpt) ... failed
Session Object Deserialization (003.phpt) ... failed
session_set_save_handler test (004.phpt) ... failed
Custom save handler, multiple session_start()s, complex data structu ... failed
References between variables in sessions (006.phpt) ... failed
Test array_merge and array_walk (001.phpt) ... failed
Test arsort, asort, krsort, ksort, rsort, and sort (002.phpt) ... failed
Test usort, uksort and uasort (003.phpt) ... failed
Test natsort and natcasesort (004.phpt) ... failed
Simple math tests (abs.phpt) ... failed
Tests for floor en ceil (floorceil.phpt) ... failed
Various pow() tests (pow.phpt) ... failed
Simple math tests (round.phpt) ... failed
nonexisting back reference (012.phpt) ... failed
strtotime() function (002.phpt) ... failed
DB configurable error handler test (db_error2.phpt) ... failed
XML Parser: parse simple string (001.phpt) ... failed
XML Parser: parse from file (002.phpt) ... failed
XML Parser: parse from file resource (003.phpt) ... failed
XML Parser: error class (004.phpt) ... failed
XML Parser: mixing character encodings (005.phpt) ... failed
PEAR constructor/destructor test (pear1.phpt) ... failed
PEAR_Config (pear_config.phpt) ... failed
PEAR_Error: default error handling (pear_error3.phpt) ... failed
PEAR_Registry (pear_registry.phpt) ... failed
System commands tests (pear_system.phpt) ... failed
Simple POST Method test (002.phpt) ... failed
GET and POST Method combined (003.phpt) ... failed
Two variables in POST data (004.phpt) ... failed
Three variables in POST data (005.phpt) ... failed
Testing $argc and $argv handling (011.phpt) ... failed
Output buffering test (006.phpt) ... failed
OO Bug Test (Bug #7515) (029.phpt) ... failed
TEST RESULT SUMMARY
=============================
Number of tests: 278
Tests skipped: 135 ( 49%)
Tests failed: 39 ( 27%)
Tests passed: 104 ( 73%)
=============================
Skipped 0 extensions.
PHP Version: 4.2.1RC2',
'problems' => 'Cant build the 64bit cgi version with
\\\'--with-iconv=/usr/freeware/libiconf64\\\'. Configure stops with
checking for iconv support... yes
configure: error: Please reinstall the iconv library.
The config.log shows
configure:29972: checking for iconv support
configure:30012: result: yes
configure:30653: error: Please reinstall the iconv library
Im using the pre compiled libiconv 1.7 version.
The build runs fine without iconv support
Another weird problems is that a simple session script not work when cookies disabled by the client
or session_use_cookies = 0 are sets in the php.ini or when using ini_set().
64bit Apache2 + PHP CGI
Source http://194.15.95.23:8080/php/sessions/index.phps
Example http://194.15.95.23:8080/php/sessions/index.php
I testet via command line too.
[o200]:/usr/local/httpd64/htdocs/php/sessions $ php64 index.php
X-Powered-By: PHP/4.2.1RC2
Set-Cookie: SID=bec0e51a0ce87df235816f5805b1dbd5; path=/
Expires: Thu, 19 Nov 1981 08:52:00 GMT
Cache-Control: no-store, no-cache, must-revalidate, post-check=0, pre-check=0
Pragma: no-cache
Content-type: text/html
but when usind parameter -q
php64 -q index.php <br />
<b>Warning</b>: Cannot send session cookie - headers already sent in
<b>/usr/local/httpd64/htdocs/php/sessions/index.php</b> on line
<b>3</b><br />
When Cookie is allowed and send back from the client the script works and shows the output but only
after a reload.
The same script works fine with a 32bit Apache1.3 + mod_php
http://194.15.95.23/php/sessions/index.php
',
'bugids' => '',
'remarks' => 'The build (64bit cgi php) was testet with some apps that used the
dbase function and with phpmyadmin.
Some basic xslt examples works too.',
)