Test results for 5.2.5 [failed]

From: Date: Thu, 06 Dec 2007 14:35:00 +0000
Subject: Test results for 5.2.5 [failed]
Groups: php.qa 
Request: Send a blank email to php-qa+get-55087@lists.php.net to get a copy of this message
===================================================================== FAILED TEST SUMMARY --------------------------------------------------------------------- Bug #16069 (ICONV transliteration failure) [ext/iconv/tests/bug16069.phpt] iconv stream filter [ext/iconv/tests/iconv_stream_filter.phpt] Test lstat() and stat() functions: usage variations - writing data into file [ext/standard/tests/file/lstat_stat_variation7.phpt] money_format test [ext/standard/tests/strings/moneyformat.phpt] Test setlocale() function : basic functionality - setting system locale to a specific [ext/standard/tests/strings/setlocale_basic1.phpt] Test setlocale() function : basic functionality - set locale using an array [ext/standard/tests/strings/setlocale_basic2.phpt] Test setlocale() function : basic functionality - passing multiple locales as argument [ext/standard/tests/strings/setlocale_basic3.phpt] Test setlocale() function : usage variations - passing multiple valid/invlaid locales as argument [ext/standard/tests/strings/setlocale_variation1.phpt] Test setlocale() function : usage variations - setting system locale = 0 [ext/standard/tests/strings/setlocale_variation3.phpt] Test setlocale() function : usage variations - setting system locale as null [ext/standard/tests/strings/setlocale_variation4.phpt] Test setlocale() function : usage variations - Setting system locale as empty string [ext/standard/tests/strings/setlocale_variation5.phpt] ===================================================================== ===================================================================== TEST RESULT SUMMARY --------------------------------------------------------------------- Exts skipped : 53 Exts tested : 26 --------------------------------------------------------------------- Number of tests : 4566 3045 Tests skipped : 1521 ( 33.3%) -------- Tests warned : 0 ( 0.0%) ( 0.0%) Tests failed : 11 ( 0.2%) ( 0.4%) Tests passed : 3034 ( 66.4%) ( 99.6%) --------------------------------------------------------------------- Time taken : 173 seconds ===================================================================== ===================================================================== FAILED TEST SUMMARY --------------------------------------------------------------------- Bug #16069 (ICONV transliteration failure) [ext/iconv/tests/bug16069.phpt] iconv stream filter [ext/iconv/tests/iconv_stream_filter.phpt] Test lstat() and stat() functions: usage variations - writing data into file [ext/standard/tests/file/lstat_stat_variation7.phpt] money_format test [ext/standard/tests/strings/moneyformat.phpt] Test setlocale() function : basic functionality - setting system locale to a specific [ext/standard/tests/strings/setlocale_basic1.phpt] Test setlocale() function : basic functionality - set locale using an array [ext/standard/tests/strings/setlocale_basic2.phpt] Test setlocale() function : basic functionality - passing multiple locales as argument [ext/standard/tests/strings/setlocale_basic3.phpt] Test setlocale() function : usage variations - passing multiple valid/invlaid locales as argument [ext/standard/tests/strings/setlocale_variation1.phpt] Test setlocale() function : usage variations - setting system locale = 0 [ext/standard/tests/strings/setlocale_variation3.phpt] Test setlocale() function : usage variations - setting system locale as null [ext/standard/tests/strings/setlocale_variation4.phpt] Test setlocale() function : usage variations - Setting system locale as empty string [ext/standard/tests/strings/setlocale_variation5.phpt] ===================================================================== ================================================================================ /usr/local/src/php-5.2.5/ext/iconv/tests/bug16069.phpt ================================================================================ ????????????????????????????????????????(¡ë§¥¡ë) ================================================================================ 001+ ????????????????????????????????????????(¡ë§¥¡ë) 001- ¥ß¥ê¥Ð¡¼¥ë¥ß¥ê¥Ð¡¼¥ë¥ß¥ê¥Ð¡¼¥ë¥ß¥ê¥Ð¡¼¥ë¥ß¥ê¥Ð¡¼¥ë¥ß¥ê¥Ð¡¼¥ë¥ß¥ê¥Ð¡¼¥ë¥ß¥ê¥Ð¡¼¥ë¥ß¥ê¥Ð¡¼¥ë¥ß¥ê¥Ð¡¼¥ë¥ß¥ê¥Ð¡¼¥ë¥ß¥ê¥Ð¡¼¥ë¥ß¥ê¥Ð¡¼¥ë¥ß¥ê¥Ð¡¼¥ë¥ß¥ê¥Ð¡¼¥ë¥ß¥ê¥Ð¡¼¥ë¥ß¥ê¥Ð¡¼¥ë¥ß¥ê¥Ð¡¼¥ë¥ß¥ê¥Ð¡¼¥ë¥ß¥ê¥Ð¡¼¥ë¥ß¥ê¥Ð¡¼¥ë¥ß¥ê¥Ð¡¼¥ë¥ß¥ê¥Ð¡¼¥ë¥ß¥ê¥Ð¡¼¥ë¥ß¥ê¥Ð¡¼¥ë¥ß¥ê¥Ð¡¼¥ë¥ß¥ê¥Ð¡¼¥ë¥ß¥ê¥Ð¡¼¥ë¥ß¥ê¥Ð¡¼¥ë¥ß¥ê¥Ð¡¼¥ë¥ß¥ê¥Ð¡¼¥ë¥ß¥ê¥Ð¡¼¥ë¥ß¥ê¥Ð¡¼¥ë¥ß¥ê¥Ð¡¼¥ë¥ß¥ê¥Ð¡¼¥ë¥ß¥ê¥Ð¡¼¥ë¥ß¥ê¥Ð¡¼¥ë¥ß¥ê¥Ð¡¼¥ë¥ß¥ê¥Ð¡¼¥ë¥ß¥ê¥Ð¡¼¥ë(¡ë§¥¡ë) ================================================================================ ================================================================================ /usr/local/src/php-5.2.5/ext/iconv/tests/iconv_stream_filter.phpt ================================================================================ string(20) "1b244224332473244b24" string(10) "41244f1b28" string(2) "42" string(20) "a4b3a4f3a4cba4c1a4cf" string(10) "69636f6e76" string(2) "0a" string(20) "1b244f24332466245824" string(10) "4e24421b28" string(2) "4f" ================================================================================ 007+ string(20) "1b244f24332466245824" 008+ string(10) "4e24421b28" 009+ string(2) "4f" 007- 008- Warning: fread(): iconv stream filter ("ISO-2022-JP"=>"EUC-JP"): invalid multibyte sequence in %s on line %d 009- string(0) "" 010- string(0) "" 011- string(0) "" ================================================================================ ================================================================================ /usr/local/src/php-5.2.5/ext/standard/tests/file/lstat_stat_variation7.phpt ================================================================================ *** Testing stat() on file after data is written in it *** bool(true) bool(true) Error: stat1 is not lesser than stat2 at key value: 12 Error: stat1 is not lesser than stat2 at key value: blocks Dumping stat array 1... array(26) { [0]=> int(65026) [1]=> int(14929405) [2]=> int(33188) [3]=> int(1) [4]=> int(0) [5]=> int(0) [6]=> int(0) [7]=> int(0) [8]=> int(1196951665) [9]=> int(1196951665) [10]=> int(1196951665) [11]=> int(4096) [12]=> int(0) ["dev"]=> int(65026) ["ino"]=> int(14929405) ["mode"]=> int(33188) ["nlink"]=> int(1) ["uid"]=> int(0) ["gid"]=> int(0) ["rdev"]=> int(0) ["size"]=> int(0) ["atime"]=> int(1196951665) ["mtime"]=> int(1196951665) ["ctime"]=> int(1196951665) ["blksize"]=> int(4096) ["blocks"]=> int(0) } Dumping stat array 2... array(26) { [0]=> int(65026) [1]=> int(14929405) [2]=> int(33188) [3]=> int(1) [4]=> int(0) [5]=> int(0) [6]=> int(0) [7]=> int(11) [8]=> int(1196951665) [9]=> int(1196951665) [10]=> int(1196951665) [11]=> int(4096) [12]=> int(0) ["dev"]=> int(65026) ["ino"]=> int(14929405) ["mode"]=> int(33188) ["nlink"]=> int(1) ["uid"]=> int(0) ["gid"]=> int(0) ["rdev"]=> int(0) ["size"]=> int(11) ["atime"]=> int(1196951665) ["mtime"]=> int(1196951665) ["ctime"]=> int(1196951665) ["blksize"]=> int(4096) ["blocks"]=> int(0) } bool(false) --- Done --- ================================================================================ 004+ Error: stat1 is not lesser than stat2 at key value: 12 005+ Error: stat1 is not lesser than stat2 at key value: blocks 004- bool(true) 006- --- Done --- 007+ Dumping stat array 1... 008+ array(26) { 009+ [0]=> 010+ int(65026) 011+ [1]=> 012+ int(14929405) 013+ [2]=> 014+ int(33188) 015+ [3]=> 016+ int(1) 017+ [4]=> 018+ int(0) 019+ [5]=> 020+ int(0) 021+ [6]=> 022+ int(0) 023+ [7]=> 024+ int(0) 025+ [8]=> 026+ int(1196951665) 027+ [9]=> 028+ int(1196951665) 029+ [10]=> 030+ int(1196951665) 031+ [11]=> 032+ int(4096) 033+ [12]=> 034+ int(0) 035+ ["dev"]=> 036+ int(65026) 037+ ["ino"]=> 038+ int(14929405) 039+ ["mode"]=> 040+ int(33188) 041+ ["nlink"]=> 042+ int(1) 043+ ["uid"]=> 044+ int(0) 045+ ["gid"]=> 046+ int(0) 047+ ["rdev"]=> 048+ int(0) 049+ ["size"]=> 050+ int(0) 051+ ["atime"]=> 052+ int(1196951665) 053+ ["mtime"]=> 054+ int(1196951665) 055+ ["ctime"]=> 056+ int(1196951665) 057+ ["blksize"]=> 058+ int(4096) 059+ ["blocks"]=> 060+ int(0) 061+ } 062+ 063+ Dumping stat array 2... 064+ array(26) { 065+ [0]=> 066+ int(65026) 067+ [1]=> 068+ int(14929405) 069+ [2]=> 070+ int(33188) 071+ [3]=> 072+ int(1) 073+ [4]=> 074+ int(0) 075+ [5]=> 076+ int(0) 077+ [6]=> 078+ int(0) 079+ [7]=> 080+ int(11) 081+ [8]=> 082+ int(1196951665) 083+ [9]=> 084+ int(1196951665) 085+ [10]=> 086+ int(1196951665) 087+ [11]=> 088+ int(4096) 089+ [12]=> 090+ int(0) 091+ ["dev"]=> 092+ int(65026) 093+ ["ino"]=> 094+ int(14929405) 095+ ["mode"]=> 096+ int(33188) 097+ ["nlink"]=> 098+ int(1) 099+ ["uid"]=> 100+ int(0) 101+ ["gid"]=> 102+ int(0) 103+ ["rdev"]=> 104+ int(0) 105+ ["size"]=> 106+ int(11) 107+ ["atime"]=> 108+ int(1196951665) 109+ ["mtime"]=> 110+ int(1196951665) 111+ ["ctime"]=> 112+ int(1196951665) 113+ ["blksize"]=> 114+ int(4096) 115+ ["blocks"]=> 116+ int(0) 117+ } 118+ bool(false) 119+ 120+ --- Done --- ================================================================================ ================================================================================ /usr/local/src/php-5.2.5/ext/standard/tests/strings/moneyformat.phpt ================================================================================ string(6) "X3.14Y" Warning: money_format(): Only a single %i or %n token can be used in /usr/local/src/php-5.2.5/ext/standard/tests/strings/moneyformat.php on line 4 bool(false) ================================================================================ 001+ string(6) "X3.14Y" 001- string(7) "X$3.14Y" ================================================================================ ================================================================================ /usr/local/src/php-5.2.5/ext/standard/tests/strings/setlocale_basic1.phpt ================================================================================ *** Testing setlocale() : basic functionality - set to a specific locale *** Setting system locale(LC_ALL) to Checking currency settings in the new locale, expected: EUR, Found: Test FAILED. Done ================================================================================ 003+ Test FAILED. 003- string(%d) %s 004- Checking currency settings in the new locale, expected: %s, Found: %s 005- Test PASSED. ================================================================================ ================================================================================ /usr/local/src/php-5.2.5/ext/standard/tests/strings/setlocale_basic2.phpt ================================================================================ *** Testing setlocale() with an array containing list of locales *** -- Testing setlocale() : 'category' argument as LC_ALL & 'locale' argument as an array -- Test FAILED. Done ================================================================================ 003+ Test FAILED. 003- string(%d) "%s" 004- Checking currency settings in the new locale, expected: %s, Found: %s 005- Test PASSED. ================================================================================ ================================================================================ /usr/local/src/php-5.2.5/ext/standard/tests/strings/setlocale_basic3.phpt ================================================================================ *** Testing setlocale() by passing multiple locales as argument *** Done ================================================================================ 002- -- Testing setlocale() by giving 'category' as LC_ALL & multiple locales(en_US.utf8, Ko_KR.utf8, zh_CN.utf8) -- 003- string(%d) "%s" 004- Checking currency settings in the new locale, expected: %s, Found: %s 005- Test PASSED. ================================================================================ ================================================================================ /usr/local/src/php-5.2.5/ext/standard/tests/strings/setlocale_variation1.phpt ================================================================================ *** Testing setlocale() by passing multiple valid/invalid locales as argument *** Done ================================================================================ 002- -- Testing setlocale() by giving 'category' as LC_ALL & multiple locales(en_US.invalid, en_US.utf8, Ko_KR.utf8, KO_KR.invalid, zh_CN.utf8) -- 003- string(%d) "%s" 004- Checking currency settings in the new locale, expected: %s, Found: %s 005- Test PASSED. ================================================================================ ================================================================================ /usr/local/src/php-5.2.5/ext/standard/tests/strings/setlocale_variation3.phpt ================================================================================ *** Testing setlocale() : usage variations - setting system locale = 0 *** Locale info, before setting the locale array(18) { ["decimal_point"]=> string(1) "." ["thousands_sep"]=> string(0) "" ["int_curr_symbol"]=> string(0) "" ["currency_symbol"]=> string(0) "" ["mon_decimal_point"]=> string(0) "" ["mon_thousands_sep"]=> string(0) "" ["positive_sign"]=> string(0) "" ["negative_sign"]=> string(0) "" ["int_frac_digits"]=> int(127) ["frac_digits"]=> int(127) ["p_cs_precedes"]=> int(127) ["p_sep_by_space"]=> int(127) ["n_cs_precedes"]=> int(127) ["n_sep_by_space"]=> int(127) ["p_sign_posn"]=> int(127) ["n_sign_posn"]=> int(127) ["grouping"]=> array(0) { } ["mon_grouping"]=> array(0) { } } Setting system locale, category = LC_ALL and locale = 0 Locale info, after setting the locale array(18) { ["decimal_point"]=> string(1) "." ["thousands_sep"]=> string(0) "" ["int_curr_symbol"]=> string(0) "" ["currency_symbol"]=> string(0) "" ["mon_decimal_point"]=> string(0) "" ["mon_thousands_sep"]=> string(0) "" ["positive_sign"]=> string(0) "" ["negative_sign"]=> string(0) "" ["int_frac_digits"]=> int(127) ["frac_digits"]=> int(127) ["p_cs_precedes"]=> int(127) ["p_sep_by_space"]=> int(127) ["n_cs_precedes"]=> int(127) ["n_sep_by_space"]=> int(127) ["p_sign_posn"]=> int(127) ["n_sign_posn"]=> int(127) ["grouping"]=> array(0) { } ["mon_grouping"]=> array(0) { } } Checking locale in the system, Expected : no change in the existing locale Test PASSED. Done ================================================================================ 007+ string(0) "" 007- string(1) "," 009+ string(0) "" 009- string(4) "USD " 011+ string(0) "" 011- string(1) "$" 013+ string(0) "" 013- string(1) "." 015+ string(0) "" 015- string(1) "," 019+ string(0) "" 019- string(1) "-" 021+ int(127) 021- int(2) 023+ int(127) 023- int(2) 025+ int(127) 025- int(1) 027+ int(127) 027- int(0) 029+ int(127) 029- int(1) 031+ int(127) 031- int(0) 033+ int(127) 033- int(1) 035+ int(127) 035- int(1) 037+ array(0) { 037- array(2) { 038- [0]=> 039- int(3) 040- [1]=> 041- int(3) 040+ array(0) { 044- array(2) { 045- [0]=> 046- int(3) 047- [1]=> 048- int(3) 049+ string(0) "" 051+ string(0) "" 053+ string(0) "" 055+ string(0) "" 057+ string(0) "" 057- string(1) "," 059- string(4) "USD " 061+ string(0) "" 061- string(1) "$" 063+ int(127) 063- string(1) "." 065+ int(127) 065- string(1) "," 067+ int(127) 069+ int(127) 069- string(1) "-" 071+ int(127) 071- int(2) 073+ int(127) 073- int(2) 075+ int(127) 075- int(1) 077+ int(127) 077- int(0) 079+ array(0) { 079- int(1) 081- int(0) 082+ array(0) { 083- int(1) 085- int(1) 087- array(2) { 088- [0]=> 089- int(3) 090- [1]=> 091- int(3) 094- array(2) { 095- [0]=> 096- int(3) 097- [1]=> 098- int(3) ================================================================================ ================================================================================ /usr/local/src/php-5.2.5/ext/standard/tests/strings/setlocale_variation4.phpt ================================================================================ *** Testing setlocale() : usage variations - Setting system locale = null *** Locale info, before setting the locale array(18) { ["decimal_point"]=> string(1) "." ["thousands_sep"]=> string(0) "" ["int_curr_symbol"]=> string(0) "" ["currency_symbol"]=> string(0) "" ["mon_decimal_point"]=> string(0) "" ["mon_thousands_sep"]=> string(0) "" ["positive_sign"]=> string(0) "" ["negative_sign"]=> string(0) "" ["int_frac_digits"]=> int(127) ["frac_digits"]=> int(127) ["p_cs_precedes"]=> int(127) ["p_sep_by_space"]=> int(127) ["n_cs_precedes"]=> int(127) ["n_sep_by_space"]=> int(127) ["p_sign_posn"]=> int(127) ["n_sign_posn"]=> int(127) ["grouping"]=> array(0) { } ["mon_grouping"]=> array(0) { } } Setting system locale, category = LC_ALL and locale = null Locale info, after setting the locale array(18) { ["decimal_point"]=> string(1) "." ["thousands_sep"]=> string(0) "" ["int_curr_symbol"]=> string(0) "" ["currency_symbol"]=> string(0) "" ["mon_decimal_point"]=> string(0) "" ["mon_thousands_sep"]=> string(0) "" ["positive_sign"]=> string(0) "" ["negative_sign"]=> string(0) "" ["int_frac_digits"]=> int(127) ["frac_digits"]=> int(127) ["p_cs_precedes"]=> int(127) ["p_sep_by_space"]=> int(127) ["n_cs_precedes"]=> int(127) ["n_sep_by_space"]=> int(127) ["p_sign_posn"]=> int(127) ["n_sign_posn"]=> int(127) ["grouping"]=> array(0) { } ["mon_grouping"]=> array(0) { } } Checking new locale in the system, Expected : the locale names will be set from the values of environment variables Test FAILED. Done ================================================================================ 007+ string(0) "" 007- string(1) "," 009+ string(0) "" 009- string(4) "AUD " 011+ string(0) "" 011- string(1) "$" 013+ string(0) "" 013- string(1) "." 015+ string(0) "" 015- string(1) "," 019+ string(0) "" 019- string(1) "-" 021+ int(127) 021- int(2) 023+ int(127) 023- int(2) 025+ int(127) 025- int(1) 027+ int(127) 027- int(0) 029+ int(127) 029- int(1) 031+ int(127) 031- int(0) 033+ int(127) 033- int(1) 035+ int(127) 035- int(1) 037+ array(0) { 037- array(2) { 038- [0]=> 039- int(3) 040- [1]=> 041- int(3) 040+ array(0) { 044- array(2) { 045- [0]=> 046- int(3) 047- [1]=> 048- int(3) 049+ string(0) "" 051+ string(0) "" 053+ string(0) "" 055+ string(0) "" 057+ string(0) "" 057- string(1) "," 059- string(4) "USD " 061+ string(0) "" 061- string(1) "$" 063+ int(127) 063- string(1) "." 065+ int(127) 065- string(1) "," 067+ int(127) 069+ int(127) 069- string(1) "-" 071+ int(127) 071- int(2) 073+ int(127) 073- int(2) 075+ int(127) 075- int(1) 077+ int(127) 077- int(0) 079+ array(0) { 079- int(1) 081- int(0) 082+ array(0) { 083- int(1) 085- int(1) 086+ Test FAILED. 087- array(2) { 088- [0]=> 089- int(3) 090- [1]=> 091- int(3) 094- array(2) { 095- [0]=> 096- int(3) 097- [1]=> 098- int(3) 102- Test PASSED. ================================================================================ ================================================================================ /usr/local/src/php-5.2.5/ext/standard/tests/strings/setlocale_variation5.phpt ================================================================================ *** Testing setlocale() : usage variations - setting system locale = "" *** Locale info, before setting the locale array(18) { ["decimal_point"]=> string(1) "." ["thousands_sep"]=> string(0) "" ["int_curr_symbol"]=> string(0) "" ["currency_symbol"]=> string(0) "" ["mon_decimal_point"]=> string(0) "" ["mon_thousands_sep"]=> string(0) "" ["positive_sign"]=> string(0) "" ["negative_sign"]=> string(0) "" ["int_frac_digits"]=> int(127) ["frac_digits"]=> int(127) ["p_cs_precedes"]=> int(127) ["p_sep_by_space"]=> int(127) ["n_cs_precedes"]=> int(127) ["n_sep_by_space"]=> int(127) ["p_sign_posn"]=> int(127) ["n_sign_posn"]=> int(127) ["grouping"]=> array(0) { } ["mon_grouping"]=> array(0) { } } Setting system locale, category = LC_ALL and locale = "" Locale info, after setting the locale array(18) { ["decimal_point"]=> string(1) "." ["thousands_sep"]=> string(0) "" ["int_curr_symbol"]=> string(0) "" ["currency_symbol"]=> string(0) "" ["mon_decimal_point"]=> string(0) "" ["mon_thousands_sep"]=> string(0) "" ["positive_sign"]=> string(0) "" ["negative_sign"]=> string(0) "" ["int_frac_digits"]=> int(127) ["frac_digits"]=> int(127) ["p_cs_precedes"]=> int(127) ["p_sep_by_space"]=> int(127) ["n_cs_precedes"]=> int(127) ["n_sep_by_space"]=> int(127) ["p_sign_posn"]=> int(127) ["n_sign_posn"]=> int(127) ["grouping"]=> array(0) { } ["mon_grouping"]=> array(0) { } } Checking new locale in the system, Expected : the locale names will be set from the values of environment variables Test FAILED. Done ================================================================================ 007+ string(0) "" 007- string(1) "," 009+ string(0) "" 009- string(4) "AUD " 011+ string(0) "" 011- string(1) "$" 013+ string(0) "" 013- string(1) "." 015+ string(0) "" 015- string(1) "," 019+ string(0) "" 019- string(1) "-" 021+ int(127) 021- int(2) 023+ int(127) 023- int(2) 025+ int(127) 025- int(1) 027+ int(127) 027- int(0) 029+ int(127) 029- int(1) 031+ int(127) 031- int(0) 033+ int(127) 033- int(1) 035+ int(127) 035- int(1) 037+ array(0) { 037- array(2) { 038- [0]=> 039- int(3) 040- [1]=> 041- int(3) 040+ array(0) { 044- array(2) { 045- [0]=> 046- int(3) 047- [1]=> 048- int(3) 049+ string(0) "" 051+ string(0) "" 053+ string(0) "" 055+ string(0) "" 057+ string(0) "" 057- string(1) "," 059- string(4) "USD " 061+ string(0) "" 061- string(1) "$" 063+ int(127) 063- string(1) "." 065+ int(127) 065- string(1) "," 067+ int(127) 069+ int(127) 069- string(1) "-" 071+ int(127) 071- int(2) 073+ int(127) 073- int(2) 075+ int(127) 075- int(1) 077+ int(127) 077- int(0) 079+ array(0) { 079- int(1) 081- int(0) 082+ array(0) { 083- int(1) 085- int(1) 086+ Test FAILED. 087- array(2) { 088- [0]=> 089- int(3) 090- [1]=> 091- int(3) 094- array(2) { 095- [0]=> 096- int(3) 097- [1]=> 098- int(3) 102- Test PASSED. ================================================================================ ================================================================================ BUILD ENVIRONMENT ================================================================================ OS: Linux - Linux www 2.6.17-1-vserver-686 #1 SMP Mon Jul 17 14:02:03 UTC 2006 i686 Autoconf: Bundled Libtool: ltmain.sh (GNU libtool) 1.5.20 (1.1220.2.287 2005/08/31 18:54:15) Copyright (C) 2005 Free Software Foundation, Inc. This is free software; see the source for copying conditions. There is NO warranty; not even for MERCHANTABILITY or FITNESS FOR A PARTICULAR PURPOSE. System Libtool: N/A Compiler: Using built-in specs. Target: i486-linux-gnu Configured with: ../src/configure -v --enable-languages=c,c++,fortran,objc,obj-c++,treelang --prefix=/usr --enable-shared --with-system-zlib --libexecdir=/usr/lib --without-included-gettext --enable-threads=posix --enable-nls --program-suffix=-4.1 --enable-__cxa_atexit --enable-clocale=gnu --enable-libstdcxx-debug --enable-mpfr --with-tune=i686 --enable-checking=release i486-linux-gnu Thread model: posix gcc version 4.1.2 20061115 (prerelease) (Debian 4.1.1-21) Bison: Libraries: linux-gate.so.1 => (0xffffe000) libcrypt.so.1 => /lib/tls/libcrypt.so.1 (0x4001d000) librt.so.1 => /lib/tls/librt.so.1 (0x4004b000) libpng12.so.0 => /usr/lib/libpng12.so.0 (0x40053000) libresolv.so.2 => /lib/tls/libresolv.so.2 (0x40076000) libdl.so.2 => /lib/tls/libdl.so.2 (0x40089000) libmysqlclient.so.15 => /usr/lib/libmysqlclient.so.15 (0x4008e000) libpthread.so.0 => /lib/tls/libpthread.so.0 (0x40268000) libnsl.so.1 => /lib/tls/libnsl.so.1 (0x4027a000) libm.so.6 => /lib/tls/libm.so.6 (0x40290000) libz.so.1 => /usr/lib/libz.so.1 (0x402b5000) libxml2.so.2 => /usr/lib/libxml2.so.2 (0x402c9000) libc.so.6 => /lib/tls/libc.so.6 (0x403e4000) /lib/ld-linux.so.2 (0x40000000) User's E-mail: ================================================================================ PHPINFO ================================================================================ phpinfo() PHP Version => 5.2.5 System => Linux www 2.6.17-1-vserver-686 #1 SMP Mon Jul 17 14:02:03 UTC 2006 i686 Build Date => Dec 7 2007 01:29:53 Configure Command => './configure' '--enable-bcmath' '--with-mysql=/usr/lib/' '--with-mysqli' '--with-openssl-dir' '--with-gd' '--with-apxs2=/usr/local/apache2/bin/apxs' Server API => Command Line Interface Virtual Directory Support => disabled Configuration File (php.ini) Path => /usr/local/lib Loaded Configuration File => (none) PHP API => 20041225 PHP Extension => 20060613 Zend Extension => 220060519 Debug Build => no Thread Safety => disabled Zend Memory Manager => enabled IPv6 Support => enabled Registered PHP Streams => php, file, data, http, ftp Registered Stream Socket Transports => tcp, udp, unix, udg Registered Stream Filters => string.rot13, string.toupper, string.tolower, string.strip_tags, convert.*, consumed, convert.iconv.* This program makes use of the Zend Scripting Language Engine: Zend Engine v2.2.0, Copyright (c) 1998-2007 Zend Technologies _______________________________________________________________________ Configuration PHP Core Directive => Local Value => Master Value allow_call_time_pass_reference => On => On allow_url_fopen => On => On allow_url_include => Off => Off always_populate_raw_post_data => Off => Off arg_separator.input => & => & arg_separator.output => & => & asp_tags => Off => Off auto_append_file => no value => no value auto_globals_jit => On => On auto_prepend_file => no value => no value browscap => no value => no value default_charset => no value => no value default_mimetype => text/html => text/html define_syslog_variables => Off => Off disable_classes => no value => no value disable_functions => no value => no value display_errors => STDOUT => STDOUT display_startup_errors => Off => Off doc_root => no value => no value docref_ext => no value => no value docref_root => no value => no value enable_dl => On => On error_append_string => no value => no value error_log => no value => no value error_prepend_string => no value => no value error_reporting => no value => no value expose_php => On => On extension_dir => /usr/local/lib/php/extensions/no-debug-non-zts-20060613 => /usr/local/lib/php/extensions/no-debug-non-zts-20060613 file_uploads => On => On highlight.bg => <font style="color: #FFFFFF">#FFFFFF</font> => <font style="color: #FFFFFF">#FFFFFF</font> highlight.comment => <font style="color: #FF8000">#FF8000</font> => <font style="color: #FF8000">#FF8000</font> highlight.default => <font style="color: #0000BB">#0000BB</font> => <font style="color: #0000BB">#0000BB</font> highlight.html => <font style="color: #000000">#000000</font> => <font style="color: #000000">#000000</font> highlight.keyword => <font style="color: #007700">#007700</font> => <font style="color: #007700">#007700</font> highlight.string => <font style="color: #DD0000">#DD0000</font> => <font style="color: #DD0000">#DD0000</font> html_errors => Off => Off ignore_repeated_errors => Off => Off ignore_repeated_source => Off => Off ignore_user_abort => Off => Off implicit_flush => On => On include_path => .:/usr/local/lib/php => .:/usr/local/lib/php log_errors => Off => Off log_errors_max_len => 1024 => 1024 magic_quotes_gpc => On => On magic_quotes_runtime => Off => Off magic_quotes_sybase => Off => Off mail.force_extra_parameters => no value => no value max_execution_time => 0 => 0 max_input_nesting_level => 64 => 64 max_input_time => -1 => -1 memory_limit => 128M => 128M open_basedir => no value => no value output_buffering => 0 => 0 output_handler => no value => no value post_max_size => 8M => 8M precision => 14 => 14 realpath_cache_size => 16K => 16K realpath_cache_ttl => 120 => 120 register_argc_argv => On => On register_globals => Off => Off register_long_arrays => On => On report_memleaks => On => On report_zend_debug => Off => Off safe_mode => Off => Off safe_mode_exec_dir => /usr/local/php/bin => /usr/local/php/bin safe_mode_gid => Off => Off safe_mode_include_dir => no value => no value sendmail_from => no value => no value sendmail_path => /usr/sbin/sendmail -t -i => /usr/sbin/sendmail -t -i serialize_precision => 100 => 100 short_open_tag => On => On SMTP => localhost => localhost smtp_port => 25 => 25 sql.safe_mode => Off => Off track_errors => Off => Off unserialize_callback_func => no value => no value upload_max_filesize => 2M => 2M upload_tmp_dir => no value => no value user_dir => no value => no value variables_order => EGPCS => EGPCS xmlrpc_error_number => 0 => 0 xmlrpc_errors => Off => Off y2k_compliance => On => On zend.ze1_compatibility_mode => Off => Off bcmath BCMath support => enabled ctype ctype functions => enabled date date/time support => enabled "Olson" Timezone Database Version => 2007.9 Timezone Database => internal Default timezone => Australia/Melbourne Directive => Local Value => Master Value date.default_latitude => 31.7667 => 31.7667 date.default_longitude => 35.2333 => 35.2333 date.sunrise_zenith => 90.583333 => 90.583333 date.sunset_zenith => 90.583333 => 90.583333 date.timezone => no value => no value dom DOM/XML => enabled DOM/XML API Version => 20031129 libxml Version => 2.6.27 HTML Support => enabled XPath Support => enabled XPointer Support => enabled Schema Support => enabled RelaxNG Support => enabled filter Input Validation and Filtering => enabled Revision => $Revision: 1.52.2.39 $ Directive => Local Value => Master Value filter.default => unsafe_raw => unsafe_raw filter.default_flags => no value => no value gd GD Support => enabled GD Version => bundled (2.0.34 compatible) GIF Read Support => enabled GIF Create Support => enabled PNG Support => enabled WBMP Support => enabled XBM Support => enabled hash hash support => enabled Hashing Engines => md2 md4 md5 sha1 sha256 sha384 sha512 ripemd128 ripemd160 ripemd256 ripemd320 whirlpool tiger128,3 tiger160,3 tiger192,3 tiger128,4 tiger160,4 tiger192,4 snefru gost adler32 crc32 crc32b haval128,3 haval160,3 haval192,3 haval224,3 haval256,3 haval128,4 haval160,4 haval192,4 haval224,4 haval256,4 haval128,5 haval160,5 haval192,5 haval224,5 haval256,5 iconv iconv support => enabled iconv implementation => glibc iconv library version => 2.3.6 Directive => Local Value => Master Value iconv.input_encoding => ISO-8859-1 => ISO-8859-1 iconv.internal_encoding => ISO-8859-1 => ISO-8859-1 iconv.output_encoding => ISO-8859-1 => ISO-8859-1 json json support => enabled json version => 1.2.1 libxml libXML support => active libXML Version => 2.6.27 libXML streams => enabled mysql MySQL Support => enabled Active Persistent Links => 0 Active Links => 0 Client API version => 5.0.32 MYSQL_MODULE_TYPE => external MYSQL_SOCKET => /var/run/mysqld/mysqld.sock MYSQL_INCLUDE => -I/usr/include/mysql MYSQL_LIBS => -L/usr/lib -lmysqlclient Directive => Local Value => Master Value mysql.allow_persistent => On => On mysql.connect_timeout => 60 => 60 mysql.default_host => no value => no value mysql.default_password => no value => no value mysql.default_port => no value => no value mysql.default_socket => no value => no value mysql.default_user => no value => no value mysql.max_links => Unlimited => Unlimited mysql.max_persistent => Unlimited => Unlimited mysql.trace_mode => Off => Off mysqli MysqlI Support => enabled Client API library version => 5.0.32 Client API header version => 5.0.32 MYSQLI_SOCKET => /var/run/mysqld/mysqld.sock Directive => Local Value => Master Value mysqli.default_host => no value => no value mysqli.default_port => 3306 => 3306 mysqli.default_pw => no value => no value mysqli.default_socket => no value => no value mysqli.default_user => no value => no value mysqli.max_links => Unlimited => Unlimited mysqli.reconnect => Off => Off pcre PCRE (Perl Compatible Regular Expressions) Support => enabled PCRE Library Version => 7.3 2007-08-28 Directive => Local Value => Master Value pcre.backtrack_limit => 100000 => 100000 pcre.recursion_limit => 100000 => 100000 PDO PDO support => enabled PDO drivers => sqlite, sqlite2 pdo_sqlite PDO Driver for SQLite 3.x => enabled PECL Module version => (bundled) 1.0.1 $Id: pdo_sqlite.c,v 1.10.2.6.2.2 2007/03/23 14:30:00 wez Exp $ SQLite Library => 3.3.17 posix Revision => $Revision: 1.70.2.3.2.16 $ Reflection Reflection => enabled Version => $Id: php_reflection.c,v 1.164.2.33.2.47 2007/10/28 13:47:14 iliaa Exp $ session Session Support => enabled Registered save handlers => files user sqlite Registered serializer handlers => php php_binary Directive => Local Value => Master Value session.auto_start => Off => Off session.bug_compat_42 => On => On session.bug_compat_warn => On => On session.cache_expire => 180 => 180 session.cache_limiter => nocache => nocache session.cookie_domain => no value => no value session.cookie_httponly => Off => Off session.cookie_lifetime => 0 => 0 session.cookie_path => / => / session.cookie_secure => Off => Off session.entropy_file => no value => no value session.entropy_length => 0 => 0 session.gc_divisor => 100 => 100 session.gc_maxlifetime => 1440 => 1440 session.gc_probability => 1 => 1 session.hash_bits_per_character => 4 => 4 session.hash_function => 0 => 0 session.name => PHPSESSID => PHPSESSID session.referer_check => no value => no value session.save_handler => files => files session.save_path => no value => no value session.serialize_handler => php => php session.use_cookies => On => On session.use_only_cookies => Off => Off session.use_trans_sid => 0 => 0 SimpleXML Simplexml support => enabled Revision => $Revision: 1.151.2.22.2.35 $ Schema support => enabled SPL SPL support => enabled Interfaces => Countable, OuterIterator, RecursiveIterator, SeekableIterator, SplObserver, SplSubject Classes => AppendIterator, ArrayIterator, ArrayObject, BadFunctionCallException, BadMethodCallException, CachingIterator, DirectoryIterator, DomainException, EmptyIterator, FilterIterator, InfiniteIterator, InvalidArgumentException, IteratorIterator, LengthException, LimitIterator, LogicException, NoRewindIterator, OutOfBoundsException, OutOfRangeException, OverflowException, ParentIterator, RangeException, RecursiveArrayIterator, RecursiveCachingIterator, RecursiveDirectoryIterator, RecursiveFilterIterator, RecursiveIteratorIterator, RecursiveRegexIterator, RegexIterator, RuntimeException, SimpleXMLIterator, SplFileInfo, SplFileObject, SplObjectStorage, SplTempFileObject, UnderflowException, UnexpectedValueException SQLite SQLite support => enabled PECL Module version => 2.0-dev $Id: sqlite.c,v 1.166.2.13.2.9 2007/05/19 17:58:22 iliaa Exp $ SQLite Library => 2.8.17 SQLite Encoding => iso8859 Directive => Local Value => Master Value sqlite.assoc_case => 0 => 0 standard Regex Library => Bundled library enabled Dynamic Library Support => enabled Path to sendmail => /usr/sbin/sendmail -t -i Directive => Local Value => Master Value assert.active => 1 => 1 assert.bail => 0 => 0 assert.callback => no value => no value assert.quiet_eval => 0 => 0 assert.warning => 1 => 1 auto_detect_line_endings => 0 => 0 default_socket_timeout => 60 => 60 safe_mode_allowed_env_vars => PHP_ => PHP_ safe_mode_protected_env_vars => LD_LIBRARY_PATH => LD_LIBRARY_PATH url_rewriter.tags => a=href,area=href,frame=src,form=,fieldset= => a=href,area=href,frame=src,form=,fieldset= user_agent => no value => no value tokenizer Tokenizer Support => enabled xml XML Support => active XML Namespace Support => active libxml2 Version => 2.6.27 xmlreader XMLReader => enabled xmlwriter XMLWriter => enabled Additional Modules Module Name Environment Variable => Value TEST_PHP_SRCDIR => /usr/local/src/php-5.2.5 INIT_CWD => /home/staff/martin SHELL => /bin/zsh TERM => xterm MAKEFLAGS => SSH_CLIENT => deleted SSH_TTY => deleted USER => martin SUDO_USER => martin LOGIN_UID => 1000 SUDO_UID => 1000 SSH_AUTH_SOCK => deleted MAKELEVEL => 1 MFLAGS => PATH => /usr/local/sbin:/usr/local/bin:/usr/sbin:/usr/bin:/sbin:/bin MAIL => /var/mail/martin _ => /usr/local/src/php-5.2.5/sapi/cli/php PWD => /usr/local/src/php-5.2.5 TEST_PHP_EXECUTABLE => /usr/local/src/php-5.2.5/sapi/cli/php SUDO_COMMAND => /usr/local/bin/in-web HOME => /home/staff/martin SHLVL => 4 LOGNAME => martin LESS => -niqSJRW -j3 -x3 -z-3 SSH_CONNECTION => deleted SUDO_GID => 1000 CC => gcc PHP Variables Variable => Value _SERVER["TEST_PHP_SRCDIR"] => /usr/local/src/php-5.2.5 _SERVER["INIT_CWD"] => /home/staff/martin _SERVER["SHELL"] => /bin/zsh _SERVER["TERM"] => xterm _SERVER["MAKEFLAGS"] => _SERVER["SSH_CLIENT"] => deleted _SERVER["SSH_TTY"] => deleted _SERVER["USER"] => martin _SERVER["SUDO_USER"] => martin _SERVER["LOGIN_UID"] => 1000 _SERVER["SUDO_UID"] => 1000 _SERVER["SSH_AUTH_SOCK"] => deleted _SERVER["MAKELEVEL"] => 1 _SERVER["MFLAGS"] => _SERVER["PATH"] => /usr/local/sbin:/usr/local/bin:/usr/sbin:/usr/bin:/sbin:/bin _SERVER["MAIL"] => /var/mail/martin _SERVER["_"] => /usr/local/src/php-5.2.5/sapi/cli/php _SERVER["PWD"] => /usr/local/src/php-5.2.5 _SERVER["TEST_PHP_EXECUTABLE"] => /usr/local/src/php-5.2.5/sapi/cli/php _SERVER["SUDO_COMMAND"] => /usr/local/bin/in-web _SERVER["HOME"] => /home/staff/martin _SERVER["SHLVL"] => 4 _SERVER["LOGNAME"] => martin _SERVER["LESS"] => -niqSJRW -j3 -x3 -z-3 _SERVER["SSH_CONNECTION"] => deleted _SERVER["SUDO_GID"] => 1000 _SERVER["CC"] => gcc _SERVER["PHP_SELF"] => _SERVER["SCRIPT_NAME"] => _SERVER["SCRIPT_FILENAME"] => _SERVER["PATH_TRANSLATED"] => _SERVER["DOCUMENT_ROOT"] => _SERVER["REQUEST_TIME"] => 1196951699 _SERVER["argv"] => Array ( ) _SERVER["argc"] => 0 _ENV["TEST_PHP_SRCDIR"] => /usr/local/src/php-5.2.5 _ENV["INIT_CWD"] => /home/staff/martin _ENV["SHELL"] => /bin/zsh _ENV["TERM"] => xterm _ENV["MAKEFLAGS"] => _ENV["SSH_CLIENT"] => deleted _ENV["SSH_TTY"] => deleted _ENV["USER"] => martin _ENV["SUDO_USER"] => martin _ENV["LOGIN_UID"] => 1000 _ENV["SUDO_UID"] => 1000 _ENV["SSH_AUTH_SOCK"] => deleted _ENV["MAKELEVEL"] => 1 _ENV["MFLAGS"] => _ENV["PATH"] => /usr/local/sbin:/usr/local/bin:/usr/sbin:/usr/bin:/sbin:/bin _ENV["MAIL"] => /var/mail/martin _ENV["_"] => /usr/local/src/php-5.2.5/sapi/cli/php _ENV["PWD"] => /usr/local/src/php-5.2.5 _ENV["TEST_PHP_EXECUTABLE"] => /usr/local/src/php-5.2.5/sapi/cli/php _ENV["SUDO_COMMAND"] => /usr/local/bin/in-web _ENV["HOME"] => /home/staff/martin _ENV["SHLVL"] => 4 _ENV["LOGNAME"] => martin _ENV["LESS"] => -niqSJRW -j3 -x3 -z-3 _ENV["SSH_CONNECTION"] => deleted _ENV["SUDO_GID"] => 1000 _ENV["CC"] => gcc PHP License This program is free software; you can redistribute it and/or modify it under the terms of the PHP License as published by the PHP Group and included in the distribution in the file: LICENSE This program is distributed in the hope that it will be useful, but WITHOUT ANY WARRANTY; without even the implied warranty of MERCHANTABILITY or FITNESS FOR A PARTICULAR PURPOSE. If you did not receive a copy of the PHP license, or have any questions about PHP licensing, please contact license@php.net.

« previous php.qa (#55087) next »