PHP Test results

From: Date: Sat, 20 Jul 2002 12:07:05 +0000
Subject: PHP Test results
Groups: php.qa 
Request: Send a blank email to php-qa+get-5603@lists.php.net to get a copy of this message
array ( 'user_name' => 'Øystein Folkvord', 'email' => 'oysfol@online.no', 'package' => '4.2.1RC2', 'testcase' => '0', 'status' => 'Fail', 'os' => 'Linux i386', 'sapi' => 'Apache 2.x DSO', 'automake' => '1.4', 'autoconf' => '2.1.3', 'libtool' => '1.4.2', 'bison' => 'other', 'test' => '', 'problems' => 'make[3]: Entering directory `/home/flk/php-4.2.1RC2/sapi/apache2filter\\\' /bin/sh /home/flk/php-4.2.1RC2/libtool --mode=compile gcc -I. -I/home/flk/php-4.2.1RC2/sapi/apache2filter -I/home/flk/php-4.2.1RC2/main -I/home/flk/php-4.2.1RC2 -I/usr/local/apache/include -I/home/flk/php-4.2.1RC2/Zend -I/home/flk/php-4.2.1RC2/ext/mysql/libmysql -I/home/flk/php-4.2.1RC2/ext/xml/expat -D_REENTRANT -I/home/flk/php-4.2.1RC2/TSRM -DTHREAD=1 -g -O2 -pthread -Wall -DZTS -prefer-pic -c sapi_apache2.c gcc -I. -I/home/flk/php-4.2.1RC2/sapi/apache2filter -I/home/flk/php-4.2.1RC2/main -I/home/flk/php-4.2.1RC2 -I/usr/local/apache/include -I/home/flk/php-4.2.1RC2/Zend -I/home/flk/php-4.2.1RC2/ext/mysql/libmysql -I/home/flk/php-4.2.1RC2/ext/xml/expat -D_REENTRANT -I/home/flk/php-4.2.1RC2/TSRM -DTHREAD=1 -g -O2 -pthread -Wall -DZTS -c sapi_apache2.c -fPIC -DPIC -o sapi_apache2.lo sapi_apache2.c: In function `php_register_hook\\\': sapi_apache2.c:534: warning: passing arg 3 of `ap_register_output_filter\\\' makes pointer from integer without a cast sapi_apache2.c:534: too few arguments to function `ap_register_output_filter\\\' sapi_apache2.c:535: warning: passing arg 3 of `ap_register_input_filter\\\' makes pointer from integer without a cast sapi_apache2.c:535: too few arguments to function `ap_register_input_filter\\\' make[3]: *** [sapi_apache2.lo] Error 1 make[3]: Leaving directory `/home/flk/php-4.2.1RC2/sapi/apache2filter\\\' make[2]: *** [all-recursive] Error 1 make[2]: Leaving directory `/home/flk/php-4.2.1RC2/sapi/apache2filter\\\' make[1]: *** [all-recursive] Error 1 make[1]: Leaving directory `/home/flk/php-4.2.1RC2/sapi\\\' make: *** [all-recursive] Error 1 ', 'bugids' => '', 'remarks' => '', )

« previous php.qa (#5603) next »