Test results for 5.2.5 [failed]

From: Date: Sun, 03 Feb 2008 05:58:54 +0000
Subject: Test results for 5.2.5 [failed]
Groups: php.qa 
Request: Send a blank email to php-qa+get-62598@lists.php.net to get a copy of this message
===================================================================== FAILED TEST SUMMARY --------------------------------------------------------------------- date OO cloning [ext/date/tests/oo_002.phpt] Bug #38474 (getAttribute select attribute by order, even when prefixed) (OK to fail with libxml2 < 2.6.2x) [ext/dom/tests/bug38474.phpt] iconv stream filter [ext/iconv/tests/iconv_stream_filter.phpt] ob_iconv_handler() charset parameter length checks (CVE-2007-4840) [ext/iconv/tests/ob_iconv_handler-charset-length-cve-2007-4840.phpt] SPL: DualIterator [ext/spl/examples/tests/dualiterator_001.phpt] Test lstat() and stat() functions: usage variations - effects of touch() on link [ext/standard/tests/file/lstat_stat_variation6.phpt] htmlentities() test 2 (setlocale / fr_FR.ISO-8859-15) [ext/standard/tests/strings/htmlentities02.phpt] (warn: possibly braindead libc) htmlentities() test 4 (setlocale / ja_JP.EUC-JP) [ext/standard/tests/strings/htmlentities04.phpt] (warn: possibly braindead libc) htmlentities() test 15 (setlocale / KOI8-R) [ext/standard/tests/strings/htmlentities15.phpt] (warn: possibly braindead libc) Test setlocale() function : usage variations - Setting all available locales in the platform [ext/standard/tests/strings/setlocale_variation2.phpt] ===================================================================== ===================================================================== TEST RESULT SUMMARY --------------------------------------------------------------------- Exts skipped : 57 Exts tested : 22 --------------------------------------------------------------------- Number of tests : 4466 2769 Tests skipped : 1697 ( 38.0%) -------- Tests warned : 3 ( 0.1%) ( 0.1%) Tests failed : 7 ( 0.2%) ( 0.3%) Tests passed : 2759 ( 61.8%) ( 99.6%) --------------------------------------------------------------------- Time taken : 256 seconds ===================================================================== ===================================================================== FAILED TEST SUMMARY --------------------------------------------------------------------- date OO cloning [ext/date/tests/oo_002.phpt] Bug #38474 (getAttribute select attribute by order, even when prefixed) (OK to fail with libxml2 < 2.6.2x) [ext/dom/tests/bug38474.phpt] iconv stream filter [ext/iconv/tests/iconv_stream_filter.phpt] ob_iconv_handler() charset parameter length checks (CVE-2007-4840) [ext/iconv/tests/ob_iconv_handler-charset-length-cve-2007-4840.phpt] SPL: DualIterator [ext/spl/examples/tests/dualiterator_001.phpt] Test lstat() and stat() functions: usage variations - effects of touch() on link [ext/standard/tests/file/lstat_stat_variation6.phpt] htmlentities() test 2 (setlocale / fr_FR.ISO-8859-15) [ext/standard/tests/strings/htmlentities02.phpt] (warn: possibly braindead libc) htmlentities() test 4 (setlocale / ja_JP.EUC-JP) [ext/standard/tests/strings/htmlentities04.phpt] (warn: possibly braindead libc) htmlentities() test 15 (setlocale / KOI8-R) [ext/standard/tests/strings/htmlentities15.phpt] (warn: possibly braindead libc) Test setlocale() function : usage variations - Setting all available locales in the platform [ext/standard/tests/strings/setlocale_variation2.phpt] ===================================================================== ================================================================================ /usr/local/src/php-5.2.5/ext/date/tests/oo_002.phpt ================================================================================ string(29) "Fri, 01 Aug 08 13:00:00 +0000" string(29) "Fri, 01 Aug 08 13:00:00 +0000" string(29) "Fri, 01 Aug 08 14:00:00 +0000" string(29) "Fri, 01 Aug 08 12:59:59 +0000" string(10) "Asia/Tokyo" string(10) "Asia/Tokyo" ================================================================================ 001+ string(29) "Fri, 01 Aug 08 13:00:00 +0000" 002+ string(29) "Fri, 01 Aug 08 13:00:00 +0000" 003+ string(29) "Fri, 01 Aug 08 14:00:00 +0000" 004+ string(29) "Fri, 01 Aug 08 12:59:59 +0000" 001- string(29) "Wed, 01 Aug 07 13:00:00 +0000" 002- string(29) "Wed, 01 Aug 07 13:00:00 +0000" 003- string(29) "Wed, 01 Aug 07 14:00:00 +0000" 004- string(29) "Wed, 01 Aug 07 12:59:59 +0000" ================================================================================ ================================================================================ /usr/local/src/php-5.2.5/ext/dom/tests/bug38474.phpt ================================================================================ foo bar foo2 bar baz2 ================================================================================ 004+ bar 005+ 006+ 004- bar2 005- baz 008- baz ================================================================================ ================================================================================ /usr/local/src/php-5.2.5/ext/iconv/tests/iconv_stream_filter.phpt ================================================================================ string(20) "1b244224332473244b24" string(10) "41244f1b28" string(2) "42" string(20) "a4b3a4f3a4cba4c1a4cf" string(10) "69636f6e76" string(2) "0a" string(20) "1b244f24332466245824" string(10) "4e24421b28" string(2) "4f" ================================================================================ 007+ string(20) "1b244f24332466245824" 008+ string(10) "4e24421b28" 009+ string(2) "4f" 007- 008- Warning: fread(): iconv stream filter ("ISO-2022-JP"=>"EUC-JP"): invalid multibyte sequence in %s on line %d 009- string(0) "" 010- string(0) "" 011- string(0) "" ================================================================================ ================================================================================ /usr/local/src/php-5.2.5/ext/iconv/tests/ob_iconv_handler-charset-length-cve-2007-4840.phpt ================================================================================ Fatal error: Allowed memory size of 10485760 bytes exhausted (tried to allocate 9000001 bytes) in /usr/local/src/php-5.2.5/ext/iconv/tests/ob_iconv_handler-charset-length-cve-2007-4840.php on line 2 ================================================================================ 001+ Fatal error: Allowed memory size of 10485760 bytes exhausted (tried to allocate 9000001 bytes) in /usr/local/src/php-5.2.5/ext/iconv/tests/ob_iconv_handler-charset-length-cve-2007-4840.php on line 2 001- done ================================================================================ ================================================================================ /usr/local/src/php-5.2.5/ext/spl/examples/tests/dualiterator_001.phpt ================================================================================ bool(true) bool(false) Warning: include(/usr/local/src/php-5.2.5/ext/spl/examples/tests/../reflectionclass.inc): failed to open stream: No such file or directory in /usr/local/src/php-5.2.5/ext/spl/examples/tests/dualiterator_001.php on line 5 Warning: include(): Failed opening '/usr/local/src/php-5.2.5/ext/spl/examples/tests/../reflectionclass.inc' for inclusion (include_path='.:/php/includes:/usr/local/lib/php') in /usr/local/src/php-5.2.5/ext/spl/examples/tests/dualiterator_001.php on line 5 Fatal error: Class 'ReflectionClass' not found in /usr/local/src/php-5.2.5/ext/spl/examples/recursivedualiterator.inc on line 47 ================================================================================ 003+ 004+ Warning: include(/usr/local/src/php-5.2.5/ext/spl/examples/tests/../reflectionclass.inc): failed to open stream: No such file or directory in /usr/local/src/php-5.2.5/ext/spl/examples/tests/dualiterator_001.php on line 5 005+ 006+ Warning: include(): Failed opening '/usr/local/src/php-5.2.5/ext/spl/examples/tests/../reflectionclass.inc' for inclusion (include_path='.:/php/includes:/usr/local/lib/php') in /usr/local/src/php-5.2.5/ext/spl/examples/tests/dualiterator_001.php on line 5 007+ 008+ Fatal error: Class 'ReflectionClass' not found in /usr/local/src/php-5.2.5/ext/spl/examples/recursivedualiterator.inc on line 47 003- bool(true) 004- bool(false) 005- bool(false) 006- bool(false) 007- bool(true) 008- bool(false) 009- bool(true) 010- bool(false) 011- ===DONE=== ================================================================================ ================================================================================ /usr/local/src/php-5.2.5/ext/standard/tests/file/lstat_stat_variation6.phpt ================================================================================ *** Testing lstat() for link after using touch() on the link *** bool(true) bool(true) bool(true) Error: stat1 is not lesser than stat2 at key value: 8 Error: stat1 is not lesser than stat2 at key value: atime Dumping stat array 1... array(26) { [0]=> int(143) [1]=> int(11755046) [2]=> int(41471) [3]=> int(1) [4]=> int(0) [5]=> int(0) [6]=> int(0) [7]=> int(74) [8]=> int(1202018152) [9]=> int(1202018152) [10]=> int(1202018152) [11]=> int(4096) [12]=> int(8) ["dev"]=> int(143) ["ino"]=> int(11755046) ["mode"]=> int(41471) ["nlink"]=> int(1) ["uid"]=> int(0) ["gid"]=> int(0) ["rdev"]=> int(0) ["size"]=> int(74) ["atime"]=> int(1202018152) ["mtime"]=> int(1202018152) ["ctime"]=> int(1202018152) ["blksize"]=> int(4096) ["blocks"]=> int(8) } Dumping stat array 2... array(26) { [0]=> int(143) [1]=> int(11755046) [2]=> int(41471) [3]=> int(1) [4]=> int(0) [5]=> int(0) [6]=> int(0) [7]=> int(74) [8]=> int(1202018152) [9]=> int(1202018152) [10]=> int(1202018152) [11]=> int(4096) [12]=> int(8) ["dev"]=> int(143) ["ino"]=> int(11755046) ["mode"]=> int(41471) ["nlink"]=> int(1) ["uid"]=> int(0) ["gid"]=> int(0) ["rdev"]=> int(0) ["size"]=> int(74) ["atime"]=> int(1202018152) ["mtime"]=> int(1202018152) ["ctime"]=> int(1202018152) ["blksize"]=> int(4096) ["blocks"]=> int(8) } bool(false) --- Done --- ================================================================================ 005+ Error: stat1 is not lesser than stat2 at key value: 8 006+ Error: stat1 is not lesser than stat2 at key value: atime 005- bool(true) 007- --- Done --- 008+ Dumping stat array 1... 009+ array(26) { 010+ [0]=> 011+ int(143) 012+ [1]=> 013+ int(11755046) 014+ [2]=> 015+ int(41471) 016+ [3]=> 017+ int(1) 018+ [4]=> 019+ int(0) 020+ [5]=> 021+ int(0) 022+ [6]=> 023+ int(0) 024+ [7]=> 025+ int(74) 026+ [8]=> 027+ int(1202018152) 028+ [9]=> 029+ int(1202018152) 030+ [10]=> 031+ int(1202018152) 032+ [11]=> 033+ int(4096) 034+ [12]=> 035+ int(8) 036+ ["dev"]=> 037+ int(143) 038+ ["ino"]=> 039+ int(11755046) 040+ ["mode"]=> 041+ int(41471) 042+ ["nlink"]=> 043+ int(1) 044+ ["uid"]=> 045+ int(0) 046+ ["gid"]=> 047+ int(0) 048+ ["rdev"]=> 049+ int(0) 050+ ["size"]=> 051+ int(74) 052+ ["atime"]=> 053+ int(1202018152) 054+ ["mtime"]=> 055+ int(1202018152) 056+ ["ctime"]=> 057+ int(1202018152) 058+ ["blksize"]=> 059+ int(4096) 060+ ["blocks"]=> 061+ int(8) 062+ } 063+ 064+ Dumping stat array 2... 065+ array(26) { 066+ [0]=> 067+ int(143) 068+ [1]=> 069+ int(11755046) 070+ [2]=> 071+ int(41471) 072+ [3]=> 073+ int(1) 074+ [4]=> 075+ int(0) 076+ [5]=> 077+ int(0) 078+ [6]=> 079+ int(0) 080+ [7]=> 081+ int(74) 082+ [8]=> 083+ int(1202018152) 084+ [9]=> 085+ int(1202018152) 086+ [10]=> 087+ int(1202018152) 088+ [11]=> 089+ int(4096) 090+ [12]=> 091+ int(8) 092+ ["dev"]=> 093+ int(143) 094+ ["ino"]=> 095+ int(11755046) 096+ ["mode"]=> 097+ int(41471) 098+ ["nlink"]=> 099+ int(1) 100+ ["uid"]=> 101+ int(0) 102+ ["gid"]=> 103+ int(0) 104+ ["rdev"]=> 105+ int(0) 106+ ["size"]=> 107+ int(74) 108+ ["atime"]=> 109+ int(1202018152) 110+ ["mtime"]=> 111+ int(1202018152) 112+ ["ctime"]=> 113+ int(1202018152) 114+ ["blksize"]=> 115+ int(4096) 116+ ["blocks"]=> 117+ int(8) 118+ } 119+ bool(false) 120+ 121+ --- Done --- ================================================================================ ================================================================================ /usr/local/src/php-5.2.5/ext/standard/tests/strings/htmlentities02.phpt (warn: possibly braindead libc) ================================================================================ string(24) "&frac14;&frac12;&frac34;" ================================================================================ 001+ string(24) "&frac14;&frac12;&frac34;" 001- string(20) "&OElig;&oelig;&Yuml;" ================================================================================ ================================================================================ /usr/local/src/php-5.2.5/ext/standard/tests/strings/htmlentities04.phpt (warn: possibly braindead libc) ================================================================================ string(42) "&iexcl;&cent;&iexcl;&pound;&iexcl;&curren;" ================================================================================ 001+ string(42) "&iexcl;&cent;&iexcl;&pound;&iexcl;&curren;" 001- string(6) "¡¢¡£¡¤" ================================================================================ ================================================================================ /usr/local/src/php-5.2.5/ext/standard/tests/strings/htmlentities15.phpt (warn: possibly braindead libc) ================================================================================ string(9) "ÒÏÓËÏÛÎÙÊ" string(63) "&Ograve;&Iuml;&Oacute;&Euml;&Iuml;&Ucirc;&Icirc;&Ugrave;&Ecirc;" ================================================================================ 002+ string(63) "&Ograve;&Iuml;&Oacute;&Euml;&Iuml;&Ucirc;&Icirc;&Ugrave;&Ecirc;" 002- string(63) "&#1088;&#1086;&#1089;&#1082;&#1086;&#1096;&#1085;&#1099;&#1081;" ================================================================================ ================================================================================ /usr/local/src/php-5.2.5/ext/standard/tests/strings/setlocale_variation2.phpt ================================================================================ *** Testing setlocale() : usage variations *** -- Test setlocale() with all available locale in the system -- No of locales found on the machine = 498 No of setlocale() success = 497 Expected no of failures = 0 Test FAILED Names of locale() for which setlocale() failed ... array(1) { [0]=> string(16) "nb_NO.ISO-8859-1" } Done ================================================================================ 006+ Test FAILED 007+ Names of locale() for which setlocale() failed ... 008+ array(1) { 009+ [0]=> 010+ string(16) "nb_NO.ISO-8859-1" 011+ } 006- Test PASSED ================================================================================ ================================================================================ BUILD ENVIRONMENT ================================================================================ OS: Linux - Linux jonah.prod.phx1.secureserver.net 2.6.9-023stab043.1-smp #1 SMP Mon Mar 5 16:35:19 MSK 2007 i686 Autoconf: autoconf (GNU Autoconf) 2.57 Written by David J. MacKenzie and Akim Demaille. Copyright 2002 Free Software Foundation, Inc. This is free software; see the source for copying conditions. There is NO warranty; not even for MERCHANTABILITY or FITNESS FOR A PARTICULAR PURPOSE. Bundled Libtool: ltmain.sh (GNU libtool) 1.5.20 (1.1220.2.287 2005/08/31 18:54:15) Copyright (C) 2005 Free Software Foundation, Inc. This is free software; see the source for copying conditions. There is NO warranty; not even for MERCHANTABILITY or FITNESS FOR A PARTICULAR PURPOSE. System Libtool: ltmain.sh (GNU libtool) 1.4.3 (1.922.2.111 2002/10/23 02:54:36) Compiler: Reading specs from /usr/lib/gcc-lib/i386-redhat-linux/3.2.2/specs Configured with: ../configure --prefix=/usr --mandir=/usr/share/man --infodir=/usr/share/info --enable-shared --enable-threads=posix --disable-checking --with-system-zlib --enable-__cxa_atexit --host=i386-redhat-linux Thread model: posix gcc version 3.2.2 20030222 (Red Hat Linux 3.2.2-5) Bison: bison (GNU Bison) 1.35 Copyright 1984, 1986, 1989, 1992, 2000, 2001, 2002 Free Software Foundation, Inc. This is free software; see the source for copying conditions. There is NO warranty; not even for MERCHANTABILITY or FITNESS FOR A PARTICULAR PURPOSE. Libraries: libcrypt.so.1 => /lib/libcrypt.so.1 (0x40018000) libpq.so.4 => /usr/local/pgsql/lib/libpq.so.4 (0x40044000) libfreetype.so.6 => /usr/lib/libfreetype.so.6 (0x4005d000) libpng12.so.0 => /usr/lib/libpng12.so.0 (0x400ae000) libz.so.1 => /usr/lib/libz.so.1 (0x400d1000) libssl.so.4 => /lib/libssl.so.4 (0x400e0000) libcrypto.so.4 => /lib/libcrypto.so.4 (0x40115000) libresolv.so.2 => /lib/libresolv.so.2 (0x4020c000) libm.so.6 => /lib/libm.so.6 (0x4021c000) libdl.so.2 => /lib/libdl.so.2 (0x4023d000) libnsl.so.1 => /lib/libnsl.so.1 (0x40240000) libxml2.so.2 => /usr/lib/libxml2.so.2 (0x40254000) libcurl.so.3 => /usr/local/lib/libcurl.so.3 (0x40354000) libc.so.6 => /lib/libc.so.6 (0x40384000) libgssapi_krb5.so.2 => /usr/kerberos/lib/libgssapi_krb5.so.2 (0x404ab000) libkrb5.so.3 => /usr/kerberos/lib/libkrb5.so.3 (0x404be000) libcom_err.so.3 => /usr/kerberos/lib/libcom_err.so.3 (0x4051c000) libk5crypto.so.3 => /usr/kerberos/lib/libk5crypto.so.3 (0x4051f000) /lib/ld-linux.so.2 => /lib/ld-linux.so.2 (0x40000000) User's E-mail: php-list at nullmx dot com ================================================================================ PHPINFO ================================================================================ phpinfo() PHP Version => 5.2.5 System => Linux jonah.prod.phx1.secureserver.net 2.6.9-023stab043.1-smp #1 SMP Mon Mar 5 16:35:19 MSK 2007 i686 Build Date => Feb 2 2008 22:50:22 Configure Command => './configure' '--disable-cgi' '--enable-cli' '--with-apxs2=/usr/local/apache2/bin/apxs' '--with-pgsql=/usr/local/pgsql-8.2.6' '--with-curl' '--enable-mbstring' '--with-zlib' '--with-openssl' '--with-gd' '--enable-gd-native-ttf' '--with-freetype-dir=/usr/lib/' '--disable-ipv6' '--disable-filter' '--disable-pdo' '--disable-reflection' '--disable-simplexml' '--without-sqlite' Server API => Command Line Interface Virtual Directory Support => disabled Configuration File (php.ini) Path => /usr/local/lib Loaded Configuration File => /usr/local/lib/php.ini PHP API => 20041225 PHP Extension => 20060613 Zend Extension => 220060519 Debug Build => no Thread Safety => disabled Zend Memory Manager => enabled IPv6 Support => disabled Registered PHP Streams => php, file, data, http, ftp, compress.zlib, https, ftps Registered Stream Socket Transports => tcp, udp, unix, udg, ssl, sslv3, sslv2, tls Registered Stream Filters => string.rot13, string.toupper, string.tolower, string.strip_tags, convert.*, consumed, convert.iconv.*, zlib.* This program makes use of the Zend Scripting Language Engine: Zend Engine v2.2.0, Copyright (c) 1998-2007 Zend Technologies _______________________________________________________________________ Configuration PHP Core Directive => Local Value => Master Value allow_call_time_pass_reference => Off => Off allow_url_fopen => On => On allow_url_include => Off => Off always_populate_raw_post_data => Off => Off arg_separator.input => & => & arg_separator.output => & => & asp_tags => Off => Off auto_append_file => no value => no value auto_globals_jit => On => On auto_prepend_file => no value => no value browscap => no value => no value default_charset => UTF-8 => UTF-8 default_mimetype => text/html => text/html define_syslog_variables => Off => Off disable_classes => no value => no value disable_functions => no value => no value display_errors => Off => Off display_startup_errors => Off => Off doc_root => no value => no value docref_ext => no value => no value docref_root => no value => no value enable_dl => On => On error_append_string => no value => no value error_log => no value => no value error_prepend_string => no value => no value error_reporting => 6135 => 6135 expose_php => Off => Off extension_dir => /usr/local/lib/php/extensions/no-debug-non-zts-20060613/ => /usr/local/lib/php/extensions/no-debug-non-zts-20060613/ file_uploads => On => On highlight.bg => <font style="color: #FFFFFF">#FFFFFF</font> => <font style="color: #FFFFFF">#FFFFFF</font> highlight.comment => <font style="color: #FF8000">#FF8000</font> => <font style="color: #FF8000">#FF8000</font> highlight.default => <font style="color: #0000BB">#0000BB</font> => <font style="color: #0000BB">#0000BB</font> highlight.html => <font style="color: #000000">#000000</font> => <font style="color: #000000">#000000</font> highlight.keyword => <font style="color: #007700">#007700</font> => <font style="color: #007700">#007700</font> highlight.string => <font style="color: #DD0000">#DD0000</font> => <font style="color: #DD0000">#DD0000</font> html_errors => Off => Off ignore_repeated_errors => Off => Off ignore_repeated_source => Off => Off ignore_user_abort => Off => Off implicit_flush => On => On include_path => .:/php/includes:/usr/local/lib/php => .:/php/includes:/usr/local/lib/php log_errors => On => On log_errors_max_len => 1024 => 1024 magic_quotes_gpc => Off => Off magic_quotes_runtime => Off => Off magic_quotes_sybase => Off => Off mail.force_extra_parameters => no value => no value max_execution_time => 0 => 0 max_input_nesting_level => 64 => 64 max_input_time => -1 => -1 memory_limit => 10M => 10M open_basedir => no value => no value output_buffering => 0 => 0 output_handler => no value => no value post_max_size => 10M => 10M precision => 14 => 14 realpath_cache_size => 16K => 16K realpath_cache_ttl => 120 => 120 register_argc_argv => On => On register_globals => Off => Off register_long_arrays => Off => Off report_memleaks => On => On report_zend_debug => Off => Off safe_mode => Off => Off safe_mode_exec_dir => no value => no value safe_mode_gid => Off => Off safe_mode_include_dir => no value => no value sendmail_from => no value => no value sendmail_path => /usr/sbin/sendmail -t -i => /usr/sbin/sendmail -t -i serialize_precision => 100 => 100 short_open_tag => Off => Off SMTP => localhost => localhost smtp_port => 25 => 25 sql.safe_mode => Off => Off track_errors => Off => Off unserialize_callback_func => no value => no value upload_max_filesize => 5M => 5M upload_tmp_dir => no value => no value user_dir => no value => no value variables_order => GPCS => GPCS xmlrpc_error_number => 0 => 0 xmlrpc_errors => Off => Off y2k_compliance => On => On zend.ze1_compatibility_mode => Off => Off apc APC Support => enabled Version => 3.0.12p2 MMAP Support => Enabled MMAP File Mask => /tmp/apc.84KfGr Revision => $Revision: 3.104 $ Build Date => Feb 23 2007 15:08:52 Directive => Local Value => Master Value apc.cache_by_default => On => On apc.enable_cli => On => On apc.enabled => On => On apc.file_update_protection => 2 => 2 apc.filters => no value => no value apc.gc_ttl => 3600 => 3600 apc.include_once_override => Off => Off apc.max_file_size => 1M => 1M apc.mmap_file_mask => /tmp/apc.84KfGr => /tmp/apc.84KfGr apc.num_files_hint => 1024 => 1024 apc.optimization => Off => Off apc.report_autofilter => Off => Off apc.shm_segments => 1 => 1 apc.shm_size => 80 => 80 apc.slam_defense => 0 => 0 apc.stat => On => On apc.ttl => 7200 => 7200 apc.user_entries_hint => 100 => 100 apc.user_ttl => 7200 => 7200 apc.write_lock => On => On ctype ctype functions => enabled curl cURL support => enabled cURL Information => libcurl/7.15.0 OpenSSL/0.9.7a zlib/1.1.4 date date/time support => enabled "Olson" Timezone Database Version => 2007.9 Timezone Database => internal Default timezone => America/Denver Directive => Local Value => Master Value date.default_latitude => 31.7667 => 31.7667 date.default_longitude => 35.2333 => 35.2333 date.sunrise_zenith => 90.583333 => 90.583333 date.sunset_zenith => 90.583333 => 90.583333 date.timezone => no value => no value dom DOM/XML => enabled DOM/XML API Version => 20031129 libxml Version => 2.6.20 HTML Support => enabled XPath Support => enabled XPointer Support => enabled Schema Support => enabled RelaxNG Support => enabled gd GD Support => enabled GD Version => bundled (2.0.34 compatible) FreeType Support => enabled FreeType Linkage => with freetype FreeType Version => 2.1.3 GIF Read Support => enabled GIF Create Support => enabled PNG Support => enabled WBMP Support => enabled XBM Support => enabled hash hash support => enabled Hashing Engines => md2 md4 md5 sha1 sha256 sha384 sha512 ripemd128 ripemd160 ripemd256 ripemd320 whirlpool tiger128,3 tiger160,3 tiger192,3 tiger128,4 tiger160,4 tiger192,4 snefru gost adler32 crc32 crc32b haval128,3 haval160,3 haval192,3 haval224,3 haval256,3 haval128,4 haval160,4 haval192,4 haval224,4 haval256,4 haval128,5 haval160,5 haval192,5 haval224,5 haval256,5 iconv iconv support => enabled iconv implementation => glibc iconv library version => 2.3.2 Directive => Local Value => Master Value iconv.input_encoding => ISO-8859-1 => ISO-8859-1 iconv.internal_encoding => ISO-8859-1 => ISO-8859-1 iconv.output_encoding => ISO-8859-1 => ISO-8859-1 json json support => enabled json version => 1.2.1 libxml libXML support => active libXML Version => 2.6.20 libXML streams => enabled mbstring Multibyte Support => enabled Multibyte string engine => libmbfl HTTP input encoding translation => enabled Multibyte (japanese) regex support => enabled Multibyte regex (oniguruma) version => 4.4.4 Multibyte regex (oniguruma) backtrack check => On mbstring extension makes use of "streamable kanji code filter and converter", which is distributed under the GNU Lesser General Public License version 2.1. Directive => Local Value => Master Value mbstring.detect_order => auto => auto mbstring.encoding_translation => On => On mbstring.func_overload => 0 => 0 mbstring.http_input => auto => auto mbstring.http_output => UTF-8 => UTF-8 mbstring.internal_encoding => UTF-8 => UTF-8 mbstring.language => Neutral => Neutral mbstring.strict_detection => Off => Off mbstring.substitute_character => no value => no value openssl OpenSSL support => enabled OpenSSL Version => OpenSSL 0.9.7a Feb 19 2003 pcre PCRE (Perl Compatible Regular Expressions) Support => enabled PCRE Library Version => 7.3 2007-08-28 Directive => Local Value => Master Value pcre.backtrack_limit => 100000 => 100000 pcre.recursion_limit => 100000 => 100000 pgsql PostgreSQL Support => enabled PostgreSQL(libpq) Version => 8.1.2 Multibyte character support => enabled SSL support => enabled Active Persistent Links => 0 Active Links => 0 Directive => Local Value => Master Value pgsql.allow_persistent => On => On pgsql.auto_reset_persistent => Off => Off pgsql.ignore_notice => Off => Off pgsql.log_notice => Off => Off pgsql.max_links => Unlimited => Unlimited pgsql.max_persistent => Unlimited => Unlimited posix Revision => $Revision: 1.70.2.3.2.16 $ session Session Support => enabled Registered save handlers => files user Registered serializer handlers => php php_binary Directive => Local Value => Master Value session.auto_start => Off => Off session.bug_compat_42 => Off => Off session.bug_compat_warn => On => On session.cache_expire => 180 => 180 session.cache_limiter => nocache => nocache session.cookie_domain => no value => no value session.cookie_httponly => Off => Off session.cookie_lifetime => 0 => 0 session.cookie_path => / => / session.cookie_secure => Off => Off session.entropy_file => no value => no value session.entropy_length => 0 => 0 session.gc_divisor => 1000 => 1000 session.gc_maxlifetime => 1440 => 1440 session.gc_probability => 1 => 1 session.hash_bits_per_character => 5 => 5 session.hash_function => 0 => 0 session.name => SEID => SEID session.referer_check => no value => no value session.save_handler => files => files session.save_path => no value => no value session.serialize_handler => php => php session.use_cookies => On => On session.use_only_cookies => Off => Off session.use_trans_sid => 0 => 0 SPL SPL support => enabled Interfaces => Countable, OuterIterator, RecursiveIterator, SeekableIterator, SplObserver, SplSubject Classes => AppendIterator, ArrayIterator, ArrayObject, BadFunctionCallException, BadMethodCallException, CachingIterator, DirectoryIterator, DomainException, EmptyIterator, FilterIterator, InfiniteIterator, InvalidArgumentException, IteratorIterator, LengthException, LimitIterator, LogicException, NoRewindIterator, OutOfBoundsException, OutOfRangeException, OverflowException, ParentIterator, RangeException, RecursiveArrayIterator, RecursiveCachingIterator, RecursiveDirectoryIterator, RecursiveFilterIterator, RecursiveIteratorIterator, RecursiveRegexIterator, RegexIterator, RuntimeException, SplFileInfo, SplFileObject, SplObjectStorage, SplTempFileObject, UnderflowException, UnexpectedValueException standard Regex Library => Bundled library enabled Dynamic Library Support => enabled Path to sendmail => /usr/sbin/sendmail -t -i Directive => Local Value => Master Value assert.active => 1 => 1 assert.bail => 0 => 0 assert.callback => no value => no value assert.quiet_eval => 0 => 0 assert.warning => 1 => 1 auto_detect_line_endings => 0 => 0 default_socket_timeout => 60 => 60 safe_mode_allowed_env_vars => PHP_ => PHP_ safe_mode_protected_env_vars => LD_LIBRARY_PATH => LD_LIBRARY_PATH url_rewriter.tags => a=href,area=href,frame=src,input=src,form=fakeentry => a=href,area=href,frame=src,input=src,form=fakeentry user_agent => no value => no value tokenizer Tokenizer Support => enabled xml XML Support => active XML Namespace Support => active libxml2 Version => 2.6.20 xmlreader XMLReader => enabled xmlwriter XMLWriter => enabled zlib ZLib Support => enabled Stream Wrapper support => compress.zlib:// Stream Filter support => zlib.inflate, zlib.deflate Compiled Version => 1.1.4 Linked Version => 1.1.4 Directive => Local Value => Master Value zlib.output_compression => Off => Off zlib.output_compression_level => -1 => -1 zlib.output_handler => no value => no value Additional Modules Module Name Environment Variable => Value MANPATH => /usr/local/postgres-8.2.3/man: HOSTNAME => jonah.prod.phx1.secureserver.net TEST_PHP_SRCDIR => /usr/local/src/php-5.2.5 TERM => xterm SHELL => /bin/sh HISTSIZE => 1000 MAKEFLAGS => SSH_CLIENT => deleted SSH_TTY => deleted USER => rob LS_COLORS => no=00:fi=00:di=00;34:ln=00;36:pi=40;33:so=00;35:bd=40;33;01:cd=40;33;01:or=01;05;37;41:mi=01;05;37;41:ex=00;32:*.cmd=00;32:*.exe=00;32:*.com=00;32:*.btm=00;32:*.bat=00;32:*.sh=00;32:*.csh=00;32:*.tar=00;31:*.tgz=00;31:*.arj=00;31:*.taz=00;31:*.lzh=00;31:*.zip=00;31:*.z=00;31:*.Z=00;31:*.gz=00;31:*.bz2=00;31:*.bz=00;31:*.tz=00;31:*.rpm=00;31:*.cpio=00;31:*.jpg=00;35:*.gif=00;35:*.bmp=00;35:*.xbm=00;35:*.xpm=00;35:*.png=00;35:*.tif=00;35: SSH_AUTH_SOCK => deleted MAKELEVEL => 1 MFLAGS => PATH => /usr/local/postgres-8.2.3/bin:/usr/local/bin:/bin:/usr/bin:/usr/X11R6/bin:/home/rob/bin MAIL => /var/spool/mail/rob _ => /usr/local/src/php-5.2.5/sapi/cli/php PWD => /usr/local/src/php-5.2.5 INPUTRC => /etc/inputrc LANG => C TEST_PHP_EXECUTABLE => /usr/local/src/php-5.2.5/sapi/cli/php HOME => /root SHLVL => 4 CFLAGS => -I/usr/include -O3 -msse -mmmx -funroll-loops -mfpmath=sse -prefer-non-pic LOGNAME => rob SSH_CONNECTION => deleted LESSOPEN => |/usr/bin/lesspipe.sh %s CC => gcc G_BROKEN_FILENAMES => 1 PHP Variables Variable => Value _SERVER["MANPATH"] => /usr/local/postgres-8.2.3/man: _SERVER["HOSTNAME"] => jonah.prod.phx1.secureserver.net _SERVER["TEST_PHP_SRCDIR"] => /usr/local/src/php-5.2.5 _SERVER["TERM"] => xterm _SERVER["SHELL"] => /bin/sh _SERVER["HISTSIZE"] => 1000 _SERVER["MAKEFLAGS"] => _SERVER["SSH_CLIENT"] => deleted _SERVER["SSH_TTY"] => deleted _SERVER["USER"] => rob _SERVER["LS_COLORS"] => no=00:fi=00:di=00;34:ln=00;36:pi=40;33:so=00;35:bd=40;33;01:cd=40;33;01:or=01;05;37;41:mi=01;05;37;41:ex=00;32:*.cmd=00;32:*.exe=00;32:*.com=00;32:*.btm=00;32:*.bat=00;32:*.sh=00;32:*.csh=00;32:*.tar=00;31:*.tgz=00;31:*.arj=00;31:*.taz=00;31:*.lzh=00;31:*.zip=00;31:*.z=00;31:*.Z=00;31:*.gz=00;31:*.bz2=00;31:*.bz=00;31:*.tz=00;31:*.rpm=00;31:*.cpio=00;31:*.jpg=00;35:*.gif=00;35:*.bmp=00;35:*.xbm=00;35:*.xpm=00;35:*.png=00;35:*.tif=00;35: _SERVER["SSH_AUTH_SOCK"] => deleted _SERVER["MAKELEVEL"] => 1 _SERVER["MFLAGS"] => _SERVER["PATH"] => /usr/local/postgres-8.2.3/bin:/usr/local/bin:/bin:/usr/bin:/usr/X11R6/bin:/home/rob/bin _SERVER["MAIL"] => /var/spool/mail/rob _SERVER["_"] => /usr/local/src/php-5.2.5/sapi/cli/php _SERVER["PWD"] => /usr/local/src/php-5.2.5 _SERVER["INPUTRC"] => /etc/inputrc _SERVER["LANG"] => C _SERVER["TEST_PHP_EXECUTABLE"] => /usr/local/src/php-5.2.5/sapi/cli/php _SERVER["HOME"] => /root _SERVER["SHLVL"] => 4 _SERVER["CFLAGS"] => -I/usr/include -O3 -msse -mmmx -funroll-loops -mfpmath=sse -prefer-non-pic _SERVER["LOGNAME"] => rob _SERVER["SSH_CONNECTION"] => deleted _SERVER["LESSOPEN"] => |/usr/bin/lesspipe.sh %s _SERVER["CC"] => gcc _SERVER["G_BROKEN_FILENAMES"] => 1 _SERVER["PHP_SELF"] => _SERVER["SCRIPT_NAME"] => _SERVER["SCRIPT_FILENAME"] => _SERVER["PATH_TRANSLATED"] => _SERVER["DOCUMENT_ROOT"] => _SERVER["REQUEST_TIME"] => 1202018333 _SERVER["argv"] => Array ( ) _SERVER["argc"] => 0 PHP License This program is free software; you can redistribute it and/or modify it under the terms of the PHP License as published by the PHP Group and included in the distribution in the file: LICENSE This program is distributed in the hope that it will be useful, but WITHOUT ANY WARRANTY; without even the implied warranty of MERCHANTABILITY or FITNESS FOR A PARTICULAR PURPOSE. If you did not receive a copy of the PHP license, or have any questions about PHP licensing, please contact license@php.net.

« previous php.qa (#62598) next »