Test results for 5.2.5 [failed]
| From: | noreply@php.net | Date: | Sun, 03 Feb 2008 11:58:13 +0000 |
| Subject: | Test results for 5.2.5 [failed] | ||
| Groups: | php.qa | ||
| Request: | Send a blank email to php-qa+get-62626@lists.php.net to get a copy of this message | ||
=====================================================================
FAILED TEST SUMMARY
---------------------------------------------------------------------
date OO cloning [ext/date/tests/oo_002.phpt]
Test fileperms(), chmod() functions: error conditions [ext/standard/tests/file/006_error.phpt]
Test fileperms() & chmod() functions: usage variation - misc. perms
[ext/standard/tests/file/006_variation2.phpt]
Test readlink() and realpath functions: basic functionality - diff. path notation for links(Bug
#42038) [ext/standard/tests/file/readlink_realpath_basic1.phpt]
Test readlink() and realpath() functions: usage variation - linkname/filename stored in object(Bug
#42038) [ext/standard/tests/file/readlink_realpath_variation1.phpt]
Test readlink() and realpath() functions: usage variation - linkname/filename stored in array(Bug
#42038) [ext/standard/tests/file/readlink_realpath_variation2.phpt]
proc_open [ext/standard/tests/general_functions/proc_open02.phpt]
Bug #20134 (UDP reads from invalid ports) [ext/standard/tests/network/bug20134.phpt]
money_format test [ext/standard/tests/strings/moneyformat.phpt]
Test setlocale() function : basic functionality - setting system locale to a specific
[ext/standard/tests/strings/setlocale_basic1.phpt]
Test setlocale() function : basic functionality - set locale using an array
[ext/standard/tests/strings/setlocale_basic2.phpt]
Test setlocale() function : basic functionality - passing multiple locales as argument
[ext/standard/tests/strings/setlocale_basic3.phpt]
Test setlocale() function : usage variations - passing multiple valid/invlaid locales as argument
[ext/standard/tests/strings/setlocale_variation1.phpt]
Test setlocale() function : usage variations - Setting all available locales in the platform
[ext/standard/tests/strings/setlocale_variation2.phpt]
Test setlocale() function : usage variations - setting system locale = 0
[ext/standard/tests/strings/setlocale_variation3.phpt]
Test setlocale() function : usage variations - setting system locale as null
[ext/standard/tests/strings/setlocale_variation4.phpt]
Test setlocale() function : usage variations - Setting system locale as empty string
[ext/standard/tests/strings/setlocale_variation5.phpt]
=====================================================================
=====================================================================
TEST RESULT SUMMARY
---------------------------------------------------------------------
Exts skipped : 57
Exts tested : 22
---------------------------------------------------------------------
Number of tests : 4566 3073
Tests skipped : 1493 ( 32.7%) --------
Tests warned : 0 ( 0.0%) ( 0.0%)
Tests failed : 17 ( 0.4%) ( 0.6%)
Tests passed : 3056 ( 66.9%) ( 99.4%)
---------------------------------------------------------------------
Time taken : 465 seconds
=====================================================================
=====================================================================
FAILED TEST SUMMARY
---------------------------------------------------------------------
date OO cloning [ext/date/tests/oo_002.phpt]
Test fileperms(), chmod() functions: error conditions [ext/standard/tests/file/006_error.phpt]
Test fileperms() & chmod() functions: usage variation - misc. perms
[ext/standard/tests/file/006_variation2.phpt]
Test readlink() and realpath functions: basic functionality - diff. path notation for links(Bug
#42038) [ext/standard/tests/file/readlink_realpath_basic1.phpt]
Test readlink() and realpath() functions: usage variation - linkname/filename stored in object(Bug
#42038) [ext/standard/tests/file/readlink_realpath_variation1.phpt]
Test readlink() and realpath() functions: usage variation - linkname/filename stored in array(Bug
#42038) [ext/standard/tests/file/readlink_realpath_variation2.phpt]
proc_open [ext/standard/tests/general_functions/proc_open02.phpt]
Bug #20134 (UDP reads from invalid ports) [ext/standard/tests/network/bug20134.phpt]
money_format test [ext/standard/tests/strings/moneyformat.phpt]
Test setlocale() function : basic functionality - setting system locale to a specific
[ext/standard/tests/strings/setlocale_basic1.phpt]
Test setlocale() function : basic functionality - set locale using an array
[ext/standard/tests/strings/setlocale_basic2.phpt]
Test setlocale() function : basic functionality - passing multiple locales as argument
[ext/standard/tests/strings/setlocale_basic3.phpt]
Test setlocale() function : usage variations - passing multiple valid/invlaid locales as argument
[ext/standard/tests/strings/setlocale_variation1.phpt]
Test setlocale() function : usage variations - Setting all available locales in the platform
[ext/standard/tests/strings/setlocale_variation2.phpt]
Test setlocale() function : usage variations - setting system locale = 0
[ext/standard/tests/strings/setlocale_variation3.phpt]
Test setlocale() function : usage variations - setting system locale as null
[ext/standard/tests/strings/setlocale_variation4.phpt]
Test setlocale() function : usage variations - Setting system locale as empty string
[ext/standard/tests/strings/setlocale_variation5.phpt]
=====================================================================
================================================================================
/home/u70614/src/php-5.2.5/ext/date/tests/oo_002.phpt
================================================================================
string(29) "Fri, 01 Aug 08 13:00:00 +0000"
string(29) "Fri, 01 Aug 08 13:00:00 +0000"
string(29) "Fri, 01 Aug 08 14:00:00 +0000"
string(29) "Fri, 01 Aug 08 12:59:59 +0000"
string(10) "Asia/Tokyo"
string(10) "Asia/Tokyo"
================================================================================
001+ string(29) "Fri, 01 Aug 08 13:00:00 +0000"
002+ string(29) "Fri, 01 Aug 08 13:00:00 +0000"
003+ string(29) "Fri, 01 Aug 08 14:00:00 +0000"
004+ string(29) "Fri, 01 Aug 08 12:59:59 +0000"
001- string(29) "Wed, 01 Aug 07 13:00:00 +0000"
002- string(29) "Wed, 01 Aug 07 13:00:00 +0000"
003- string(29) "Wed, 01 Aug 07 14:00:00 +0000"
004- string(29) "Wed, 01 Aug 07 12:59:59 +0000"
================================================================================
================================================================================
/home/u70614/src/php-5.2.5/ext/standard/tests/file/006_error.phpt
================================================================================
*** Testing error conditions for fileperms(), chmod() ***
Warning: chmod(): Operation not permitted in
/home/u70614/src/php-5.2.5/ext/standard/tests/file/006_error.php on line 14
bool(false)
100644
Warning: chmod(): Operation not permitted in
/home/u70614/src/php-5.2.5/ext/standard/tests/file/006_error.php on line 19
bool(false)
40751
Warning: chmod(): No such file or directory in
/home/u70614/src/php-5.2.5/ext/standard/tests/file/006_error.php on line 25
bool(false)
Warning: fileperms(): stat failed for /no/such/file/dir in
/home/u70614/src/php-5.2.5/ext/standard/tests/file/006_error.php on line 26
bool(false)
Warning: Wrong parameter count for chmod() in
/home/u70614/src/php-5.2.5/ext/standard/tests/file/006_error.php on line 32
NULL
Warning: Wrong parameter count for chmod() in
/home/u70614/src/php-5.2.5/ext/standard/tests/file/006_error.php on line 33
NULL
Warning: Wrong parameter count for chmod() in
/home/u70614/src/php-5.2.5/ext/standard/tests/file/006_error.php on line 34
NULL
Warning: Wrong parameter count for fileperms() in
/home/u70614/src/php-5.2.5/ext/standard/tests/file/006_error.php on line 35
NULL
Warning: Wrong parameter count for chmod() in
/home/u70614/src/php-5.2.5/ext/standard/tests/file/006_error.php on line 38
NULL
Warning: Wrong parameter count for fileperms() in
/home/u70614/src/php-5.2.5/ext/standard/tests/file/006_error.php on line 39
NULL
Warning: Wrong parameter count for fileperms() in
/home/u70614/src/php-5.2.5/ext/standard/tests/file/006_error.php on line 40
NULL
*** Done ***
================================================================================
009+ 40751
009- 40755
================================================================================
================================================================================
/home/u70614/src/php-5.2.5/ext/standard/tests/file/006_variation2.phpt
================================================================================
*** Testing fileperms() & chmod() : usage variations ***
*** Testing fileperms(), chmod() with miscellaneous permissions ***
-- Iteration 1 --
Warning: chmod(): Inappropriate file type or format in
/home/u70614/src/php-5.2.5/ext/standard/tests/file/006_variation2.php on line 51
bool(false)
100644
Warning: chmod(): Operation not permitted in
/home/u70614/src/php-5.2.5/ext/standard/tests/file/006_variation2.php on line 56
bool(false)
40755
-- Iteration 2 --
bool(true)
100000
bool(true)
40000
-- Iteration 3 --
Warning: chmod(): Inappropriate file type or format in
/home/u70614/src/php-5.2.5/ext/standard/tests/file/006_variation2.php on line 51
bool(false)
100000
bool(true)
41000
-- Iteration 4 --
Warning: chmod(): Inappropriate file type or format in
/home/u70614/src/php-5.2.5/ext/standard/tests/file/006_variation2.php on line 51
bool(false)
100000
bool(true)
41111
-- Iteration 5 --
Warning: chmod(): Inappropriate file type or format in
/home/u70614/src/php-5.2.5/ext/standard/tests/file/006_variation2.php on line 51
bool(false)
100000
Warning: chmod(): Operation not permitted in
/home/u70614/src/php-5.2.5/ext/standard/tests/file/006_variation2.php on line 56
bool(false)
41111
-- Iteration 6 --
bool(true)
100001
bool(true)
40001
-- Iteration 7 --
Warning: chmod(): Inappropriate file type or format in
/home/u70614/src/php-5.2.5/ext/standard/tests/file/006_variation2.php on line 51
bool(false)
100001
bool(true)
41411
-- Iteration 8 --
Warning: chmod(): Inappropriate file type or format in
/home/u70614/src/php-5.2.5/ext/standard/tests/file/006_variation2.php on line 51
bool(false)
100001
Warning: chmod(): Operation not permitted in
/home/u70614/src/php-5.2.5/ext/standard/tests/file/006_variation2.php on line 56
bool(false)
41411
-- Iteration 9 --
bool(true)
100637
bool(true)
40637
-- Iteration 10 --
Warning: chmod(): Inappropriate file type or format in
/home/u70614/src/php-5.2.5/ext/standard/tests/file/006_variation2.php on line 51
bool(false)
100637
Warning: chmod(): Operation not permitted in
/home/u70614/src/php-5.2.5/ext/standard/tests/file/006_variation2.php on line 56
bool(false)
40637
-- Iteration 11 --
Warning: chmod(): Inappropriate file type or format in
/home/u70614/src/php-5.2.5/ext/standard/tests/file/006_variation2.php on line 51
bool(false)
100637
Warning: chmod(): Operation not permitted in
/home/u70614/src/php-5.2.5/ext/standard/tests/file/006_variation2.php on line 56
bool(false)
40637
-- Iteration 12 --
bool(true)
100000
bool(true)
40000
-- Iteration 13 --
bool(true)
100000
bool(true)
40000
-- Iteration 14 --
bool(true)
100000
bool(true)
40000
-- Iteration 15 --
bool(true)
100000
bool(true)
40000
*** Done ***
================================================================================
005+
006+ Warning: chmod(): Inappropriate file type or format in
/home/u70614/src/php-5.2.5/ext/standard/tests/file/006_variation2.php on line 51
007+ bool(false)
008+ 100644
009+
010+ Warning: chmod(): Operation not permitted in
/home/u70614/src/php-5.2.5/ext/standard/tests/file/006_variation2.php on line 56
011+ bool(false)
012+ 40755
005- bool(true)
006- 107777
007- bool(true)
008- 47777
016- 101000
017- bool(true)
019+
020+ Warning: chmod(): Inappropriate file type or format in
/home/u70614/src/php-5.2.5/ext/standard/tests/file/006_variation2.php on line 51
021+ bool(false)
022+ 100000
021- 101111
022- bool(true)
025- bool(true)
026- 107001
027- bool(true)
028- 47001
026+
027+ Warning: chmod(): Inappropriate file type or format in
/home/u70614/src/php-5.2.5/ext/standard/tests/file/006_variation2.php on line 51
028+ bool(false)
029+ 100000
033+
034+ Warning: chmod(): Inappropriate file type or format in
/home/u70614/src/php-5.2.5/ext/standard/tests/file/006_variation2.php on line 51
035+ bool(false)
036+ 100000
037+
038+ Warning: chmod(): Operation not permitted in
/home/u70614/src/php-5.2.5/ext/standard/tests/file/006_variation2.php on line 56
039+ bool(false)
040+ 41111
036- 101411
037- bool(true)
040- bool(true)
041- 107141
042- bool(true)
043- 47141
047+
048+ Warning: chmod(): Inappropriate file type or format in
/home/u70614/src/php-5.2.5/ext/standard/tests/file/006_variation2.php on line 51
049+ bool(false)
050+ 100001
050- bool(true)
051- 103567
053- 43567
054- -- Iteration 11 --
054+
055+ Warning: chmod(): Inappropriate file type or format in
/home/u70614/src/php-5.2.5/ext/standard/tests/file/006_variation2.php on line 51
056+ bool(false)
057+ 100001
058+
059+ Warning: chmod(): Operation not permitted in
/home/u70614/src/php-5.2.5/ext/standard/tests/file/006_variation2.php on line 56
060+ bool(false)
061+ 41411
056- 103567
057- bool(true)
068+
069+ Warning: chmod(): Inappropriate file type or format in
/home/u70614/src/php-5.2.5/ext/standard/tests/file/006_variation2.php on line 51
070+ bool(false)
071+ 100637
072+
073+ Warning: chmod(): Operation not permitted in
/home/u70614/src/php-5.2.5/ext/standard/tests/file/006_variation2.php on line 56
074+ bool(false)
075+ 40637
076+ -- Iteration 11 --
077+
078+ Warning: chmod(): Inappropriate file type or format in
/home/u70614/src/php-5.2.5/ext/standard/tests/file/006_variation2.php on line 51
079+ bool(false)
080+ 100637
081+
082+ Warning: chmod(): Operation not permitted in
/home/u70614/src/php-5.2.5/ext/standard/tests/file/006_variation2.php on line 56
083+ bool(false)
084+ 40637
085+ -- Iteration 12 --
087+ 100000
088+ bool(true)
089+ 40000
090+ -- Iteration 13 --
091+ bool(true)
092+ 100000
093+ bool(true)
094+ 40000
095+ -- Iteration 14 --
096+ bool(true)
097+ 100000
098+ bool(true)
099+ 40000
100+ -- Iteration 15 --
101+ bool(true)
102+ 100000
104+ 40000
105+ *** Done ***
058- 43567
059- -- Iteration 12 --
060- bool(true)
061- 100000
062- bool(true)
063- 40000
064- -- Iteration 13 --
065- bool(true)
066- 100000
067- bool(true)
068- 40000
069- -- Iteration 14 --
070- bool(true)
071- 100000
072- bool(true)
073- 40000
074- -- Iteration 15 --
075- bool(true)
076- 100000
077- bool(true)
078- 40000
079- *** Done ***
================================================================================
================================================================================
/home/u70614/src/php-5.2.5/ext/standard/tests/file/readlink_realpath_basic1.phpt
================================================================================
*** Testing readlink() and realpath(): with valid and invalid path ***
-- Iteration 1 --
string(109)
"/home/u70614/src/php-5.2.5/ext/standard/tests/file/readlink_realpath_basic1/home/readlink_realpath_basic1.tmp"
string(114)
"/home/u70614/src/php-5.2.5/ext/standard/tests/file/readlink_realpath_basic1/home/readlink_realpath_basic1_link.tmp"
-- Iteration 2 --
string(114)
"/home/u70614/src/php-5.2.5/ext/standard/tests/file/readlink_realpath_basic1/home/test/readlink_realpath_basic1.tmp"
string(119)
"/home/u70614/src/php-5.2.5/ext/standard/tests/file/readlink_realpath_basic1/home/test/readlink_realpath_basic1_link.tmp"
-- Iteration 3 --
string(114)
"/home/u70614/src/php-5.2.5/ext/standard/tests/file/readlink_realpath_basic1/home/test/readlink_realpath_basic1.tmp"
string(114)
"/home/u70614/src/php-5.2.5/ext/standard/tests/file/readlink_realpath_basic1/home/test/readlink_realpath_basic1.tmp"
-- Iteration 4 --
string(109)
"/home/u70614/src/php-5.2.5/ext/standard/tests/file/readlink_realpath_basic1/home/readlink_realpath_basic1.tmp"
string(114)
"/home/u70614/src/php-5.2.5/ext/standard/tests/file/readlink_realpath_basic1/home/readlink_realpath_basic1_link.tmp"
-- Iteration 5 --
Warning: readlink(): No such file or directory in
/home/u70614/src/php-5.2.5/ext/standard/tests/file/readlink_realpath_basic1.php on line 48
bool(false)
bool(false)
-- Iteration 6 --
Warning: readlink(): No such file or directory in
/home/u70614/src/php-5.2.5/ext/standard/tests/file/readlink_realpath_basic1.php on line 48
bool(false)
bool(false)
-- Iteration 7 --
Warning: readlink(): No such file or directory in
/home/u70614/src/php-5.2.5/ext/standard/tests/file/readlink_realpath_basic1.php on line 48
bool(false)
string(111)
"/home/u70614/src/php-5.2.5/ext/standard/tests/file/readlink_realpath_basic1/..readlink_realpath_basic1_link.tmp"
-- Iteration 8 --
Warning: readlink(): Invalid argument in
/home/u70614/src/php-5.2.5/ext/standard/tests/file/readlink_realpath_basic1.php on line 48
bool(false)
string(114)
"/home/u70614/src/php-5.2.5/ext/standard/tests/file/readlink_realpath_basic1/home/test/readlink_realpath_basic1.tmp"
Done
================================================================================
005+ string(114)
"/home/u70614/src/php-5.2.5/ext/standard/tests/file/readlink_realpath_basic1/home/readlink_realpath_basic1_link.tmp"
005- string(%d) "%s/readlink_realpath_basic1/home/readlink_realpath_basic1.tmp"
009+ string(119)
"/home/u70614/src/php-5.2.5/ext/standard/tests/file/readlink_realpath_basic1/home/test/readlink_realpath_basic1_link.tmp"
009- string(%d) "%s/readlink_realpath_basic1/home/test/readlink_realpath_basic1.tmp"
017+ string(114)
"/home/u70614/src/php-5.2.5/ext/standard/tests/file/readlink_realpath_basic1/home/readlink_realpath_basic1_link.tmp"
017- string(%d) "%s/readlink_realpath_basic1/home/readlink_realpath_basic1.tmp"
================================================================================
================================================================================
/home/u70614/src/php-5.2.5/ext/standard/tests/file/readlink_realpath_variation1.phpt
================================================================================
*** Testing readlink() and realpath() : usage variations ***
*** Testing readlink() and realpath() with linkname stored inside a object ***
-- Testing readlink() and realpath() with softlink, linkname stored inside an object --
bool(true)
string(128)
"/home/u70614/src/php-5.2.5/ext/standard/tests/file/readlink_realpath_variation1/home/tests/link/readlink_realpath_variation1.tmp"
string(122)
"/home/u70614/src/php-5.2.5/ext/standard/tests/file/readlink_realpath_variation1/home/readlink_realpath_variation1_link.tmp"
bool(true)
string(128)
"/home/u70614/src/php-5.2.5/ext/standard/tests/file/readlink_realpath_variation1/home/tests/link/readlink_realpath_variation1.tmp"
string(88)
"/home/u70614/src/php-5.2.5/ext/standard/tests/file/readlink_realpath_variation1_link.tmp"
-- Testing readlink() and realpath() with hardlink, linkname stored inside an object --
bool(true)
Warning: readlink(): Invalid argument in
/home/u70614/src/php-5.2.5/ext/standard/tests/file/readlink_realpath_variation1.php on line 45
bool(false)
string(122)
"/home/u70614/src/php-5.2.5/ext/standard/tests/file/readlink_realpath_variation1/home/readlink_realpath_variation1_link.tmp"
bool(true)
Warning: readlink(): Invalid argument in
/home/u70614/src/php-5.2.5/ext/standard/tests/file/readlink_realpath_variation1.php on line 48
bool(false)
string(88)
"/home/u70614/src/php-5.2.5/ext/standard/tests/file/readlink_realpath_variation1_link.tmp"
Done
================================================================================
008+ string(122)
"/home/u70614/src/php-5.2.5/ext/standard/tests/file/readlink_realpath_variation1/home/readlink_realpath_variation1_link.tmp"
008- string(%d)
"%s/readlink_realpath_variation1/home/tests/link/readlink_realpath_variation1.tmp"
011+ string(88)
"/home/u70614/src/php-5.2.5/ext/standard/tests/file/readlink_realpath_variation1_link.tmp"
011- string(%d)
"%s/readlink_realpath_variation1/home/tests/link/readlink_realpath_variation1.tmp"
================================================================================
================================================================================
/home/u70614/src/php-5.2.5/ext/standard/tests/file/readlink_realpath_variation2.phpt
================================================================================
*** Testing readlink() and realpath() : usage variations ***
*** Testing readlink() and realpath() with linkname stored in an array ***
-- Testing readlink() and realpath() with softlink, linkname stored inside an array --
bool(true)
string(128)
"/home/u70614/src/php-5.2.5/ext/standard/tests/file/readlink_realpath_variation2/home/tests/link/readlink_realpath_variation2.tmp"
string(133)
"/home/u70614/src/php-5.2.5/ext/standard/tests/file/readlink_realpath_variation2/home/tests/link/readlink_realpath_variation2_link.tmp"
Warning: symlink(): No such file or directory in
/home/u70614/src/php-5.2.5/ext/standard/tests/file/readlink_realpath_variation2.php on line 29
bool(false)
Warning: readlink(): No such file or directory in
/home/u70614/src/php-5.2.5/ext/standard/tests/file/readlink_realpath_variation2.php on line 30
bool(false)
bool(false)
Warning:
unlink(/home/u70614/src/php-5.2.5/ext/standard/tests/file/./readlink_realpath_variation2/home/../home//tests//..//..//..//home//readlink_realpath_variation2_link.tmp/):
No such file or directory in
/home/u70614/src/php-5.2.5/ext/standard/tests/file/readlink_realpath_variation2.php on line 35
-- Testing readlink() and realpath() with hardlink, linkname stored inside an array --
bool(true)
Warning: readlink(): Invalid argument in
/home/u70614/src/php-5.2.5/ext/standard/tests/file/readlink_realpath_variation2.php on line 40
bool(false)
string(133)
"/home/u70614/src/php-5.2.5/ext/standard/tests/file/readlink_realpath_variation2/home/tests/link/readlink_realpath_variation2_link.tmp"
Warning: link(): No such file or directory in
/home/u70614/src/php-5.2.5/ext/standard/tests/file/readlink_realpath_variation2.php on line 42
bool(false)
Warning: readlink(): No such file or directory in
/home/u70614/src/php-5.2.5/ext/standard/tests/file/readlink_realpath_variation2.php on line 43
bool(false)
bool(false)
Warning:
unlink(/home/u70614/src/php-5.2.5/ext/standard/tests/file/./readlink_realpath_variation2/home/../home//tests//..//..//..//home//readlink_realpath_variation2_link.tmp/):
No such file or directory in
/home/u70614/src/php-5.2.5/ext/standard/tests/file/readlink_realpath_variation2.php on line 48
Done
================================================================================
008+ string(133)
"/home/u70614/src/php-5.2.5/ext/standard/tests/file/readlink_realpath_variation2/home/tests/link/readlink_realpath_variation2_link.tmp"
008- string(%d)
"%s/readlink_realpath_variation2/home/tests/link/readlink_realpath_variation2.tmp"
================================================================================
================================================================================
/home/u70614/src/php-5.2.5/ext/standard/tests/general_functions/proc_open02.phpt
================================================================================
bool(true)
array(8) {
["command"]=>
string(28) "/usr/bin/nohup /bin/sleep 50"
["pid"]=>
int(34910)
["running"]=>
bool(false)
["signaled"]=>
bool(true)
["stopped"]=>
bool(false)
["exitcode"]=>
int(-1)
["termsig"]=>
int(1)
["stopsig"]=>
int(0)
}
bool(false)
array(8) {
["command"]=>
string(28) "/usr/bin/nohup /bin/sleep 50"
["pid"]=>
int(34910)
["running"]=>
bool(false)
["signaled"]=>
bool(false)
["stopped"]=>
bool(false)
["exitcode"]=>
int(-1)
["termsig"]=>
int(0)
["stopsig"]=>
int(0)
}
Done!
================================================================================
008+ bool(false)
009+ ["signaled"]=>
009- ["signaled"]=>
010- bool(false)
016+ int(1)
016- int(0)
020+ bool(false)
020- bool(true)
029+ bool(false)
029- bool(true)
035+ int(0)
035- int(15)
================================================================================
================================================================================
/home/u70614/src/php-5.2.5/ext/standard/tests/network/bug20134.phpt
================================================================================
int(1)
** ERROR: process timed out **
================================================================================
002+
002- string(0) ""
003+ ** ERROR: process timed out **
================================================================================
================================================================================
/home/u70614/src/php-5.2.5/ext/standard/tests/strings/moneyformat.phpt
================================================================================
string(6) "X3.14Y"
Warning: money_format(): Only a single %i or %n token can be used in
/home/u70614/src/php-5.2.5/ext/standard/tests/strings/moneyformat.php on line 4
bool(false)
================================================================================
001+ string(6) "X3.14Y"
001- string(7) "X$3.14Y"
================================================================================
================================================================================
/home/u70614/src/php-5.2.5/ext/standard/tests/strings/setlocale_basic1.phpt
================================================================================
*** Testing setlocale() : basic functionality - set to a specific locale ***
Setting system locale(LC_ALL) to Checking currency settings in the new locale, expected: EUR, Found:
Test FAILED.
Done
================================================================================
003+ Test FAILED.
003- string(%d) %s
004- Checking currency settings in the new locale, expected: %s, Found: %s
005- Test PASSED.
================================================================================
================================================================================
/home/u70614/src/php-5.2.5/ext/standard/tests/strings/setlocale_basic2.phpt
================================================================================
*** Testing setlocale() with an array containing list of locales ***
-- Testing setlocale() : 'category' argument as LC_ALL & 'locale' argument
as an array --
Test FAILED.
Done
================================================================================
003+ Test FAILED.
003- string(%d) "%s"
004- Checking currency settings in the new locale, expected: %s, Found: %s
005- Test PASSED.
================================================================================
================================================================================
/home/u70614/src/php-5.2.5/ext/standard/tests/strings/setlocale_basic3.phpt
================================================================================
*** Testing setlocale() by passing multiple locales as argument ***
Done
================================================================================
002- -- Testing setlocale() by giving 'category' as LC_ALL & multiple
locales(en_US.utf8, Ko_KR.utf8, zh_CN.utf8) --
003- string(%d) "%s"
004- Checking currency settings in the new locale, expected: %s, Found: %s
005- Test PASSED.
================================================================================
================================================================================
/home/u70614/src/php-5.2.5/ext/standard/tests/strings/setlocale_variation1.phpt
================================================================================
*** Testing setlocale() by passing multiple valid/invalid locales as argument ***
Done
================================================================================
002- -- Testing setlocale() by giving 'category' as LC_ALL & multiple
locales(en_US.invalid, en_US.utf8, Ko_KR.utf8, KO_KR.invalid, zh_CN.utf8) --
003- string(%d) "%s"
004- Checking currency settings in the new locale, expected: %s, Found: %s
005- Test PASSED.
================================================================================
================================================================================
/home/u70614/src/php-5.2.5/ext/standard/tests/strings/setlocale_variation2.phpt
================================================================================
*** Testing setlocale() : usage variations ***
-- Test setlocale() with all available locale in the system --
No of locales found on the machine = 157
No of setlocale() success = 152
Expected no of failures = 0
Test FAILED
Names of locale() for which setlocale() failed ...
array(5) {
[0]=>
string(15) "la_LN.ISO8859-1"
[1]=>
string(16) "la_LN.ISO8859-15"
[2]=>
string(15) "la_LN.ISO8859-2"
[3]=>
string(15) "la_LN.ISO8859-4"
[4]=>
string(14) "la_LN.US-ASCII"
}
Done
================================================================================
006+ Test FAILED
007+ Names of locale() for which setlocale() failed ...
006- Test PASSED
007- Done
008+ array(5) {
009+ [0]=>
010+ string(15) "la_LN.ISO8859-1"
011+ [1]=>
012+ string(16) "la_LN.ISO8859-15"
013+ [2]=>
014+ string(15) "la_LN.ISO8859-2"
015+ [3]=>
016+ string(15) "la_LN.ISO8859-4"
017+ [4]=>
018+ string(14) "la_LN.US-ASCII"
019+ }
020+ Done
================================================================================
================================================================================
/home/u70614/src/php-5.2.5/ext/standard/tests/strings/setlocale_variation3.phpt
================================================================================
*** Testing setlocale() : usage variations - setting system locale = 0 ***
Locale info, before setting the locale
array(18) {
["decimal_point"]=>
string(1) "."
["thousands_sep"]=>
string(0) ""
["int_curr_symbol"]=>
string(0) ""
["currency_symbol"]=>
string(0) ""
["mon_decimal_point"]=>
string(0) ""
["mon_thousands_sep"]=>
string(0) ""
["positive_sign"]=>
string(0) ""
["negative_sign"]=>
string(0) ""
["int_frac_digits"]=>
int(127)
["frac_digits"]=>
int(127)
["p_cs_precedes"]=>
int(127)
["p_sep_by_space"]=>
int(127)
["n_cs_precedes"]=>
int(127)
["n_sep_by_space"]=>
int(127)
["p_sign_posn"]=>
int(127)
["n_sign_posn"]=>
int(127)
["grouping"]=>
array(1) {
[0]=>
int(127)
}
["mon_grouping"]=>
array(1) {
[0]=>
int(127)
}
}
Setting system locale, category = LC_ALL and locale = 0
Locale info, after setting the locale
array(18) {
["decimal_point"]=>
string(1) "."
["thousands_sep"]=>
string(0) ""
["int_curr_symbol"]=>
string(0) ""
["currency_symbol"]=>
string(0) ""
["mon_decimal_point"]=>
string(0) ""
["mon_thousands_sep"]=>
string(0) ""
["positive_sign"]=>
string(0) ""
["negative_sign"]=>
string(0) ""
["int_frac_digits"]=>
int(127)
["frac_digits"]=>
int(127)
["p_cs_precedes"]=>
int(127)
["p_sep_by_space"]=>
int(127)
["n_cs_precedes"]=>
int(127)
["n_sep_by_space"]=>
int(127)
["p_sign_posn"]=>
int(127)
["n_sign_posn"]=>
int(127)
["grouping"]=>
array(1) {
[0]=>
int(127)
}
["mon_grouping"]=>
array(1) {
[0]=>
int(127)
}
}
Checking locale in the system, Expected : no change in the existing locale
Test PASSED.
Done
================================================================================
007+ string(0) ""
007- string(1) ","
009+ string(0) ""
009- string(4) "USD "
011+ string(0) ""
011- string(1) "$"
013+ string(0) ""
013- string(1) "."
015+ string(0) ""
015- string(1) ","
019+ string(0) ""
019- string(1) "-"
021+ int(127)
021- int(2)
023+ int(127)
023- int(2)
025+ int(127)
025- int(1)
027+ int(127)
027- int(0)
029+ int(127)
029- int(1)
031+ int(127)
031- int(0)
033+ int(127)
033- int(1)
035+ int(127)
035- int(1)
037+ array(1) {
037- array(2) {
039+ int(127)
039- int(3)
040- [1]=>
041- int(3)
042+ array(1) {
044+ int(127)
044- array(2) {
046- int(3)
047- [1]=>
048- int(3)
053+ string(0) ""
055+ string(0) ""
057+ string(0) ""
057- string(1) ","
059+ string(0) ""
059- string(4) "USD "
061+ string(0) ""
061- string(1) "$"
063- string(1) "."
065+ string(0) ""
065- string(1) ","
067+ int(127)
069+ int(127)
069- string(1) "-"
071+ int(127)
071- int(2)
073+ int(127)
073- int(2)
075+ int(127)
075- int(1)
077+ int(127)
077- int(0)
079+ int(127)
079- int(1)
081+ int(127)
081- int(0)
083+ array(1) {
083- int(1)
085+ int(127)
085- int(1)
087- array(2) {
088+ array(1) {
089- int(3)
090- [1]=>
091- int(3)
090+ int(127)
094- array(2) {
096- int(3)
097- [1]=>
098- int(3)
================================================================================
================================================================================
/home/u70614/src/php-5.2.5/ext/standard/tests/strings/setlocale_variation4.phpt
================================================================================
*** Testing setlocale() : usage variations - Setting system locale = null ***
Locale info, before setting the locale
array(18) {
["decimal_point"]=>
string(1) "."
["thousands_sep"]=>
string(0) ""
["int_curr_symbol"]=>
string(0) ""
["currency_symbol"]=>
string(0) ""
["mon_decimal_point"]=>
string(0) ""
["mon_thousands_sep"]=>
string(0) ""
["positive_sign"]=>
string(0) ""
["negative_sign"]=>
string(0) ""
["int_frac_digits"]=>
int(127)
["frac_digits"]=>
int(127)
["p_cs_precedes"]=>
int(127)
["p_sep_by_space"]=>
int(127)
["n_cs_precedes"]=>
int(127)
["n_sep_by_space"]=>
int(127)
["p_sign_posn"]=>
int(127)
["n_sign_posn"]=>
int(127)
["grouping"]=>
array(1) {
[0]=>
int(127)
}
["mon_grouping"]=>
array(1) {
[0]=>
int(127)
}
}
Setting system locale, category = LC_ALL and locale = null
Locale info, after setting the locale
array(18) {
["decimal_point"]=>
string(1) "."
["thousands_sep"]=>
string(0) ""
["int_curr_symbol"]=>
string(0) ""
["currency_symbol"]=>
string(0) ""
["mon_decimal_point"]=>
string(0) ""
["mon_thousands_sep"]=>
string(0) ""
["positive_sign"]=>
string(0) ""
["negative_sign"]=>
string(0) ""
["int_frac_digits"]=>
int(127)
["frac_digits"]=>
int(127)
["p_cs_precedes"]=>
int(127)
["p_sep_by_space"]=>
int(127)
["n_cs_precedes"]=>
int(127)
["n_sep_by_space"]=>
int(127)
["p_sign_posn"]=>
int(127)
["n_sign_posn"]=>
int(127)
["grouping"]=>
array(1) {
[0]=>
int(127)
}
["mon_grouping"]=>
array(1) {
[0]=>
int(127)
}
}
Checking new locale in the system, Expected : the locale names will be set from the values of
environment variables
Test FAILED.
Done
================================================================================
007+ string(0) ""
007- string(1) ","
009+ string(0) ""
009- string(4) "AUD "
011+ string(0) ""
011- string(1) "$"
013+ string(0) ""
013- string(1) "."
015+ string(0) ""
015- string(1) ","
019+ string(0) ""
019- string(1) "-"
021+ int(127)
021- int(2)
023+ int(127)
023- int(2)
025+ int(127)
025- int(1)
027+ int(127)
027- int(0)
029+ int(127)
029- int(1)
031+ int(127)
031- int(0)
033+ int(127)
033- int(1)
035+ int(127)
035- int(1)
037+ array(1) {
037- array(2) {
039+ int(127)
039- int(3)
040- [1]=>
041- int(3)
042+ array(1) {
044+ int(127)
044- array(2) {
046- int(3)
047- [1]=>
048- int(3)
053+ string(0) ""
055+ string(0) ""
057+ string(0) ""
057- string(1) ","
059+ string(0) ""
059- string(4) "USD "
061+ string(0) ""
061- string(1) "$"
063- string(1) "."
065+ string(0) ""
065- string(1) ","
067+ int(127)
069+ int(127)
069- string(1) "-"
071+ int(127)
071- int(2)
073+ int(127)
073- int(2)
075+ int(127)
075- int(1)
077+ int(127)
077- int(0)
079+ int(127)
079- int(1)
081+ int(127)
081- int(0)
083+ array(1) {
083- int(1)
085+ int(127)
085- int(1)
087- array(2) {
088+ array(1) {
089- int(3)
090- [1]=>
091- int(3)
090+ int(127)
094+ Test FAILED.
094- array(2) {
096- int(3)
097- [1]=>
098- int(3)
102- Test PASSED.
================================================================================
================================================================================
/home/u70614/src/php-5.2.5/ext/standard/tests/strings/setlocale_variation5.phpt
================================================================================
*** Testing setlocale() : usage variations - setting system locale = "" ***
Locale info, before setting the locale
array(18) {
["decimal_point"]=>
string(1) "."
["thousands_sep"]=>
string(0) ""
["int_curr_symbol"]=>
string(0) ""
["currency_symbol"]=>
string(0) ""
["mon_decimal_point"]=>
string(0) ""
["mon_thousands_sep"]=>
string(0) ""
["positive_sign"]=>
string(0) ""
["negative_sign"]=>
string(0) ""
["int_frac_digits"]=>
int(127)
["frac_digits"]=>
int(127)
["p_cs_precedes"]=>
int(127)
["p_sep_by_space"]=>
int(127)
["n_cs_precedes"]=>
int(127)
["n_sep_by_space"]=>
int(127)
["p_sign_posn"]=>
int(127)
["n_sign_posn"]=>
int(127)
["grouping"]=>
array(1) {
[0]=>
int(127)
}
["mon_grouping"]=>
array(1) {
[0]=>
int(127)
}
}
Setting system locale, category = LC_ALL and locale = ""
Locale info, after setting the locale
array(18) {
["decimal_point"]=>
string(1) "."
["thousands_sep"]=>
string(0) ""
["int_curr_symbol"]=>
string(0) ""
["currency_symbol"]=>
string(0) ""
["mon_decimal_point"]=>
string(0) ""
["mon_thousands_sep"]=>
string(0) ""
["positive_sign"]=>
string(0) ""
["negative_sign"]=>
string(0) ""
["int_frac_digits"]=>
int(127)
["frac_digits"]=>
int(127)
["p_cs_precedes"]=>
int(127)
["p_sep_by_space"]=>
int(127)
["n_cs_precedes"]=>
int(127)
["n_sep_by_space"]=>
int(127)
["p_sign_posn"]=>
int(127)
["n_sign_posn"]=>
int(127)
["grouping"]=>
array(1) {
[0]=>
int(127)
}
["mon_grouping"]=>
array(1) {
[0]=>
int(127)
}
}
Checking new locale in the system, Expected : the locale names will be set from the values of
environment variables
Test FAILED.
Done
================================================================================
007+ string(0) ""
007- string(1) ","
009+ string(0) ""
009- string(4) "AUD "
011+ string(0) ""
011- string(1) "$"
013+ string(0) ""
013- string(1) "."
015+ string(0) ""
015- string(1) ","
019+ string(0) ""
019- string(1) "-"
021+ int(127)
021- int(2)
023+ int(127)
023- int(2)
025+ int(127)
025- int(1)
027+ int(127)
027- int(0)
029+ int(127)
029- int(1)
031+ int(127)
031- int(0)
033+ int(127)
033- int(1)
035+ int(127)
035- int(1)
037+ array(1) {
037- array(2) {
039+ int(127)
039- int(3)
040- [1]=>
041- int(3)
042+ array(1) {
044+ int(127)
044- array(2) {
046- int(3)
047- [1]=>
048- int(3)
053+ string(0) ""
055+ string(0) ""
057+ string(0) ""
057- string(1) ","
059+ string(0) ""
059- string(4) "USD "
061+ string(0) ""
061- string(1) "$"
063- string(1) "."
065+ string(0) ""
065- string(1) ","
067+ int(127)
069+ int(127)
069- string(1) "-"
071+ int(127)
071- int(2)
073+ int(127)
073- int(2)
075+ int(127)
075- int(1)
077+ int(127)
077- int(0)
079+ int(127)
079- int(1)
081+ int(127)
081- int(0)
083+ array(1) {
083- int(1)
085+ int(127)
085- int(1)
087- array(2) {
088+ array(1) {
089- int(3)
090- [1]=>
091- int(3)
090+ int(127)
094+ Test FAILED.
094- array(2) {
096- int(3)
097- [1]=>
098- int(3)
102- Test PASSED.
================================================================================
================================================================================
BUILD ENVIRONMENT
================================================================================
OS:
FreeBSD - FreeBSD be32.masterhost.ru 6.2-RELEASE-p1 FreeBSD 6.2-RELEASE-p1 #0: Wed Feb 14 17:32:18
MSK 2007 root@beX6-i386.masterhost.ru:/usr/src/sys/i386/compile/server6 i386
Autoconf:
Bundled Libtool:
ltmain.sh (GNU libtool) 1.5.20 (1.1220.2.287 2005/08/31 18:54:15)
Copyright (C) 2005 Free Software Foundation, Inc.
This is free software; see the source for copying conditions. There is NO
warranty; not even for MERCHANTABILITY or FITNESS FOR A PARTICULAR PURPOSE.
System Libtool:
ltmain.sh (GNU libtool) 1.5.22 (1.1220.2.365 2005/12/18 22:14:06)
Copyright (C) 2005 Free Software Foundation, Inc.
This is free software; see the source for copying conditions. There is NO
warranty; not even for MERCHANTABILITY or FITNESS FOR A PARTICULAR PURPOSE.
Compiler:
Using built-in specs.
Configured with: FreeBSD/i386 system compiler
Thread model: posix
gcc version 3.4.6 [FreeBSD] 20060305
Bison:
bison (GNU Bison) 1.75
á×ÔÏÒÙ: òÏÂÅÒÔ ëÏÒÂÅÔ É òÉÞÁÒÄ óÔÏÌÍÅÎ.
Copyright (C) 2002 Free Software Foundation, Inc.
üÔÏ Ó×ÏÂÏÄÎÁÑ ÐÒÏÇÒÁÍÍÁ; ÕÓÌÏ×ÉÑ ÒÁÓÐÒÏÓÔÒÁÎÅÎÉÑ
ÓÍÏÔÒÉÔÅ × ÉÓÈÏÄÎÙÈ ÔÅËÓÔÁÈ.
îéëáëéè ÇÁÒÁÎÔÉÊ ÎÅ ÐÒÅÄÏÓÔÁ×ÌÑÅÔÓÑ, ÄÁÖÅ ÇÁÒÁÎÔÉÉ
ðïìåúîïóôé ÉÌÉ ðòéçïäîïóôé
äìñ ïðòåäåìåîîïê ãåìé.
Libraries:
/home/u70614/src/php-5.2.5/sapi/cli/php:
libcrypt.so.3 => /lib/libcrypt.so.3 (0x10384000)
libm.so.4 => /lib/libm.so.4 (0x1039c000)
libz.so.3 => /lib/libz.so.3 (0x103b2000)
libxml2.so.5 => /usr/local/lib/libxml2.so.5 (0x103c3000)
libiconv.so.3 => /usr/local/lib/libiconv.so.3 (0x104ce000)
libc.so.6 => /lib/libc.so.6 (0x105bb000)
User's E-mail: andrew dot semin at gmail dot com
================================================================================
PHPINFO
================================================================================
phpinfo()
PHP Version => 5.2.5
System => FreeBSD be32.masterhost.ru 6.2-RELEASE-p1 FreeBSD 6.2-RELEASE-p1 #0: Wed Feb 14
17:32:18 MSK 2007 root@beX6-i386.masterhost.ru:/usr/src/sys/i386/compile/server6 i386
Build Date => Feb 3 2008 14:36:10
Configure Command => './configure'
Server API => Command Line Interface
Virtual Directory Support => disabled
Configuration File (php.ini) Path => /usr/local/lib
Loaded Configuration File => (none)
PHP API => 20041225
PHP Extension => 20060613
Zend Extension => 220060519
Debug Build => no
Thread Safety => disabled
Zend Memory Manager => enabled
IPv6 Support => enabled
Registered PHP Streams => php, file, data, http, ftp
Registered Stream Socket Transports => tcp, udp, unix, udg
Registered Stream Filters => string.rot13, string.toupper, string.tolower, string.strip_tags,
convert.*, consumed, convert.iconv.*
This program makes use of the Zend Scripting Language Engine:
Zend Engine v2.2.0, Copyright (c) 1998-2007 Zend Technologies
_______________________________________________________________________
Configuration
PHP Core
Directive => Local Value => Master Value
allow_call_time_pass_reference => On => On
allow_url_fopen => On => On
allow_url_include => Off => Off
always_populate_raw_post_data => Off => Off
arg_separator.input => & => &
arg_separator.output => & => &
asp_tags => Off => Off
auto_append_file => no value => no value
auto_globals_jit => On => On
auto_prepend_file => no value => no value
browscap => no value => no value
default_charset => no value => no value
default_mimetype => text/html => text/html
define_syslog_variables => Off => Off
disable_classes => no value => no value
disable_functions => no value => no value
display_errors => STDOUT => STDOUT
display_startup_errors => Off => Off
doc_root => no value => no value
docref_ext => no value => no value
docref_root => no value => no value
enable_dl => On => On
error_append_string => no value => no value
error_log => no value => no value
error_prepend_string => no value => no value
error_reporting => no value => no value
expose_php => On => On
extension_dir => /usr/local/lib/php/extensions/no-debug-non-zts-20060613 =>
/usr/local/lib/php/extensions/no-debug-non-zts-20060613
file_uploads => On => On
highlight.bg => <font style="color: #FFFFFF">#FFFFFF</font> => <font
style="color: #FFFFFF">#FFFFFF</font>
highlight.comment => <font style="color: #FF8000">#FF8000</font> =>
<font style="color: #FF8000">#FF8000</font>
highlight.default => <font style="color: #0000BB">#0000BB</font> =>
<font style="color: #0000BB">#0000BB</font>
highlight.html => <font style="color: #000000">#000000</font> =>
<font style="color: #000000">#000000</font>
highlight.keyword => <font style="color: #007700">#007700</font> =>
<font style="color: #007700">#007700</font>
highlight.string => <font style="color: #DD0000">#DD0000</font> =>
<font style="color: #DD0000">#DD0000</font>
html_errors => Off => Off
ignore_repeated_errors => Off => Off
ignore_repeated_source => Off => Off
ignore_user_abort => Off => Off
implicit_flush => On => On
include_path => .:/usr/local/lib/php => .:/usr/local/lib/php
log_errors => Off => Off
log_errors_max_len => 1024 => 1024
magic_quotes_gpc => On => On
magic_quotes_runtime => Off => Off
magic_quotes_sybase => Off => Off
mail.force_extra_parameters => no value => no value
max_execution_time => 0 => 0
max_input_nesting_level => 64 => 64
max_input_time => -1 => -1
memory_limit => 128M => 128M
open_basedir => no value => no value
output_buffering => 0 => 0
output_handler => no value => no value
post_max_size => 8M => 8M
precision => 14 => 14
realpath_cache_size => 16K => 16K
realpath_cache_ttl => 120 => 120
register_argc_argv => On => On
register_globals => Off => Off
register_long_arrays => On => On
report_memleaks => On => On
report_zend_debug => Off => Off
safe_mode => Off => Off
safe_mode_exec_dir => /usr/local/php/bin => /usr/local/php/bin
safe_mode_gid => Off => Off
safe_mode_include_dir => no value => no value
sendmail_from => no value => no value
sendmail_path => /usr/sbin/sendmail -t -i => /usr/sbin/sendmail -t -i
serialize_precision => 100 => 100
short_open_tag => On => On
SMTP => localhost => localhost
smtp_port => 25 => 25
sql.safe_mode => Off => Off
track_errors => Off => Off
unserialize_callback_func => no value => no value
upload_max_filesize => 2M => 2M
upload_tmp_dir => no value => no value
user_dir => no value => no value
variables_order => EGPCS => EGPCS
xmlrpc_error_number => 0 => 0
xmlrpc_errors => Off => Off
y2k_compliance => On => On
zend.ze1_compatibility_mode => Off => Off
ctype
ctype functions => enabled
date
date/time support => enabled
"Olson" Timezone Database Version => 2007.9
Timezone Database => internal
Default timezone => Europe/Moscow
Directive => Local Value => Master Value
date.default_latitude => 31.7667 => 31.7667
date.default_longitude => 35.2333 => 35.2333
date.sunrise_zenith => 90.583333 => 90.583333
date.sunset_zenith => 90.583333 => 90.583333
date.timezone => no value => no value
dom
DOM/XML => enabled
DOM/XML API Version => 20031129
libxml Version => 2.6.26
HTML Support => enabled
XPath Support => enabled
XPointer Support => enabled
Schema Support => enabled
RelaxNG Support => enabled
filter
Input Validation and Filtering => enabled
Revision => $Revision: 1.52.2.39 $
Directive => Local Value => Master Value
filter.default => unsafe_raw => unsafe_raw
filter.default_flags => no value => no value
hash
hash support => enabled
Hashing Engines => md2 md4 md5 sha1 sha256 sha384 sha512 ripemd128 ripemd160 ripemd256 ripemd320
whirlpool tiger128,3 tiger160,3 tiger192,3 tiger128,4 tiger160,4 tiger192,4 snefru gost adler32
crc32 crc32b haval128,3 haval160,3 haval192,3 haval224,3 haval256,3 haval128,4 haval160,4 haval192,4
haval224,4 haval256,4 haval128,5 haval160,5 haval192,5 haval224,5 haval256,5
iconv
iconv support => enabled
iconv implementation => libiconv
iconv library version => 1.9
Directive => Local Value => Master Value
iconv.input_encoding => ISO-8859-1 => ISO-8859-1
iconv.internal_encoding => ISO-8859-1 => ISO-8859-1
iconv.output_encoding => ISO-8859-1 => ISO-8859-1
json
json support => enabled
json version => 1.2.1
libxml
libXML support => active
libXML Version => 2.6.26
libXML streams => enabled
pcre
PCRE (Perl Compatible Regular Expressions) Support => enabled
PCRE Library Version => 7.3 2007-08-28
Directive => Local Value => Master Value
pcre.backtrack_limit => 100000 => 100000
pcre.recursion_limit => 100000 => 100000
PDO
PDO support => enabled
PDO drivers => sqlite2, sqlite
pdo_sqlite
PDO Driver for SQLite 3.x => enabled
PECL Module version => (bundled) 1.0.1 $Id: pdo_sqlite.c,v 1.10.2.6.2.2 2007/03/23 14:30:00 wez
Exp $
SQLite Library => 3.3.17
posix
Revision => $Revision: 1.70.2.3.2.16 $
Reflection
Reflection => enabled
Version => $Id: php_reflection.c,v 1.164.2.33.2.47 2007/10/28 13:47:14 iliaa Exp $
session
Session Support => enabled
Registered save handlers => files user sqlite
Registered serializer handlers => php php_binary
Directive => Local Value => Master Value
session.auto_start => Off => Off
session.bug_compat_42 => On => On
session.bug_compat_warn => On => On
session.cache_expire => 180 => 180
session.cache_limiter => nocache => nocache
session.cookie_domain => no value => no value
session.cookie_httponly => Off => Off
session.cookie_lifetime => 0 => 0
session.cookie_path => / => /
session.cookie_secure => Off => Off
session.entropy_file => no value => no value
session.entropy_length => 0 => 0
session.gc_divisor => 100 => 100
session.gc_maxlifetime => 1440 => 1440
session.gc_probability => 1 => 1
session.hash_bits_per_character => 4 => 4
session.hash_function => 0 => 0
session.name => PHPSESSID => PHPSESSID
session.referer_check => no value => no value
session.save_handler => files => files
session.save_path => no value => no value
session.serialize_handler => php => php
session.use_cookies => On => On
session.use_only_cookies => Off => Off
session.use_trans_sid => 0 => 0
SimpleXML
Simplexml support => enabled
Revision => $Revision: 1.151.2.22.2.35 $
Schema support => enabled
SPL
SPL support => enabled
Interfaces => Countable, OuterIterator, RecursiveIterator, SeekableIterator, SplObserver,
SplSubject
Classes => AppendIterator, ArrayIterator, ArrayObject, BadFunctionCallException,
BadMethodCallException, CachingIterator, DirectoryIterator, DomainException, EmptyIterator,
FilterIterator, InfiniteIterator, InvalidArgumentException, IteratorIterator, LengthException,
LimitIterator, LogicException, NoRewindIterator, OutOfBoundsException, OutOfRangeException,
OverflowException, ParentIterator, RangeException, RecursiveArrayIterator, RecursiveCachingIterator,
RecursiveDirectoryIterator, RecursiveFilterIterator, RecursiveIteratorIterator,
RecursiveRegexIterator, RegexIterator, RuntimeException, SimpleXMLIterator, SplFileInfo,
SplFileObject, SplObjectStorage, SplTempFileObject, UnderflowException, UnexpectedValueException
SQLite
SQLite support => enabled
PECL Module version => 2.0-dev $Id: sqlite.c,v 1.166.2.13.2.9 2007/05/19 17:58:22 iliaa Exp $
SQLite Library => 2.8.17
SQLite Encoding => iso8859
Directive => Local Value => Master Value
sqlite.assoc_case => 0 => 0
standard
Regex Library => Bundled library enabled
Dynamic Library Support => enabled
Path to sendmail => /usr/sbin/sendmail -t -i
Directive => Local Value => Master Value
assert.active => 1 => 1
assert.bail => 0 => 0
assert.callback => no value => no value
assert.quiet_eval => 0 => 0
assert.warning => 1 => 1
auto_detect_line_endings => 0 => 0
default_socket_timeout => 60 => 60
safe_mode_allowed_env_vars => PHP_ => PHP_
safe_mode_protected_env_vars => LD_LIBRARY_PATH => LD_LIBRARY_PATH
url_rewriter.tags => a=href,area=href,frame=src,form=,fieldset= =>
a=href,area=href,frame=src,form=,fieldset=
user_agent => no value => no value
tokenizer
Tokenizer Support => enabled
xml
XML Support => active
XML Namespace Support => active
libxml2 Version => 2.6.26
xmlreader
XMLReader => enabled
xmlwriter
XMLWriter => enabled
Additional Modules
Module Name
Environment
Variable => Value
SSH_CLIENT => deleted
USER => u70614
LC_TIME => C
MAIL => /var/mail/u70614
SHLVL => 1
HOME => /home/u70614
OLDPWD => /home/u70614/src
TEST_PHP_SRCDIR => /home/u70614/src/php-5.2.5
SSH_TTY => deleted
PAGER => less
MM_CHARSET => KOI8-R
LOGNAME => u70614
_ => /usr/bin/make
TEST_PHP_EXECUTABLE => /home/u70614/src/php-5.2.5/sapi/cli/php
TERM => vt100
BLOCKSIZE => K
PATH => /bin:/usr/bin:/usr/local/bin:/sbin:/usr/sbin:/usr/local/sbin:/home/u70614/bin
LANG => ru_RU.KOI8-R
HISTSIZE => 1024
SSH_AUTH_SOCK => deleted
SHELL => /usr/local/bin/bash
__MKLVL__ => 1
PWD => /home/u70614/src/php-5.2.5
SSH_CONNECTION => deleted
FTP_PASSIVE_MODE => YES
CC => gcc
EDITOR => vi
PHP Variables
Variable => Value
_SERVER["SSH_CLIENT"] => deleted
_SERVER["USER"] => u70614
_SERVER["LC_TIME"] => C
_SERVER["MAIL"] => /var/mail/u70614
_SERVER["SHLVL"] => 1
_SERVER["HOME"] => /home/u70614
_SERVER["OLDPWD"] => /home/u70614/src
_SERVER["TEST_PHP_SRCDIR"] => /home/u70614/src/php-5.2.5
_SERVER["SSH_TTY"] => deleted
_SERVER["PAGER"] => less
_SERVER["MM_CHARSET"] => KOI8-R
_SERVER["LOGNAME"] => u70614
_SERVER["_"] => /usr/bin/make
_SERVER["TEST_PHP_EXECUTABLE"] => /home/u70614/src/php-5.2.5/sapi/cli/php
_SERVER["TERM"] => vt100
_SERVER["BLOCKSIZE"] => K
_SERVER["PATH"] =>
/bin:/usr/bin:/usr/local/bin:/sbin:/usr/sbin:/usr/local/sbin:/home/u70614/bin
_SERVER["LANG"] => ru_RU.KOI8-R
_SERVER["HISTSIZE"] => 1024
_SERVER["SSH_AUTH_SOCK"] => deleted
_SERVER["SHELL"] => /usr/local/bin/bash
_SERVER["__MKLVL__"] => 1
_SERVER["PWD"] => /home/u70614/src/php-5.2.5
_SERVER["SSH_CONNECTION"] => deleted
_SERVER["FTP_PASSIVE_MODE"] => YES
_SERVER["CC"] => gcc
_SERVER["EDITOR"] => vi
_SERVER["PHP_SELF"] =>
_SERVER["SCRIPT_NAME"] =>
_SERVER["SCRIPT_FILENAME"] =>
_SERVER["PATH_TRANSLATED"] =>
_SERVER["DOCUMENT_ROOT"] =>
_SERVER["REQUEST_TIME"] => 1202039890
_SERVER["argv"] => Array
(
)
_SERVER["argc"] => 0
_ENV["SSH_CLIENT"] => deleted
_ENV["USER"] => u70614
_ENV["LC_TIME"] => C
_ENV["MAIL"] => /var/mail/u70614
_ENV["SHLVL"] => 1
_ENV["HOME"] => /home/u70614
_ENV["OLDPWD"] => /home/u70614/src
_ENV["TEST_PHP_SRCDIR"] => /home/u70614/src/php-5.2.5
_ENV["SSH_TTY"] => deleted
_ENV["PAGER"] => less
_ENV["MM_CHARSET"] => KOI8-R
_ENV["LOGNAME"] => u70614
_ENV["_"] => /usr/bin/make
_ENV["TEST_PHP_EXECUTABLE"] => /home/u70614/src/php-5.2.5/sapi/cli/php
_ENV["TERM"] => vt100
_ENV["BLOCKSIZE"] => K
_ENV["PATH"] =>
/bin:/usr/bin:/usr/local/bin:/sbin:/usr/sbin:/usr/local/sbin:/home/u70614/bin
_ENV["LANG"] => ru_RU.KOI8-R
_ENV["HISTSIZE"] => 1024
_ENV["SSH_AUTH_SOCK"] => deleted
_ENV["SHELL"] => /usr/local/bin/bash
_ENV["__MKLVL__"] => 1
_ENV["PWD"] => /home/u70614/src/php-5.2.5
_ENV["SSH_CONNECTION"] => deleted
_ENV["FTP_PASSIVE_MODE"] => YES
_ENV["CC"] => gcc
_ENV["EDITOR"] => vi
PHP License
This program is free software; you can redistribute it and/or modify
it under the terms of the PHP License as published by the PHP Group
and included in the distribution in the file: LICENSE
This program is distributed in the hope that it will be useful,
but WITHOUT ANY WARRANTY; without even the implied warranty of
MERCHANTABILITY or FITNESS FOR A PARTICULAR PURPOSE.
If you did not receive a copy of the PHP license, or have any
questions about PHP licensing, please contact license@php.net.