Test results for 5.2.5 [failed]

From: Date: Mon, 04 Feb 2008 23:29:26 +0000
Subject: Test results for 5.2.5 [failed]
Groups: php.qa 
Request: Send a blank email to php-qa+get-62823@lists.php.net to get a copy of this message
===================================================================== FAILED TEST SUMMARY --------------------------------------------------------------------- Bug #33532 (Different output for strftime() and date()) [ext/date/tests/bug33532.phpt] date_default_timezone_get() function [1] [ext/date/tests/date_default_timezone_get-1.phpt] date_default_timezone_get() function [2] [ext/date/tests/date_default_timezone_get-2.phpt] date_default_timezone_set() function [1] [ext/date/tests/date_default_timezone_set-1.phpt] date OO cloning [ext/date/tests/oo_002.phpt] openssl_csr_new() tests [ext/openssl/tests/004.phpt] Bug #36732 (add support for req_extensions in openss_csr_new and sign) [ext/openssl/tests/bug36732.phpt] Localized match [ext/pcre/tests/locales.phpt] Sort with SORT_LOCALE_STRING [ext/standard/tests/array/locale_sort.phpt] proc_open [ext/standard/tests/general_functions/proc_open02.phpt] Test variations in usage of acos() [ext/standard/tests/math/acos_variation.phpt] Test variations in usage of asin() [ext/standard/tests/math/asin_variation.phpt] Bug #25665 (var_dump () hangs on Nan and INF) [ext/standard/tests/math/bug25665.phpt] money_format test [ext/standard/tests/strings/moneyformat.phpt] Test setlocale() function : basic functionality - setting system locale to a specific [ext/standard/tests/strings/setlocale_basic1.phpt] Test setlocale() function : basic functionality - set locale using an array [ext/standard/tests/strings/setlocale_basic2.phpt] Test setlocale() function : basic functionality - passing multiple locales as argument [ext/standard/tests/strings/setlocale_basic3.phpt] Test setlocale() function : usage variations - passing multiple valid/invlaid locales as argument [ext/standard/tests/strings/setlocale_variation1.phpt] Test setlocale() function : usage variations - setting system locale = 0 [ext/standard/tests/strings/setlocale_variation3.phpt] Test setlocale() function : usage variations - setting system locale as null [ext/standard/tests/strings/setlocale_variation4.phpt] Test setlocale() function : usage variations - Setting system locale as empty string [ext/standard/tests/strings/setlocale_variation5.phpt] ===================================================================== ===================================================================== TEST RESULT SUMMARY --------------------------------------------------------------------- Exts skipped : 63 Exts tested : 16 --------------------------------------------------------------------- Number of tests : 4466 2829 Tests skipped : 1637 ( 36.7%) -------- Tests warned : 0 ( 0.0%) ( 0.0%) Tests failed : 21 ( 0.5%) ( 0.7%) Tests passed : 2808 ( 62.9%) ( 99.3%) --------------------------------------------------------------------- Time taken : 347 seconds ===================================================================== ===================================================================== FAILED TEST SUMMARY --------------------------------------------------------------------- Bug #33532 (Different output for strftime() and date()) [ext/date/tests/bug33532.phpt] date_default_timezone_get() function [1] [ext/date/tests/date_default_timezone_get-1.phpt] date_default_timezone_get() function [2] [ext/date/tests/date_default_timezone_get-2.phpt] date_default_timezone_set() function [1] [ext/date/tests/date_default_timezone_set-1.phpt] date OO cloning [ext/date/tests/oo_002.phpt] openssl_csr_new() tests [ext/openssl/tests/004.phpt] Bug #36732 (add support for req_extensions in openss_csr_new and sign) [ext/openssl/tests/bug36732.phpt] Localized match [ext/pcre/tests/locales.phpt] Sort with SORT_LOCALE_STRING [ext/standard/tests/array/locale_sort.phpt] proc_open [ext/standard/tests/general_functions/proc_open02.phpt] Test variations in usage of acos() [ext/standard/tests/math/acos_variation.phpt] Test variations in usage of asin() [ext/standard/tests/math/asin_variation.phpt] Bug #25665 (var_dump () hangs on Nan and INF) [ext/standard/tests/math/bug25665.phpt] money_format test [ext/standard/tests/strings/moneyformat.phpt] Test setlocale() function : basic functionality - setting system locale to a specific [ext/standard/tests/strings/setlocale_basic1.phpt] Test setlocale() function : basic functionality - set locale using an array [ext/standard/tests/strings/setlocale_basic2.phpt] Test setlocale() function : basic functionality - passing multiple locales as argument [ext/standard/tests/strings/setlocale_basic3.phpt] Test setlocale() function : usage variations - passing multiple valid/invlaid locales as argument [ext/standard/tests/strings/setlocale_variation1.phpt] Test setlocale() function : usage variations - setting system locale = 0 [ext/standard/tests/strings/setlocale_variation3.phpt] Test setlocale() function : usage variations - setting system locale as null [ext/standard/tests/strings/setlocale_variation4.phpt] Test setlocale() function : usage variations - Setting system locale as empty string [ext/standard/tests/strings/setlocale_variation5.phpt] ===================================================================== ================================================================================ /usr/pkgsrc/lang/php5/work/php-5.2.5/ext/date/tests/bug33532.phpt ================================================================================ TZ has NOT been set Should strftime==datestr? Strftime seems to assume GMT tStamp. input 10:00:00 AM July 1 2005 strftime 10:00:00 AM July 1 2005 WILDABBR +0000 datestr 10:00:00 AM July 1 2005 UTC Setting TZ input 10:00:00 AM July 1 2005 strftime 10:00:00 AM July 1 2005 EST +1000 datestr 10:00:00 AM July 1 2005 EST ================================================================================ 004+ strftime 10:00:00 AM July 1 2005 WILDABBR +0000 004- strftime 10:00:00 AM July 1 2005 UTC +0000 ================================================================================ ================================================================================ /usr/pkgsrc/lang/php5/work/php-5.2.5/ext/date/tests/date_default_timezone_get-1.phpt ================================================================================ Strict Standards: date_default_timezone_get(): It is not safe to rely on the system's timezone settings. Please use the date.timezone setting, the TZ environment variable or the date_default_timezone_set() function. In case you used any of those methods and you are still getting this warning, you most likely misspelled the timezone identifier. We selected 'UTC' for 'GMT/0.0/no DST' instead in /usr/pkgsrc/lang/php5/work/php-5.2.5/ext/date/tests/date_default_timezone_get-1.php on line 3 UTC Strict Standards: date(): It is not safe to rely on the system's timezone settings. Please use the date.timezone setting, the TZ environment variable or the date_default_timezone_set() function. In case you used any of those methods and you are still getting this warning, you most likely misspelled the timezone identifier. We selected 'UTC' for 'GMT/0.0/no DST' instead in /usr/pkgsrc/lang/php5/work/php-5.2.5/ext/date/tests/date_default_timezone_get-1.php on line 4 UTC ================================================================================ 001+ Strict Standards: date_default_timezone_get(): It is not safe to rely on the system's timezone settings. Please use the date.timezone setting, the TZ environment variable or the date_default_timezone_set() function. In case you used any of those methods and you are still getting this warning, you most likely misspelled the timezone identifier. We selected 'UTC' for 'GMT/0.0/no DST' instead in /usr/pkgsrc/lang/php5/work/php-5.2.5/ext/date/tests/date_default_timezone_get-1.php on line 3 001- Strict Standards: date_default_timezone_get(): It is not safe to rely on the system's timezone settings. Please use the date.timezone setting, the TZ environment variable or the date_default_timezone_set() function. In case you used any of those methods and you are still getting this warning, you most likely misspelled the timezone identifier. We selected 'UTC' for 'UTC/0.0/no DST' instead in %sdate_default_timezone_get-1.php on line 3 004+ Strict Standards: date(): It is not safe to rely on the system's timezone settings. Please use the date.timezone setting, the TZ environment variable or the date_default_timezone_set() function. In case you used any of those methods and you are still getting this warning, you most likely misspelled the timezone identifier. We selected 'UTC' for 'GMT/0.0/no DST' instead in /usr/pkgsrc/lang/php5/work/php-5.2.5/ext/date/tests/date_default_timezone_get-1.php on line 4 004- Strict Standards: date(): It is not safe to rely on the system's timezone settings. Please use the date.timezone setting, the TZ environment variable or the date_default_timezone_set() function. In case you used any of those methods and you are still getting this warning, you most likely misspelled the timezone identifier. We selected 'UTC' for 'UTC/0.0/no DST' instead in %sdate_default_timezone_get-1.php on line 4 ================================================================================ ================================================================================ /usr/pkgsrc/lang/php5/work/php-5.2.5/ext/date/tests/date_default_timezone_get-2.phpt ================================================================================ Strict Standards: date_default_timezone_get(): It is not safe to rely on the system's timezone settings. Please use the date.timezone setting, the TZ environment variable or the date_default_timezone_set() function. In case you used any of those methods and you are still getting this warning, you most likely misspelled the timezone identifier. We selected 'UTC' for 'GMT/0.0/no DST' instead in /usr/pkgsrc/lang/php5/work/php-5.2.5/ext/date/tests/date_default_timezone_get-2.php on line 3 UTC ================================================================================ 001+ Strict Standards: date_default_timezone_get(): It is not safe to rely on the system's timezone settings. Please use the date.timezone setting, the TZ environment variable or the date_default_timezone_set() function. In case you used any of those methods and you are still getting this warning, you most likely misspelled the timezone identifier. We selected 'UTC' for 'GMT/0.0/no DST' instead in /usr/pkgsrc/lang/php5/work/php-5.2.5/ext/date/tests/date_default_timezone_get-2.php on line 3 001- Strict Standards: date_default_timezone_get(): It is not safe to rely on the system's timezone settings. Please use the date.timezone setting, the TZ environment variable or the date_default_timezone_set() function. In case you used any of those methods and you are still getting this warning, you most likely misspelled the timezone identifier. We selected 'UTC' for 'UTC/0.0/no DST' instead in %sdate_default_timezone_get-2.php on line 3 ================================================================================ ================================================================================ /usr/pkgsrc/lang/php5/work/php-5.2.5/ext/date/tests/date_default_timezone_set-1.phpt ================================================================================ Strict Standards: strtotime(): It is not safe to rely on the system's timezone settings. Please use the date.timezone setting, the TZ environment variable or the date_default_timezone_set() function. In case you used any of those methods and you are still getting this warning, you most likely misspelled the timezone identifier. We selected 'UTC' for 'GMT/0.0/no DST' instead in /usr/pkgsrc/lang/php5/work/php-5.2.5/ext/date/tests/date_default_timezone_set-1.php on line 3 Strict Standards: strtotime(): It is not safe to rely on the system's timezone settings. Please use the date.timezone setting, the TZ environment variable or the date_default_timezone_set() function. In case you used any of those methods and you are still getting this warning, you most likely misspelled the timezone identifier. We selected 'UTC' for 'GMT/0.0/no DST' instead in /usr/pkgsrc/lang/php5/work/php-5.2.5/ext/date/tests/date_default_timezone_set-1.php on line 4 America/Indiana/Knox 2005-01-12T03:00:00-0500 2005-07-12T03:00:00-0500 2005-01-12T08:00:00-0500 2005-07-12T08:00:00-0500 ================================================================================ 001+ Strict Standards: strtotime(): It is not safe to rely on the system's timezone settings. Please use the date.timezone setting, the TZ environment variable or the date_default_timezone_set() function. In case you used any of those methods and you are still getting this warning, you most likely misspelled the timezone identifier. We selected 'UTC' for 'GMT/0.0/no DST' instead in /usr/pkgsrc/lang/php5/work/php-5.2.5/ext/date/tests/date_default_timezone_set-1.php on line 3 001- Strict Standards: strtotime(): It is not safe to rely on the system's timezone settings. Please use the date.timezone setting, the TZ environment variable or the date_default_timezone_set() function. In case you used any of those methods and you are still getting this warning, you most likely misspelled the timezone identifier. We selected 'UTC' for 'UTC/0.0/no DST' instead in %sdate_default_timezone_set-1.php on line 3 003+ Strict Standards: strtotime(): It is not safe to rely on the system's timezone settings. Please use the date.timezone setting, the TZ environment variable or the date_default_timezone_set() function. In case you used any of those methods and you are still getting this warning, you most likely misspelled the timezone identifier. We selected 'UTC' for 'GMT/0.0/no DST' instead in /usr/pkgsrc/lang/php5/work/php-5.2.5/ext/date/tests/date_default_timezone_set-1.php on line 4 003- Strict Standards: strtotime(): It is not safe to rely on the system's timezone settings. Please use the date.timezone setting, the TZ environment variable or the date_default_timezone_set() function. In case you used any of those methods and you are still getting this warning, you most likely misspelled the timezone identifier. We selected 'UTC' for 'UTC/0.0/no DST' instead in %sdate_default_timezone_set-1.php on line 4 ================================================================================ ================================================================================ /usr/pkgsrc/lang/php5/work/php-5.2.5/ext/date/tests/oo_002.phpt ================================================================================ string(29) "Fri, 01 Aug 08 13:00:00 +0000" string(29) "Fri, 01 Aug 08 13:00:00 +0000" string(29) "Fri, 01 Aug 08 14:00:00 +0000" string(29) "Fri, 01 Aug 08 12:59:59 +0000" string(10) "Asia/Tokyo" string(10) "Asia/Tokyo" ================================================================================ 001+ string(29) "Fri, 01 Aug 08 13:00:00 +0000" 002+ string(29) "Fri, 01 Aug 08 13:00:00 +0000" 003+ string(29) "Fri, 01 Aug 08 14:00:00 +0000" 004+ string(29) "Fri, 01 Aug 08 12:59:59 +0000" 001- string(29) "Wed, 01 Aug 07 13:00:00 +0000" 002- string(29) "Wed, 01 Aug 07 13:00:00 +0000" 003- string(29) "Wed, 01 Aug 07 14:00:00 +0000" 004- string(29) "Wed, 01 Aug 07 12:59:59 +0000" ================================================================================ ================================================================================ /usr/pkgsrc/lang/php5/work/php-5.2.5/ext/openssl/tests/004.phpt ================================================================================ Warning: openssl_csr_new() expects parameter 1 to be array, integer given in /usr/pkgsrc/lang/php5/work/php-5.2.5/ext/openssl/tests/004.php on line 4 NULL Warning: openssl_csr_new() expects parameter 1 to be array, integer given in /usr/pkgsrc/lang/php5/work/php-5.2.5/ext/openssl/tests/004.php on line 5 NULL bool(false) bool(false) Done ================================================================================ 006+ bool(false) 006- 007- Warning: openssl_csr_new(): key array must be of the form array(0 => key, 1 => phrase) in %s on line %d 008- 009- Warning: openssl_csr_new(): add1_attr_by_txt challengePassword_min -> 4 (failed) in %s on line %d 011- resource(%d) of type (OpenSSL X.509 CSR) ================================================================================ ================================================================================ /usr/pkgsrc/lang/php5/work/php-5.2.5/ext/openssl/tests/bug36732.phpt ================================================================================ Warning: openssl_csr_sign(): cannot get CSR from parameter 1 in /usr/pkgsrc/lang/php5/work/php-5.2.5/ext/openssl/tests/bug36732.php on line 17 Warning: openssl_csr_export() expects parameter 1 to be resource, boolean given in /usr/pkgsrc/lang/php5/work/php-5.2.5/ext/openssl/tests/bug36732.php on line 20 Warning: openssl_x509_export(): cannot get cert from parameter 1 in /usr/pkgsrc/lang/php5/work/php-5.2.5/ext/openssl/tests/bug36732.php on line 25 ================================================================================ 001+ Warning: openssl_csr_sign(): cannot get CSR from parameter 1 in /usr/pkgsrc/lang/php5/work/php-5.2.5/ext/openssl/tests/bug36732.php on line 17 002+ 001- Ok 002- Ok 003+ Warning: openssl_csr_export() expects parameter 1 to be resource, boolean given in /usr/pkgsrc/lang/php5/work/php-5.2.5/ext/openssl/tests/bug36732.php on line 20 004+ 005+ Warning: openssl_x509_export(): cannot get cert from parameter 1 in /usr/pkgsrc/lang/php5/work/php-5.2.5/ext/openssl/tests/bug36732.php on line 25 ================================================================================ ================================================================================ /usr/pkgsrc/lang/php5/work/php-5.2.5/ext/pcre/tests/locales.phpt ================================================================================ int(0) int(0) int(0) ================================================================================ 002+ int(0) 002- int(1) ================================================================================ ================================================================================ /usr/pkgsrc/lang/php5/work/php-5.2.5/ext/standard/tests/array/locale_sort.phpt ================================================================================ array(13) { ["AB"]=> string(7) "Alberta" ["BC"]=> string(20) "Colombie-Britannique" ["MB"]=> string(8) "Manitoba" ["NB"]=> string(17) "Nouveau-Brunswick" ["NS"]=> string(15) "Nouvelle-Écosse" ["NU"]=> string(7) "Nunavut" ["ON"]=> string(7) "Ontario" ["QC"]=> string(6) "Québec" ["SK"]=> string(12) "Saskatchewan" ["NL"]=> string(23) "Terre-Neuve-et-Labrador" ["YT"]=> string(19) "Territoire du Yukon" ["NT"]=> string(25) "Territoires du Nord-Ouest" ["PE"]=> string(21) "Île-du-Prince-Édouard" } ================================================================================ 006- ["PE"]=> 007- string(21) "Île-du-Prince-Édouard" 026+ ["PE"]=> 027+ string(21) "Île-du-Prince-Édouard" ================================================================================ ================================================================================ /usr/pkgsrc/lang/php5/work/php-5.2.5/ext/standard/tests/general_functions/proc_open02.phpt ================================================================================ bool(true) array(8) { ["command"]=> string(28) "/usr/bin/nohup /bin/sleep 50" ["pid"]=> int(13334) ["running"]=> bool(false) ["signaled"]=> bool(true) ["stopped"]=> bool(false) ["exitcode"]=> int(-1) ["termsig"]=> int(1) ["stopsig"]=> int(0) } bool(false) array(8) { ["command"]=> string(28) "/usr/bin/nohup /bin/sleep 50" ["pid"]=> int(13334) ["running"]=> bool(false) ["signaled"]=> bool(false) ["stopped"]=> bool(false) ["exitcode"]=> int(-1) ["termsig"]=> int(0) ["stopsig"]=> int(0) } Done! ================================================================================ 008+ bool(false) 009+ ["signaled"]=> 009- ["signaled"]=> 010- bool(false) 016+ int(1) 016- int(0) 020+ bool(false) 020- bool(true) 029+ bool(false) 029- bool(true) 035+ int(0) 035- int(15) ================================================================================ ================================================================================ /usr/pkgsrc/lang/php5/work/php-5.2.5/ext/standard/tests/math/acos_variation.phpt ================================================================================ float(0) float(0) float(0) float(0) float(0) float(0) float(0) float(0) float(0) float(1.570796327) float(0) float(0) float(1.570796327) float(0) float(1.570796327) ================================================================================ 001+ float(0) 002+ float(0) 003+ float(0) 004+ float(0) 005+ float(0) 006+ float(0) 007+ float(0) 008+ float(0) 009+ float(0) 001- float(NAN) 002- float(NAN) 003- float(NAN) 004- float(NAN) 005- float(NAN) 006- float(NAN) 007- float(NAN) 008- float(NAN) 009- float(NAN) 011+ float(0) 012+ float(0) 011- float(NAN) 012- float(NAN) ================================================================================ ================================================================================ /usr/pkgsrc/lang/php5/work/php-5.2.5/ext/standard/tests/math/asin_variation.phpt ================================================================================ float(0) float(0) float(0) float(0) float(0) float(0) float(0) float(0) float(0) float(0) float(0) float(0) float(0) float(1.570796327) float(0) ================================================================================ 001+ float(0) 002+ float(0) 003+ float(0) 004+ float(0) 005+ float(0) 006+ float(0) 007+ float(0) 008+ float(0) 009+ float(0) 010+ float(0) 011+ float(0) 012+ float(0) 013+ float(0) 014+ float(1.570796327) 001- float(NAN) 002- float(NAN) 003- float(NAN) 004- float(NAN) 005- float(NAN) 006- float(NAN) 007- float(NAN) 008- float(NAN) 009- float(NAN) 011- float(NAN) 012- float(NAN) 013- float(0) 014- float(1.570796327) 015- float(0) ================================================================================ ================================================================================ /usr/pkgsrc/lang/php5/work/php-5.2.5/ext/standard/tests/math/bug25665.phpt ================================================================================ float(0) float(-INF) ================================================================================ 001+ float(0) 001- float(NAN) ================================================================================ ================================================================================ /usr/pkgsrc/lang/php5/work/php-5.2.5/ext/standard/tests/strings/moneyformat.phpt ================================================================================ string(6) "X3.14Y" Warning: money_format(): Only a single %i or %n token can be used in /usr/pkgsrc/lang/php5/work/php-5.2.5/ext/standard/tests/strings/moneyformat.php on line 4 bool(false) ================================================================================ 001+ string(6) "X3.14Y" 001- string(7) "X$3.14Y" ================================================================================ ================================================================================ /usr/pkgsrc/lang/php5/work/php-5.2.5/ext/standard/tests/strings/setlocale_basic1.phpt ================================================================================ *** Testing setlocale() : basic functionality - set to a specific locale *** Setting system locale(LC_ALL) to Checking currency settings in the new locale, expected: EUR, Found: Test FAILED. Done ================================================================================ 003+ Test FAILED. 003- string(%d) %s 004- Checking currency settings in the new locale, expected: %s, Found: %s 005- Test PASSED. ================================================================================ ================================================================================ /usr/pkgsrc/lang/php5/work/php-5.2.5/ext/standard/tests/strings/setlocale_basic2.phpt ================================================================================ *** Testing setlocale() with an array containing list of locales *** -- Testing setlocale() : 'category' argument as LC_ALL & 'locale' argument as an array -- Test FAILED. Done ================================================================================ 003+ Test FAILED. 003- string(%d) "%s" 004- Checking currency settings in the new locale, expected: %s, Found: %s 005- Test PASSED. ================================================================================ ================================================================================ /usr/pkgsrc/lang/php5/work/php-5.2.5/ext/standard/tests/strings/setlocale_basic3.phpt ================================================================================ *** Testing setlocale() by passing multiple locales as argument *** Done ================================================================================ 002- -- Testing setlocale() by giving 'category' as LC_ALL & multiple locales(en_US.utf8, Ko_KR.utf8, zh_CN.utf8) -- 003- string(%d) "%s" 004- Checking currency settings in the new locale, expected: %s, Found: %s 005- Test PASSED. ================================================================================ ================================================================================ /usr/pkgsrc/lang/php5/work/php-5.2.5/ext/standard/tests/strings/setlocale_variation1.phpt ================================================================================ *** Testing setlocale() by passing multiple valid/invalid locales as argument *** Done ================================================================================ 002- -- Testing setlocale() by giving 'category' as LC_ALL & multiple locales(en_US.invalid, en_US.utf8, Ko_KR.utf8, KO_KR.invalid, zh_CN.utf8) -- 003- string(%d) "%s" 004- Checking currency settings in the new locale, expected: %s, Found: %s 005- Test PASSED. ================================================================================ ================================================================================ /usr/pkgsrc/lang/php5/work/php-5.2.5/ext/standard/tests/strings/setlocale_variation3.phpt ================================================================================ *** Testing setlocale() : usage variations - setting system locale = 0 *** Locale info, before setting the locale array(18) { ["decimal_point"]=> string(1) "." ["thousands_sep"]=> string(0) "" ["int_curr_symbol"]=> string(0) "" ["currency_symbol"]=> string(0) "" ["mon_decimal_point"]=> string(0) "" ["mon_thousands_sep"]=> string(0) "" ["positive_sign"]=> string(0) "" ["negative_sign"]=> string(0) "" ["int_frac_digits"]=> int(127) ["frac_digits"]=> int(127) ["p_cs_precedes"]=> int(127) ["p_sep_by_space"]=> int(127) ["n_cs_precedes"]=> int(127) ["n_sep_by_space"]=> int(127) ["p_sign_posn"]=> int(127) ["n_sign_posn"]=> int(127) ["grouping"]=> array(0) { } ["mon_grouping"]=> array(0) { } } Setting system locale, category = LC_ALL and locale = 0 Locale info, after setting the locale array(18) { ["decimal_point"]=> string(1) "." ["thousands_sep"]=> string(0) "" ["int_curr_symbol"]=> string(0) "" ["currency_symbol"]=> string(0) "" ["mon_decimal_point"]=> string(0) "" ["mon_thousands_sep"]=> string(0) "" ["positive_sign"]=> string(0) "" ["negative_sign"]=> string(0) "" ["int_frac_digits"]=> int(127) ["frac_digits"]=> int(127) ["p_cs_precedes"]=> int(127) ["p_sep_by_space"]=> int(127) ["n_cs_precedes"]=> int(127) ["n_sep_by_space"]=> int(127) ["p_sign_posn"]=> int(127) ["n_sign_posn"]=> int(127) ["grouping"]=> array(0) { } ["mon_grouping"]=> array(0) { } } Checking locale in the system, Expected : no change in the existing locale Test PASSED. Done ================================================================================ 007+ string(0) "" 007- string(1) "," 009+ string(0) "" 009- string(4) "USD " 011+ string(0) "" 011- string(1) "$" 013+ string(0) "" 013- string(1) "." 015+ string(0) "" 015- string(1) "," 019+ string(0) "" 019- string(1) "-" 021+ int(127) 021- int(2) 023+ int(127) 023- int(2) 025+ int(127) 025- int(1) 027+ int(127) 027- int(0) 029+ int(127) 029- int(1) 031+ int(127) 031- int(0) 033+ int(127) 033- int(1) 035+ int(127) 035- int(1) 037+ array(0) { 037- array(2) { 038- [0]=> 039- int(3) 040- [1]=> 041- int(3) 040+ array(0) { 044- array(2) { 045- [0]=> 046- int(3) 047- [1]=> 048- int(3) 049+ string(0) "" 051+ string(0) "" 053+ string(0) "" 055+ string(0) "" 057+ string(0) "" 057- string(1) "," 059- string(4) "USD " 061+ string(0) "" 061- string(1) "$" 063+ int(127) 063- string(1) "." 065+ int(127) 065- string(1) "," 067+ int(127) 069+ int(127) 069- string(1) "-" 071+ int(127) 071- int(2) 073+ int(127) 073- int(2) 075+ int(127) 075- int(1) 077+ int(127) 077- int(0) 079+ array(0) { 079- int(1) 081- int(0) 082+ array(0) { 083- int(1) 085- int(1) 087- array(2) { 088- [0]=> 089- int(3) 090- [1]=> 091- int(3) 094- array(2) { 095- [0]=> 096- int(3) 097- [1]=> 098- int(3) ================================================================================ ================================================================================ /usr/pkgsrc/lang/php5/work/php-5.2.5/ext/standard/tests/strings/setlocale_variation4.phpt ================================================================================ *** Testing setlocale() : usage variations - Setting system locale = null *** Locale info, before setting the locale array(18) { ["decimal_point"]=> string(1) "." ["thousands_sep"]=> string(0) "" ["int_curr_symbol"]=> string(0) "" ["currency_symbol"]=> string(0) "" ["mon_decimal_point"]=> string(0) "" ["mon_thousands_sep"]=> string(0) "" ["positive_sign"]=> string(0) "" ["negative_sign"]=> string(0) "" ["int_frac_digits"]=> int(127) ["frac_digits"]=> int(127) ["p_cs_precedes"]=> int(127) ["p_sep_by_space"]=> int(127) ["n_cs_precedes"]=> int(127) ["n_sep_by_space"]=> int(127) ["p_sign_posn"]=> int(127) ["n_sign_posn"]=> int(127) ["grouping"]=> array(0) { } ["mon_grouping"]=> array(0) { } } Setting system locale, category = LC_ALL and locale = null Locale info, after setting the locale array(18) { ["decimal_point"]=> string(1) "." ["thousands_sep"]=> string(0) "" ["int_curr_symbol"]=> string(0) "" ["currency_symbol"]=> string(0) "" ["mon_decimal_point"]=> string(0) "" ["mon_thousands_sep"]=> string(0) "" ["positive_sign"]=> string(0) "" ["negative_sign"]=> string(0) "" ["int_frac_digits"]=> int(127) ["frac_digits"]=> int(127) ["p_cs_precedes"]=> int(127) ["p_sep_by_space"]=> int(127) ["n_cs_precedes"]=> int(127) ["n_sep_by_space"]=> int(127) ["p_sign_posn"]=> int(127) ["n_sign_posn"]=> int(127) ["grouping"]=> array(0) { } ["mon_grouping"]=> array(0) { } } Checking new locale in the system, Expected : the locale names will be set from the values of environment variables Test FAILED. Done ================================================================================ 007+ string(0) "" 007- string(1) "," 009+ string(0) "" 009- string(4) "AUD " 011+ string(0) "" 011- string(1) "$" 013+ string(0) "" 013- string(1) "." 015+ string(0) "" 015- string(1) "," 019+ string(0) "" 019- string(1) "-" 021+ int(127) 021- int(2) 023+ int(127) 023- int(2) 025+ int(127) 025- int(1) 027+ int(127) 027- int(0) 029+ int(127) 029- int(1) 031+ int(127) 031- int(0) 033+ int(127) 033- int(1) 035+ int(127) 035- int(1) 037+ array(0) { 037- array(2) { 038- [0]=> 039- int(3) 040- [1]=> 041- int(3) 040+ array(0) { 044- array(2) { 045- [0]=> 046- int(3) 047- [1]=> 048- int(3) 049+ string(0) "" 051+ string(0) "" 053+ string(0) "" 055+ string(0) "" 057+ string(0) "" 057- string(1) "," 059- string(4) "USD " 061+ string(0) "" 061- string(1) "$" 063+ int(127) 063- string(1) "." 065+ int(127) 065- string(1) "," 067+ int(127) 069+ int(127) 069- string(1) "-" 071+ int(127) 071- int(2) 073+ int(127) 073- int(2) 075+ int(127) 075- int(1) 077+ int(127) 077- int(0) 079+ array(0) { 079- int(1) 081- int(0) 082+ array(0) { 083- int(1) 085- int(1) 086+ Test FAILED. 087- array(2) { 088- [0]=> 089- int(3) 090- [1]=> 091- int(3) 094- array(2) { 095- [0]=> 096- int(3) 097- [1]=> 098- int(3) 102- Test PASSED. ================================================================================ ================================================================================ /usr/pkgsrc/lang/php5/work/php-5.2.5/ext/standard/tests/strings/setlocale_variation5.phpt ================================================================================ *** Testing setlocale() : usage variations - setting system locale = "" *** Locale info, before setting the locale array(18) { ["decimal_point"]=> string(1) "." ["thousands_sep"]=> string(0) "" ["int_curr_symbol"]=> string(0) "" ["currency_symbol"]=> string(0) "" ["mon_decimal_point"]=> string(0) "" ["mon_thousands_sep"]=> string(0) "" ["positive_sign"]=> string(0) "" ["negative_sign"]=> string(0) "" ["int_frac_digits"]=> int(127) ["frac_digits"]=> int(127) ["p_cs_precedes"]=> int(127) ["p_sep_by_space"]=> int(127) ["n_cs_precedes"]=> int(127) ["n_sep_by_space"]=> int(127) ["p_sign_posn"]=> int(127) ["n_sign_posn"]=> int(127) ["grouping"]=> array(0) { } ["mon_grouping"]=> array(0) { } } Setting system locale, category = LC_ALL and locale = "" Locale info, after setting the locale array(18) { ["decimal_point"]=> string(1) "." ["thousands_sep"]=> string(0) "" ["int_curr_symbol"]=> string(0) "" ["currency_symbol"]=> string(0) "" ["mon_decimal_point"]=> string(0) "" ["mon_thousands_sep"]=> string(0) "" ["positive_sign"]=> string(0) "" ["negative_sign"]=> string(0) "" ["int_frac_digits"]=> int(127) ["frac_digits"]=> int(127) ["p_cs_precedes"]=> int(127) ["p_sep_by_space"]=> int(127) ["n_cs_precedes"]=> int(127) ["n_sep_by_space"]=> int(127) ["p_sign_posn"]=> int(127) ["n_sign_posn"]=> int(127) ["grouping"]=> array(0) { } ["mon_grouping"]=> array(0) { } } Checking new locale in the system, Expected : the locale names will be set from the values of environment variables Test FAILED. Done ================================================================================ 007+ string(0) "" 007- string(1) "," 009+ string(0) "" 009- string(4) "AUD " 011+ string(0) "" 011- string(1) "$" 013+ string(0) "" 013- string(1) "." 015+ string(0) "" 015- string(1) "," 019+ string(0) "" 019- string(1) "-" 021+ int(127) 021- int(2) 023+ int(127) 023- int(2) 025+ int(127) 025- int(1) 027+ int(127) 027- int(0) 029+ int(127) 029- int(1) 031+ int(127) 031- int(0) 033+ int(127) 033- int(1) 035+ int(127) 035- int(1) 037+ array(0) { 037- array(2) { 038- [0]=> 039- int(3) 040- [1]=> 041- int(3) 040+ array(0) { 044- array(2) { 045- [0]=> 046- int(3) 047- [1]=> 048- int(3) 049+ string(0) "" 051+ string(0) "" 053+ string(0) "" 055+ string(0) "" 057+ string(0) "" 057- string(1) "," 059- string(4) "USD " 061+ string(0) "" 061- string(1) "$" 063+ int(127) 063- string(1) "." 065+ int(127) 065- string(1) "," 067+ int(127) 069+ int(127) 069- string(1) "-" 071+ int(127) 071- int(2) 073+ int(127) 073- int(2) 075+ int(127) 075- int(1) 077+ int(127) 077- int(0) 079+ array(0) { 079- int(1) 081- int(0) 082+ array(0) { 083- int(1) 085- int(1) 086+ Test FAILED. 087- array(2) { 088- [0]=> 089- int(3) 090- [1]=> 091- int(3) 094- array(2) { 095- [0]=> 096- int(3) 097- [1]=> 098- int(3) 102- Test PASSED. ================================================================================ ================================================================================ BUILD ENVIRONMENT ================================================================================ OS: NetBSD - NetBSD plex 4.0 NetBSD 4.0 (GENERIC_LAPTOP) #0: Sun Dec 16 00:27:57 PST 2007 builds@wb34:/home/builds/ab/netbsd-4-0-RELEASE/i386/200712160005Z-obj/home/builds/ab/netbsd-4-0-RELEASE/src/sys/arch/i386/compile/GENERIC_LAPTOP i386 Autoconf: Bundled Libtool: ltmain.sh (GNU libtool) 1.5.20 (1.1220.2.287 2005/08/31 18:54:15) Copyright (C) 2005 Free Software Foundation, Inc. This is free software; see the source for copying conditions. There is NO warranty; not even for MERCHANTABILITY or FITNESS FOR A PARTICULAR PURPOSE. System Libtool: ltmain.sh (GNU libtool) 1.5.24 (1.1220.2.455 2007/06/24 02:13:29) Copyright (C) 2007 Free Software Foundation, Inc. This is free software; see the source for copying conditions. There is NO warranty; not even for MERCHANTABILITY or FITNESS FOR A PARTICULAR PURPOSE. Compiler: Using built-in specs. Target: i386--netbsdelf Configured with: /usr/src/tools/gcc/../../gnu/dist/gcc4/configure --enable-long-long --disable-multilib --enable-threads --disable-symvers --build=i386-unknown-netbsdelf4.99.3 --host=i386--netbsdelf --target=i386--netbsdelf Thread model: posix gcc version 4.1.2 20061021 prerelease (NetBSD nb3 20061125) Bison: bison (GNU Bison) 2.3 Written by Robert Corbett and Richard Stallman. Copyright (C) 2006 Free Software Foundation, Inc. This is free software; see the source for copying conditions. There is NO warranty; not even for MERCHANTABILITY or FITNESS FOR A PARTICULAR PURPOSE. Libraries: /usr/pkgsrc/lang/php5/work/php-5.2.5/sapi/cli/php: -lcrypt.0 => /usr/lib/libcrypt.so.0 -lcrypto.3 => /usr/lib/libcrypto.so.3 -lssl.4 => /usr/lib/libssl.so.4 -lm.0 => /usr/lib/libm387.so.0 -lm.0 => /usr/lib/libm.so.0 -lz.1 => /usr/lib/libz.so.1 -lxml2.2 => /usr/pkg/lib/libxml2.so.2 -lc.12 => /usr/lib/libc.so.12 User's E-mail: l dot rozehnal at centrum dot cz ================================================================================ PHPINFO ================================================================================ phpinfo() PHP Version => 5.2.5 System => NetBSD plex 4.0 NetBSD 4.0 (GENERIC_LAPTOP) #0: Sun Dec 16 00:27:57 PST 2007 builds@wb34:/home/builds/ab/netbsd-4-0-RELEASE/i386/200712160005Z-obj/home/builds/ab/netbsd-4-0-RELEASE/src/sys/arch/i386/compile/GENERIC_LAPTOP i386 Build Date => Feb 4 2008 23:56:56 Configure Command => './configure' '--with-config-file-path=/usr/pkg/etc' '--with-regex=system' '--without-mysql' '--without-sqlite' '--without-iconv' '--without-pear' '--disable-posix' '--disable-dom' '--disable-pdo' '--disable-json' '--enable-xml' '--with-libxml-dir=/usr/pkg' '--enable-ipv6' '--with-openssl=/usr' '--enable-discard-path' '--enable-force-cgi-redirect' '--without-libiconv-prefix' '--prefix=/usr/pkg' '--host=i386--netbsdelf' '--mandir=/usr/pkg/man' Server API => Command Line Interface Virtual Directory Support => disabled Configuration File (php.ini) Path => /usr/pkg/etc Loaded Configuration File => (none) PHP API => 20041225 PHP Extension => 20060613 Zend Extension => 220060519 Debug Build => no Thread Safety => disabled Zend Memory Manager => enabled IPv6 Support => enabled Registered PHP Streams => php, file, data, http, ftp, https, ftps Registered Stream Socket Transports => tcp, udp, unix, udg, ssl, sslv3, sslv2, tls Registered Stream Filters => string.rot13, string.toupper, string.tolower, string.strip_tags, convert.*, consumed This program makes use of the Zend Scripting Language Engine: Zend Engine v2.2.0, Copyright (c) 1998-2007 Zend Technologies _______________________________________________________________________ Configuration PHP Core Directive => Local Value => Master Value allow_call_time_pass_reference => On => On allow_url_fopen => On => On allow_url_include => Off => Off always_populate_raw_post_data => Off => Off arg_separator.input => & => & arg_separator.output => & => & asp_tags => Off => Off auto_append_file => no value => no value auto_globals_jit => On => On auto_prepend_file => no value => no value browscap => no value => no value default_charset => no value => no value default_mimetype => text/html => text/html define_syslog_variables => Off => Off disable_classes => no value => no value disable_functions => no value => no value display_errors => STDOUT => STDOUT display_startup_errors => Off => Off doc_root => no value => no value docref_ext => no value => no value docref_root => no value => no value enable_dl => On => On error_append_string => no value => no value error_log => no value => no value error_prepend_string => no value => no value error_reporting => no value => no value expose_php => On => On extension_dir => /usr/pkg/lib/php/20040412 => /usr/pkg/lib/php/20040412 file_uploads => On => On highlight.bg => <font style="color: #FFFFFF">#FFFFFF</font> => <font style="color: #FFFFFF">#FFFFFF</font> highlight.comment => <font style="color: #FF8000">#FF8000</font> => <font style="color: #FF8000">#FF8000</font> highlight.default => <font style="color: #0000BB">#0000BB</font> => <font style="color: #0000BB">#0000BB</font> highlight.html => <font style="color: #000000">#000000</font> => <font style="color: #000000">#000000</font> highlight.keyword => <font style="color: #007700">#007700</font> => <font style="color: #007700">#007700</font> highlight.string => <font style="color: #DD0000">#DD0000</font> => <font style="color: #DD0000">#DD0000</font> html_errors => Off => Off ignore_repeated_errors => Off => Off ignore_repeated_source => Off => Off ignore_user_abort => Off => Off implicit_flush => On => On include_path => .: => .: log_errors => Off => Off log_errors_max_len => 1024 => 1024 magic_quotes_gpc => On => On magic_quotes_runtime => Off => Off magic_quotes_sybase => Off => Off mail.force_extra_parameters => no value => no value max_execution_time => 0 => 0 max_input_nesting_level => 64 => 64 max_input_time => -1 => -1 memory_limit => 128M => 128M open_basedir => no value => no value output_buffering => 0 => 0 output_handler => no value => no value post_max_size => 8M => 8M precision => 14 => 14 realpath_cache_size => 16K => 16K realpath_cache_ttl => 120 => 120 register_argc_argv => On => On register_globals => Off => Off register_long_arrays => On => On report_memleaks => On => On report_zend_debug => Off => Off safe_mode => Off => Off safe_mode_exec_dir => /usr/local/php/bin => /usr/local/php/bin safe_mode_gid => Off => Off safe_mode_include_dir => no value => no value sendmail_from => no value => no value sendmail_path => /usr/sbin/sendmail -t -i => /usr/sbin/sendmail -t -i serialize_precision => 100 => 100 short_open_tag => On => On SMTP => localhost => localhost smtp_port => 25 => 25 sql.safe_mode => Off => Off track_errors => Off => Off unserialize_callback_func => no value => no value upload_max_filesize => 2M => 2M upload_tmp_dir => no value => no value user_dir => no value => no value variables_order => EGPCS => EGPCS xmlrpc_error_number => 0 => 0 xmlrpc_errors => Off => Off y2k_compliance => On => On zend.ze1_compatibility_mode => Off => Off ctype ctype functions => enabled date date/time support => enabled "Olson" Timezone Database Version => 2007.9 Timezone Database => internal Default timezone => Europe/Berlin Directive => Local Value => Master Value date.default_latitude => 31.7667 => 31.7667 date.default_longitude => 35.2333 => 35.2333 date.sunrise_zenith => 90.583333 => 90.583333 date.sunset_zenith => 90.583333 => 90.583333 date.timezone => no value => no value filter Input Validation and Filtering => enabled Revision => $Revision: 1.52.2.39 $ Directive => Local Value => Master Value filter.default => unsafe_raw => unsafe_raw filter.default_flags => no value => no value hash hash support => enabled Hashing Engines => md2 md4 md5 sha1 sha256 sha384 sha512 ripemd128 ripemd160 ripemd256 ripemd320 whirlpool tiger128,3 tiger160,3 tiger192,3 tiger128,4 tiger160,4 tiger192,4 snefru gost adler32 crc32 crc32b haval128,3 haval160,3 haval192,3 haval224,3 haval256,3 haval128,4 haval160,4 haval192,4 haval224,4 haval256,4 haval128,5 haval160,5 haval192,5 haval224,5 haval256,5 libxml libXML support => active libXML Version => 2.6.30 libXML streams => enabled openssl OpenSSL support => enabled OpenSSL Version => OpenSSL 0.9.8e 23 Feb 2007 pcre PCRE (Perl Compatible Regular Expressions) Support => enabled PCRE Library Version => 7.3 2007-08-28 Directive => Local Value => Master Value pcre.backtrack_limit => 100000 => 100000 pcre.recursion_limit => 100000 => 100000 Reflection Reflection => enabled Version => $Id: php_reflection.c,v 1.164.2.33.2.47 2007/10/28 13:47:14 iliaa Exp $ session Session Support => enabled Registered save handlers => files user Registered serializer handlers => php php_binary Directive => Local Value => Master Value session.auto_start => Off => Off session.bug_compat_42 => On => On session.bug_compat_warn => On => On session.cache_expire => 180 => 180 session.cache_limiter => nocache => nocache session.cookie_domain => no value => no value session.cookie_httponly => Off => Off session.cookie_lifetime => 0 => 0 session.cookie_path => / => / session.cookie_secure => Off => Off session.entropy_file => no value => no value session.entropy_length => 0 => 0 session.gc_divisor => 100 => 100 session.gc_maxlifetime => 1440 => 1440 session.gc_probability => 1 => 1 session.hash_bits_per_character => 4 => 4 session.hash_function => 0 => 0 session.name => PHPSESSID => PHPSESSID session.referer_check => no value => no value session.save_handler => files => files session.save_path => no value => no value session.serialize_handler => php => php session.use_cookies => On => On session.use_only_cookies => Off => Off session.use_trans_sid => 0 => 0 SimpleXML Simplexml support => enabled Revision => $Revision: 1.151.2.22.2.35 $ Schema support => enabled SPL SPL support => enabled Interfaces => Countable, OuterIterator, RecursiveIterator, SeekableIterator, SplObserver, SplSubject Classes => AppendIterator, ArrayIterator, ArrayObject, BadFunctionCallException, BadMethodCallException, CachingIterator, DirectoryIterator, DomainException, EmptyIterator, FilterIterator, InfiniteIterator, InvalidArgumentException, IteratorIterator, LengthException, LimitIterator, LogicException, NoRewindIterator, OutOfBoundsException, OutOfRangeException, OverflowException, ParentIterator, RangeException, RecursiveArrayIterator, RecursiveCachingIterator, RecursiveDirectoryIterator, RecursiveFilterIterator, RecursiveIteratorIterator, RecursiveRegexIterator, RegexIterator, RuntimeException, SimpleXMLIterator, SplFileInfo, SplFileObject, SplObjectStorage, SplTempFileObject, UnderflowException, UnexpectedValueException standard Regex Library => System library enabled Dynamic Library Support => enabled Path to sendmail => /usr/sbin/sendmail -t -i Directive => Local Value => Master Value assert.active => 1 => 1 assert.bail => 0 => 0 assert.callback => no value => no value assert.quiet_eval => 0 => 0 assert.warning => 1 => 1 auto_detect_line_endings => 0 => 0 default_socket_timeout => 60 => 60 safe_mode_allowed_env_vars => PHP_ => PHP_ safe_mode_protected_env_vars => LD_LIBRARY_PATH => LD_LIBRARY_PATH url_rewriter.tags => a=href,area=href,frame=src,form=,fieldset= => a=href,area=href,frame=src,form=,fieldset= user_agent => no value => no value tokenizer Tokenizer Support => enabled xml XML Support => active XML Namespace Support => active libxml2 Version => 2.6.30 xmlreader XMLReader => enabled xmlwriter XMLWriter => enabled Additional Modules Module Name Environment Variable => Value ENV => /root/.shrc LC_MONETARY => C CXX => c++ MAKEINFO => /usr/pkgsrc/lang/php5/work/.tools/bin/makeinfo MFLAGS => MAKEFLAGS => _SRC_TOP_= _PKGSRC_BARRIER=yes _PKGSRCDIR=/usr/pkgsrc _PATH_ORIG=/sbin:/usr/sbin:/bin:/usr/bin:/usr/pkg/sbin:/usr/pkg/bin:/usr/X11R6/bin:/usr/local/sbin:/usr/local/bin _MAKE=/usr/bin/make _CC=/usr/bin/cc PKGTOOLS_VERSION=20071224 OS_VERSION=4.0 OPSYS=NetBSD LOWER_OPSYS=netbsd HOST_OSTYPE=NetBSD-4.0-i386 ALLOW_VULNERABLE_PACKAGES= _MAKE => /usr/bin/make MAKEOVERRIDES => ${-*-command-variables-*-} BSD_INSTALL_GAME_DIR => /usr/bin/install -d -o root -g wheel -m 755 BLOCKSIZE => 1k ALLOW_VULNERABLE_PACKAGES => BSD_INSTALL_SCRIPT_DIR => /usr/bin/install -d -o root -g wheel -m 755 PWD => /usr/pkgsrc/lang/php5/work/php-5.2.5 BSD_INSTALL_MAN => /usr/bin/install -c -o root -g wheel -m 444 BSD_INSTALL_LIB => /usr/bin/install -c -o root -g wheel -m 555 BSD_INSTALL_PROGRAM => /usr/bin/install -c -s -o root -g wheel -m 555 BSD_INSTALL_PROGRAM_DIR => /usr/bin/install -d -o root -g wheel -m 755 DBUS_SESSION_BUS_ADDRESS => unix:path=/tmp/dbus-OPEGY4xzXs,guid=b5a246f10c78fcbc0a0c240047a73eb1 LANG => C _CC => /usr/bin/cc HOME => /root LINK_ALL_LIBGCC_HACK => _ => /usr/bin/make BSD_INSTALL_GAME_DATA => /usr/bin/install -c -o root -g wheel -m 444 BSD_INSTALL_DATA => /usr/bin/install -c -o root -g wheel -m 444 PATH => /usr/pkgsrc/lang/php5/work/.wrapper/bin:/usr/pkgsrc/lang/php5/work/.buildlink/bin:/usr/pkgsrc/lang/php5/work/.gcc/bin:/usr/pkgsrc/lang/php5/work/.tools/bin:/usr/pkg/bin:/sbin:/usr/sbin:/bin:/usr/bin:/usr/pkg/sbin:/usr/pkg/bin:/usr/X11R6/bin:/usr/local/sbin:/usr/local/bin:/usr/pkg/bin:/usr/X11R6/bin CXXFLAGS => -O2 -I/usr/pkg/include -I/usr/include -prefer-non-pic -static HOST => plex.tesco-europe.com SSH_CONNECTION => deleted LC_MESSAGES => C BSD_INSTALL_GAME => /usr/bin/install -c -s -o root -g wheel -m 555 _SRC_TOP_ => NO_WHOLE_ARCHIVE_FLAG => -Wl,--no-whole-archive SSH_TTY => deleted WRAPPER_REORDER => yes VIEWBASE => /usr/pkg MAKELEVEL => 1 BSD_INSTALL_SCRIPT => /usr/bin/install -c -o root -g wheel -m 555 SSH_AGENT_PID => 304 TEST_PHP_EXECUTABLE => /usr/pkgsrc/lang/php5/work/php-5.2.5/sapi/cli/php TERM => xterm TERMCAP => vt100|vt100-am:am:bs:ms:xn:xo:co#80:it#8:li#24:vt#3:@8=\EOM:DO=\E[%dB:K1=\EOq:K2=\EOr:K3=\EOs:K4=\EOp:K5=\EOn:LE=\E[%dD:RA=\E[?7l:RI=\E[%dC:SA=\E[?7h:UP=\E[%dA:ac=\140\140aaffggjjkkllmmnnooppqqrrssttuuvvwwxxyyzz{{||}}~~:ae=\E(B:as=\E(0:bl=^G:cb=\E[1K:cd=\E[J:ce=\E[K:cl=\E[H\E[J:cm=\E[%i%d;%dH:cr=^M:cs=\E[%i%d;%dr:ct=\E[3g:do=^J:eA=\E(B:ho=\E[H:k0=\EOy:k1=\EOP:k2=\EOQ:k3=\EOR:k4=\EOS:k5=\EOt:k6=\EOu:k7=\EOv:k8=\EOl:k9=\EOw:k;=\EOx:kb=^H:kd=\EOB:ke=\E[?1l\E>:kl=\EOD:kr=\EOC:ks=\E[?1h\E=:ku=\EOA:le=^H:mb=\E[5m:md=\E[1m:me=\E[m\017:mr=\E[7m:nd=\E[C:r2=\E>\E[?3l\E[?4l\E[?5l\E[?7h\E[?8h:rc=\E8:sc=\E7:se=\E[m:sf=^J:so=\E[7m:sr=\EM:st=\EH:ta=^I:ue=\E[m:up=\E[A:us=\E[4m:ZZ=0x804d400: X11PREFIX => /usr/pkg LIBTOOL => /bin/sh /usr/pkgsrc/lang/php5/work/php-5.2.5/libtool --silent --preserve-dup-deps LC_NUMERIC => C SSH_AUTH_SOCK => deleted USER => root HOST_OSTYPE => NetBSD-4.0-i386 CC => cc FC => f77 LINKER_RPATH_FLAG => -R X11BASE => /usr/X11R6 CFLAGS => -O2 -I/usr/pkg/include -I/usr/include -prefer-non-pic -static WRAPPER_UPDATE_CACHE => yes PKG_CONFIG => USETOOLS => no XDG_DATA_DIRS => /usr/local/share:/usr/share:/usr/pkg/share LC_CTYPE => C SSH_CLIENT => deleted PREFIX => /usr/pkg FFLAGS => -O OS_VERSION => 4.0 BSD_INSTALL_DATA_DIR => /usr/bin/install -d -o root -g wheel -m 755 LC_COLLATE => C LOGNAME => root SHELL => /bin/ksh PKG_SYSCONFDIR => /usr/pkg/etc CPPFLAGS => -I/usr/pkg/include -I/usr/include -I/usr/pkg/include _PKGSRCDIR => /usr/pkgsrc DISPLAY => :0.0 INSTALL_INFO => BSD_INSTALL => /usr/bin/install LOWER_OPSYS => netbsd LC_TIME => C WINDOWID => 33554444 OPSYS => NetBSD LOCALBASE => /usr/pkg PKGTOOLS_VERSION => 20071224 DESKTOP_STARTUP_ID => _PATH_ORIG => /sbin:/usr/sbin:/bin:/usr/bin:/usr/pkg/sbin:/usr/pkg/bin:/usr/X11R6/bin:/usr/local/sbin:/usr/local/bin F77 => f77 COLORTERM => Terminal COMPILER_RPATH_FLAG => -Wl,-R PKG_CONFIG_LIBDIR => /usr/pkgsrc/lang/php5/work/.buildlink/lib/pkgconfig:/usr/pkgsrc/lang/php5/work/.buildlink/share/pkgconfig PKG_CONFIG_LOG => /usr/pkgsrc/lang/php5/work/.pkg-config.log LDFLAGS => -L/usr/pkg/lib -Wl,-R/usr/pkg/lib -L/usr/lib -Wl,-R/usr/lib SESSION_MANAGER => local/plex.tesco-europe.com:/tmp/.ICE-unix/1022 PKGMANDIR => man WHOLE_ARCHIVE_FLAG => -Wl,--whole-archive WRAPPER_DEBUG => no TEST_PHP_SRCDIR => /usr/pkgsrc/lang/php5/work/php-5.2.5 INSTALL_ROOT => BSD_INSTALL_MAN_DIR => /usr/bin/install -d -o root -g wheel -m 755 BSD_INSTALL_LIB_DIR => /usr/bin/install -d -o root -g wheel -m 755 _PKGSRC_BARRIER => yes MAKECONF => /dev/null CPP => cc -E OBJECT_FMT => ELF PHP Variables Variable => Value _SERVER["ENV"] => /root/.shrc _SERVER["LC_MONETARY"] => C _SERVER["CXX"] => c++ _SERVER["MAKEINFO"] => /usr/pkgsrc/lang/php5/work/.tools/bin/makeinfo _SERVER["MFLAGS"] => _SERVER["MAKEFLAGS"] => _SRC_TOP_= _PKGSRC_BARRIER=yes _PKGSRCDIR=/usr/pkgsrc _PATH_ORIG=/sbin:/usr/sbin:/bin:/usr/bin:/usr/pkg/sbin:/usr/pkg/bin:/usr/X11R6/bin:/usr/local/sbin:/usr/local/bin _MAKE=/usr/bin/make _CC=/usr/bin/cc PKGTOOLS_VERSION=20071224 OS_VERSION=4.0 OPSYS=NetBSD LOWER_OPSYS=netbsd HOST_OSTYPE=NetBSD-4.0-i386 ALLOW_VULNERABLE_PACKAGES= _SERVER["_MAKE"] => /usr/bin/make _SERVER["MAKEOVERRIDES"] => ${-*-command-variables-*-} _SERVER["BSD_INSTALL_GAME_DIR"] => /usr/bin/install -d -o root -g wheel -m 755 _SERVER["BLOCKSIZE"] => 1k _SERVER["ALLOW_VULNERABLE_PACKAGES"] => _SERVER["BSD_INSTALL_SCRIPT_DIR"] => /usr/bin/install -d -o root -g wheel -m 755 _SERVER["PWD"] => /usr/pkgsrc/lang/php5/work/php-5.2.5 _SERVER["BSD_INSTALL_MAN"] => /usr/bin/install -c -o root -g wheel -m 444 _SERVER["BSD_INSTALL_LIB"] => /usr/bin/install -c -o root -g wheel -m 555 _SERVER["BSD_INSTALL_PROGRAM"] => /usr/bin/install -c -s -o root -g wheel -m 555 _SERVER["BSD_INSTALL_PROGRAM_DIR"] => /usr/bin/install -d -o root -g wheel -m 755 _SERVER["DBUS_SESSION_BUS_ADDRESS"] => unix:path=/tmp/dbus-OPEGY4xzXs,guid=b5a246f10c78fcbc0a0c240047a73eb1 _SERVER["LANG"] => C _SERVER["_CC"] => /usr/bin/cc _SERVER["HOME"] => /root _SERVER["LINK_ALL_LIBGCC_HACK"] => _SERVER["_"] => /usr/bin/make _SERVER["BSD_INSTALL_GAME_DATA"] => /usr/bin/install -c -o root -g wheel -m 444 _SERVER["BSD_INSTALL_DATA"] => /usr/bin/install -c -o root -g wheel -m 444 _SERVER["PATH"] => /usr/pkgsrc/lang/php5/work/.wrapper/bin:/usr/pkgsrc/lang/php5/work/.buildlink/bin:/usr/pkgsrc/lang/php5/work/.gcc/bin:/usr/pkgsrc/lang/php5/work/.tools/bin:/usr/pkg/bin:/sbin:/usr/sbin:/bin:/usr/bin:/usr/pkg/sbin:/usr/pkg/bin:/usr/X11R6/bin:/usr/local/sbin:/usr/local/bin:/usr/pkg/bin:/usr/X11R6/bin _SERVER["CXXFLAGS"] => -O2 -I/usr/pkg/include -I/usr/include -prefer-non-pic -static _SERVER["HOST"] => plex.tesco-europe.com _SERVER["SSH_CONNECTION"] => deleted _SERVER["LC_MESSAGES"] => C _SERVER["BSD_INSTALL_GAME"] => /usr/bin/install -c -s -o root -g wheel -m 555 _SERVER["_SRC_TOP_"] => _SERVER["NO_WHOLE_ARCHIVE_FLAG"] => -Wl,--no-whole-archive _SERVER["SSH_TTY"] => deleted _SERVER["WRAPPER_REORDER"] => yes _SERVER["VIEWBASE"] => /usr/pkg _SERVER["MAKELEVEL"] => 1 _SERVER["BSD_INSTALL_SCRIPT"] => /usr/bin/install -c -o root -g wheel -m 555 _SERVER["SSH_AGENT_PID"] => 304 _SERVER["TEST_PHP_EXECUTABLE"] => /usr/pkgsrc/lang/php5/work/php-5.2.5/sapi/cli/php _SERVER["TERM"] => xterm _SERVER["TERMCAP"] => vt100|vt100-am:am:bs:ms:xn:xo:co#80:it#8:li#24:vt#3:@8=\EOM:DO=\E[%dB:K1=\EOq:K2=\EOr:K3=\EOs:K4=\EOp:K5=\EOn:LE=\E[%dD:RA=\E[?7l:RI=\E[%dC:SA=\E[?7h:UP=\E[%dA:ac=\140\140aaffggjjkkllmmnnooppqqrrssttuuvvwwxxyyzz{{||}}~~:ae=\E(B:as=\E(0:bl=^G:cb=\E[1K:cd=\E[J:ce=\E[K:cl=\E[H\E[J:cm=\E[%i%d;%dH:cr=^M:cs=\E[%i%d;%dr:ct=\E[3g:do=^J:eA=\E(B:ho=\E[H:k0=\EOy:k1=\EOP:k2=\EOQ:k3=\EOR:k4=\EOS:k5=\EOt:k6=\EOu:k7=\EOv:k8=\EOl:k9=\EOw:k;=\EOx:kb=^H:kd=\EOB:ke=\E[?1l\E>:kl=\EOD:kr=\EOC:ks=\E[?1h\E=:ku=\EOA:le=^H:mb=\E[5m:md=\E[1m:me=\E[m\017:mr=\E[7m:nd=\E[C:r2=\E>\E[?3l\E[?4l\E[?5l\E[?7h\E[?8h:rc=\E8:sc=\E7:se=\E[m:sf=^J:so=\E[7m:sr=\EM:st=\EH:ta=^I:ue=\E[m:up=\E[A:us=\E[4m:ZZ=0x804d400: _SERVER["X11PREFIX"] => /usr/pkg _SERVER["LIBTOOL"] => /bin/sh /usr/pkgsrc/lang/php5/work/php-5.2.5/libtool --silent --preserve-dup-deps _SERVER["LC_NUMERIC"] => C _SERVER["SSH_AUTH_SOCK"] => deleted _SERVER["USER"] => root _SERVER["HOST_OSTYPE"] => NetBSD-4.0-i386 _SERVER["CC"] => cc _SERVER["FC"] => f77 _SERVER["LINKER_RPATH_FLAG"] => -R _SERVER["X11BASE"] => /usr/X11R6 _SERVER["CFLAGS"] => -O2 -I/usr/pkg/include -I/usr/include -prefer-non-pic -static _SERVER["WRAPPER_UPDATE_CACHE"] => yes _SERVER["PKG_CONFIG"] => _SERVER["USETOOLS"] => no _SERVER["XDG_DATA_DIRS"] => /usr/local/share:/usr/share:/usr/pkg/share _SERVER["LC_CTYPE"] => C _SERVER["SSH_CLIENT"] => deleted _SERVER["PREFIX"] => /usr/pkg _SERVER["FFLAGS"] => -O _SERVER["OS_VERSION"] => 4.0 _SERVER["BSD_INSTALL_DATA_DIR"] => /usr/bin/install -d -o root -g wheel -m 755 _SERVER["LC_COLLATE"] => C _SERVER["LOGNAME"] => root _SERVER["SHELL"] => /bin/ksh _SERVER["PKG_SYSCONFDIR"] => /usr/pkg/etc _SERVER["CPPFLAGS"] => -I/usr/pkg/include -I/usr/include -I/usr/pkg/include _SERVER["_PKGSRCDIR"] => /usr/pkgsrc _SERVER["DISPLAY"] => :0.0 _SERVER["INSTALL_INFO"] => _SERVER["BSD_INSTALL"] => /usr/bin/install _SERVER["LOWER_OPSYS"] => netbsd _SERVER["LC_TIME"] => C _SERVER["WINDOWID"] => 33554444 _SERVER["OPSYS"] => NetBSD _SERVER["LOCALBASE"] => /usr/pkg _SERVER["PKGTOOLS_VERSION"] => 20071224 _SERVER["DESKTOP_STARTUP_ID"] => _SERVER["_PATH_ORIG"] => /sbin:/usr/sbin:/bin:/usr/bin:/usr/pkg/sbin:/usr/pkg/bin:/usr/X11R6/bin:/usr/local/sbin:/usr/local/bin _SERVER["F77"] => f77 _SERVER["COLORTERM"] => Terminal _SERVER["COMPILER_RPATH_FLAG"] => -Wl,-R _SERVER["PKG_CONFIG_LIBDIR"] => /usr/pkgsrc/lang/php5/work/.buildlink/lib/pkgconfig:/usr/pkgsrc/lang/php5/work/.buildlink/share/pkgconfig _SERVER["PKG_CONFIG_LOG"] => /usr/pkgsrc/lang/php5/work/.pkg-config.log _SERVER["LDFLAGS"] => -L/usr/pkg/lib -Wl,-R/usr/pkg/lib -L/usr/lib -Wl,-R/usr/lib _SERVER["SESSION_MANAGER"] => local/plex.tesco-europe.com:/tmp/.ICE-unix/1022 _SERVER["PKGMANDIR"] => man _SERVER["WHOLE_ARCHIVE_FLAG"] => -Wl,--whole-archive _SERVER["WRAPPER_DEBUG"] => no _SERVER["TEST_PHP_SRCDIR"] => /usr/pkgsrc/lang/php5/work/php-5.2.5 _SERVER["INSTALL_ROOT"] => _SERVER["BSD_INSTALL_MAN_DIR"] => /usr/bin/install -d -o root -g wheel -m 755 _SERVER["BSD_INSTALL_LIB_DIR"] => /usr/bin/install -d -o root -g wheel -m 755 _SERVER["_PKGSRC_BARRIER"] => yes _SERVER["MAKECONF"] => /dev/null _SERVER["CPP"] => cc -E _SERVER["OBJECT_FMT"] => ELF _SERVER["PHP_SELF"] => _SERVER["SCRIPT_NAME"] => _SERVER["SCRIPT_FILENAME"] => _SERVER["PATH_TRANSLATED"] => _SERVER["DOCUMENT_ROOT"] => _SERVER["REQUEST_TIME"] => 1202167496 _SERVER["argv"] => Array ( ) _SERVER["argc"] => 0 _ENV["ENV"] => /root/.shrc _ENV["LC_MONETARY"] => C _ENV["CXX"] => c++ _ENV["MAKEINFO"] => /usr/pkgsrc/lang/php5/work/.tools/bin/makeinfo _ENV["MFLAGS"] => _ENV["MAKEFLAGS"] => _SRC_TOP_= _PKGSRC_BARRIER=yes _PKGSRCDIR=/usr/pkgsrc _PATH_ORIG=/sbin:/usr/sbin:/bin:/usr/bin:/usr/pkg/sbin:/usr/pkg/bin:/usr/X11R6/bin:/usr/local/sbin:/usr/local/bin _MAKE=/usr/bin/make _CC=/usr/bin/cc PKGTOOLS_VERSION=20071224 OS_VERSION=4.0 OPSYS=NetBSD LOWER_OPSYS=netbsd HOST_OSTYPE=NetBSD-4.0-i386 ALLOW_VULNERABLE_PACKAGES= _ENV["_MAKE"] => /usr/bin/make _ENV["MAKEOVERRIDES"] => ${-*-command-variables-*-} _ENV["BSD_INSTALL_GAME_DIR"] => /usr/bin/install -d -o root -g wheel -m 755 _ENV["BLOCKSIZE"] => 1k _ENV["ALLOW_VULNERABLE_PACKAGES"] => _ENV["BSD_INSTALL_SCRIPT_DIR"] => /usr/bin/install -d -o root -g wheel -m 755 _ENV["PWD"] => /usr/pkgsrc/lang/php5/work/php-5.2.5 _ENV["BSD_INSTALL_MAN"] => /usr/bin/install -c -o root -g wheel -m 444 _ENV["BSD_INSTALL_LIB"] => /usr/bin/install -c -o root -g wheel -m 555 _ENV["BSD_INSTALL_PROGRAM"] => /usr/bin/install -c -s -o root -g wheel -m 555 _ENV["BSD_INSTALL_PROGRAM_DIR"] => /usr/bin/install -d -o root -g wheel -m 755 _ENV["DBUS_SESSION_BUS_ADDRESS"] => unix:path=/tmp/dbus-OPEGY4xzXs,guid=b5a246f10c78fcbc0a0c240047a73eb1 _ENV["LANG"] => C _ENV["_CC"] => /usr/bin/cc _ENV["HOME"] => /root _ENV["LINK_ALL_LIBGCC_HACK"] => _ENV["_"] => /usr/bin/make _ENV["BSD_INSTALL_GAME_DATA"] => /usr/bin/install -c -o root -g wheel -m 444 _ENV["BSD_INSTALL_DATA"] => /usr/bin/install -c -o root -g wheel -m 444 _ENV["PATH"] => /usr/pkgsrc/lang/php5/work/.wrapper/bin:/usr/pkgsrc/lang/php5/work/.buildlink/bin:/usr/pkgsrc/lang/php5/work/.gcc/bin:/usr/pkgsrc/lang/php5/work/.tools/bin:/usr/pkg/bin:/sbin:/usr/sbin:/bin:/usr/bin:/usr/pkg/sbin:/usr/pkg/bin:/usr/X11R6/bin:/usr/local/sbin:/usr/local/bin:/usr/pkg/bin:/usr/X11R6/bin _ENV["CXXFLAGS"] => -O2 -I/usr/pkg/include -I/usr/include -prefer-non-pic -static _ENV["HOST"] => plex.tesco-europe.com _ENV["SSH_CONNECTION"] => deleted _ENV["LC_MESSAGES"] => C _ENV["BSD_INSTALL_GAME"] => /usr/bin/install -c -s -o root -g wheel -m 555 _ENV["_SRC_TOP_"] => _ENV["NO_WHOLE_ARCHIVE_FLAG"] => -Wl,--no-whole-archive _ENV["SSH_TTY"] => deleted _ENV["WRAPPER_REORDER"] => yes _ENV["VIEWBASE"] => /usr/pkg _ENV["MAKELEVEL"] => 1 _ENV["BSD_INSTALL_SCRIPT"] => /usr/bin/install -c -o root -g wheel -m 555 _ENV["SSH_AGENT_PID"] => 304 _ENV["TEST_PHP_EXECUTABLE"] => /usr/pkgsrc/lang/php5/work/php-5.2.5/sapi/cli/php _ENV["TERM"] => xterm _ENV["TERMCAP"] => vt100|vt100-am:am:bs:ms:xn:xo:co#80:it#8:li#24:vt#3:@8=\EOM:DO=\E[%dB:K1=\EOq:K2=\EOr:K3=\EOs:K4=\EOp:K5=\EOn:LE=\E[%dD:RA=\E[?7l:RI=\E[%dC:SA=\E[?7h:UP=\E[%dA:ac=\140\140aaffggjjkkllmmnnooppqqrrssttuuvvwwxxyyzz{{||}}~~:ae=\E(B:as=\E(0:bl=^G:cb=\E[1K:cd=\E[J:ce=\E[K:cl=\E[H\E[J:cm=\E[%i%d;%dH:cr=^M:cs=\E[%i%d;%dr:ct=\E[3g:do=^J:eA=\E(B:ho=\E[H:k0=\EOy:k1=\EOP:k2=\EOQ:k3=\EOR:k4=\EOS:k5=\EOt:k6=\EOu:k7=\EOv:k8=\EOl:k9=\EOw:k;=\EOx:kb=^H:kd=\EOB:ke=\E[?1l\E>:kl=\EOD:kr=\EOC:ks=\E[?1h\E=:ku=\EOA:le=^H:mb=\E[5m:md=\E[1m:me=\E[m\017:mr=\E[7m:nd=\E[C:r2=\E>\E[?3l\E[?4l\E[?5l\E[?7h\E[?8h:rc=\E8:sc=\E7:se=\E[m:sf=^J:so=\E[7m:sr=\EM:st=\EH:ta=^I:ue=\E[m:up=\E[A:us=\E[4m:ZZ=0x804d400: _ENV["X11PREFIX"] => /usr/pkg _ENV["LIBTOOL"] => /bin/sh /usr/pkgsrc/lang/php5/work/php-5.2.5/libtool --silent --preserve-dup-deps _ENV["LC_NUMERIC"] => C _ENV["SSH_AUTH_SOCK"] => deleted _ENV["USER"] => root _ENV["HOST_OSTYPE"] => NetBSD-4.0-i386 _ENV["CC"] => cc _ENV["FC"] => f77 _ENV["LINKER_RPATH_FLAG"] => -R _ENV["X11BASE"] => /usr/X11R6 _ENV["CFLAGS"] => -O2 -I/usr/pkg/include -I/usr/include -prefer-non-pic -static _ENV["WRAPPER_UPDATE_CACHE"] => yes _ENV["PKG_CONFIG"] => _ENV["USETOOLS"] => no _ENV["XDG_DATA_DIRS"] => /usr/local/share:/usr/share:/usr/pkg/share _ENV["LC_CTYPE"] => C _ENV["SSH_CLIENT"] => deleted _ENV["PREFIX"] => /usr/pkg _ENV["FFLAGS"] => -O _ENV["OS_VERSION"] => 4.0 _ENV["BSD_INSTALL_DATA_DIR"] => /usr/bin/install -d -o root -g wheel -m 755 _ENV["LC_COLLATE"] => C _ENV["LOGNAME"] => root _ENV["SHELL"] => /bin/ksh _ENV["PKG_SYSCONFDIR"] => /usr/pkg/etc _ENV["CPPFLAGS"] => -I/usr/pkg/include -I/usr/include -I/usr/pkg/include _ENV["_PKGSRCDIR"] => /usr/pkgsrc _ENV["DISPLAY"] => :0.0 _ENV["INSTALL_INFO"] => _ENV["BSD_INSTALL"] => /usr/bin/install _ENV["LOWER_OPSYS"] => netbsd _ENV["LC_TIME"] => C _ENV["WINDOWID"] => 33554444 _ENV["OPSYS"] => NetBSD _ENV["LOCALBASE"] => /usr/pkg _ENV["PKGTOOLS_VERSION"] => 20071224 _ENV["DESKTOP_STARTUP_ID"] => _ENV["_PATH_ORIG"] => /sbin:/usr/sbin:/bin:/usr/bin:/usr/pkg/sbin:/usr/pkg/bin:/usr/X11R6/bin:/usr/local/sbin:/usr/local/bin _ENV["F77"] => f77 _ENV["COLORTERM"] => Terminal _ENV["COMPILER_RPATH_FLAG"] => -Wl,-R _ENV["PKG_CONFIG_LIBDIR"] => /usr/pkgsrc/lang/php5/work/.buildlink/lib/pkgconfig:/usr/pkgsrc/lang/php5/work/.buildlink/share/pkgconfig _ENV["PKG_CONFIG_LOG"] => /usr/pkgsrc/lang/php5/work/.pkg-config.log _ENV["LDFLAGS"] => -L/usr/pkg/lib -Wl,-R/usr/pkg/lib -L/usr/lib -Wl,-R/usr/lib _ENV["SESSION_MANAGER"] => local/plex.tesco-europe.com:/tmp/.ICE-unix/1022 _ENV["PKGMANDIR"] => man _ENV["WHOLE_ARCHIVE_FLAG"] => -Wl,--whole-archive _ENV["WRAPPER_DEBUG"] => no _ENV["TEST_PHP_SRCDIR"] => /usr/pkgsrc/lang/php5/work/php-5.2.5 _ENV["INSTALL_ROOT"] => _ENV["BSD_INSTALL_MAN_DIR"] => /usr/bin/install -d -o root -g wheel -m 755 _ENV["BSD_INSTALL_LIB_DIR"] => /usr/bin/install -d -o root -g wheel -m 755 _ENV["_PKGSRC_BARRIER"] => yes _ENV["MAKECONF"] => /dev/null _ENV["CPP"] => cc -E _ENV["OBJECT_FMT"] => ELF PHP License This program is free software; you can redistribute it and/or modify it under the terms of the PHP License as published by the PHP Group and included in the distribution in the file: LICENSE This program is distributed in the hope that it will be useful, but WITHOUT ANY WARRANTY; without even the implied warranty of MERCHANTABILITY or FITNESS FOR A PARTICULAR PURPOSE. If you did not receive a copy of the PHP license, or have any questions about PHP licensing, please contact license@php.net.

« previous php.qa (#62823) next »