Test results for 5.2.5 [failed]

From: Date: Tue, 05 Feb 2008 00:37:37 +0000
Subject: Test results for 5.2.5 [failed]
Groups: php.qa 
Request: Send a blank email to php-qa+get-62831@lists.php.net to get a copy of this message
===================================================================== FAILED TEST SUMMARY --------------------------------------------------------------------- Bug #20539 (PHP CLI Segmentation Fault) [tests/basic/bug20539.phpt] date OO cloning [ext/date/tests/oo_002.phpt] iconv stream filter [ext/iconv/tests/iconv_stream_filter.phpt] Test setlocale() function : basic functionality - passing multiple locales as argument [ext/standard/tests/strings/setlocale_basic3.phpt] Test setlocale() function : usage variations - passing multiple valid/invlaid locales as argument [ext/standard/tests/strings/setlocale_variation1.phpt] Test setlocale() function : usage variations - Setting all available locales in the platform [ext/standard/tests/strings/setlocale_variation2.phpt] Test setlocale() function : usage variations - setting system locale = 0 [ext/standard/tests/strings/setlocale_variation3.phpt] Test setlocale() function : usage variations - setting system locale as null [ext/standard/tests/strings/setlocale_variation4.phpt] Test setlocale() function : usage variations - Setting system locale as empty string [ext/standard/tests/strings/setlocale_variation5.phpt] ===================================================================== ===================================================================== TEST RESULT SUMMARY --------------------------------------------------------------------- Exts skipped : 63 Exts tested : 16 --------------------------------------------------------------------- Number of tests : 4566 2807 Tests skipped : 1759 ( 38.5%) -------- Tests warned : 0 ( 0.0%) ( 0.0%) Tests failed : 9 ( 0.2%) ( 0.3%) Tests passed : 2798 ( 61.3%) ( 99.7%) --------------------------------------------------------------------- Time taken : 209 seconds ===================================================================== ===================================================================== FAILED TEST SUMMARY --------------------------------------------------------------------- Bug #20539 (PHP CLI Segmentation Fault) [tests/basic/bug20539.phpt] date OO cloning [ext/date/tests/oo_002.phpt] iconv stream filter [ext/iconv/tests/iconv_stream_filter.phpt] Test setlocale() function : basic functionality - passing multiple locales as argument [ext/standard/tests/strings/setlocale_basic3.phpt] Test setlocale() function : usage variations - passing multiple valid/invlaid locales as argument [ext/standard/tests/strings/setlocale_variation1.phpt] Test setlocale() function : usage variations - Setting all available locales in the platform [ext/standard/tests/strings/setlocale_variation2.phpt] Test setlocale() function : usage variations - setting system locale = 0 [ext/standard/tests/strings/setlocale_variation3.phpt] Test setlocale() function : usage variations - setting system locale as null [ext/standard/tests/strings/setlocale_variation4.phpt] Test setlocale() function : usage variations - Setting system locale as empty string [ext/standard/tests/strings/setlocale_variation5.phpt] ===================================================================== ================================================================================ /usr/local/src/admin/php-5.2.5/tests/basic/bug20539.phpt ================================================================================ Warning: Unknown: open(/usr/local/opal/web/session/sess_f98ote4hpq150fbm3njs94r355, O_RDWR) failed: No such file or directory (2) in Unknown on line 0 Warning: Unknown: Cannot send session cookie - headers already sent in Unknown on line 0 Warning: Unknown: Cannot send session cache limiter - headers already sent in Unknown on line 0 good :) Warning: Unknown: open(/usr/local/opal/web/session/sess_f98ote4hpq150fbm3njs94r355, O_RDWR) failed: No such file or directory (2) in Unknown on line 0 Warning: Unknown: Failed to write session data (files). Please verify that the current setting of session.save_path is correct (/usr/local/opal/web/session) in Unknown on line 0 ================================================================================ 001+ Warning: Unknown: open(/usr/local/opal/web/session/sess_f98ote4hpq150fbm3njs94r355, O_RDWR) failed: No such file or directory (2) in Unknown on line 0 002+ 003+ Warning: Unknown: Cannot send session cookie - headers already sent in Unknown on line 0 004+ 005+ Warning: Unknown: Cannot send session cache limiter - headers already sent in Unknown on line 0 007+ 008+ Warning: Unknown: open(/usr/local/opal/web/session/sess_f98ote4hpq150fbm3njs94r355, O_RDWR) failed: No such file or directory (2) in Unknown on line 0 009+ 010+ Warning: Unknown: Failed to write session data (files). Please verify that the current setting of session.save_path is correct (/usr/local/opal/web/session) in Unknown on line 0 ================================================================================ ================================================================================ /usr/local/src/admin/php-5.2.5/ext/date/tests/oo_002.phpt ================================================================================ string(29) "Fri, 01 Aug 08 13:00:00 +0000" string(29) "Fri, 01 Aug 08 13:00:00 +0000" string(29) "Fri, 01 Aug 08 14:00:00 +0000" string(29) "Fri, 01 Aug 08 12:59:59 +0000" string(10) "Asia/Tokyo" string(10) "Asia/Tokyo" ================================================================================ 001+ string(29) "Fri, 01 Aug 08 13:00:00 +0000" 002+ string(29) "Fri, 01 Aug 08 13:00:00 +0000" 003+ string(29) "Fri, 01 Aug 08 14:00:00 +0000" 004+ string(29) "Fri, 01 Aug 08 12:59:59 +0000" 001- string(29) "Wed, 01 Aug 07 13:00:00 +0000" 002- string(29) "Wed, 01 Aug 07 13:00:00 +0000" 003- string(29) "Wed, 01 Aug 07 14:00:00 +0000" 004- string(29) "Wed, 01 Aug 07 12:59:59 +0000" ================================================================================ ================================================================================ /usr/local/src/admin/php-5.2.5/ext/iconv/tests/iconv_stream_filter.phpt ================================================================================ string(20) "1b244224332473244b24" string(10) "41244f1b28" string(2) "42" string(20) "a4b3a4f3a4cba4c1a4cf" string(10) "69636f6e76" string(2) "0a" string(20) "1b244f24332466245824" string(10) "4e24421b28" string(2) "4f" ================================================================================ 007+ string(20) "1b244f24332466245824" 008+ string(10) "4e24421b28" 009+ string(2) "4f" 007- 008- Warning: fread(): iconv stream filter ("ISO-2022-JP"=>"EUC-JP"): invalid multibyte sequence in %s on line %d 009- string(0) "" 010- string(0) "" 011- string(0) "" ================================================================================ ================================================================================ /usr/local/src/admin/php-5.2.5/ext/standard/tests/strings/setlocale_basic3.phpt ================================================================================ *** Testing setlocale() by passing multiple locales as argument *** Done ================================================================================ 002- -- Testing setlocale() by giving 'category' as LC_ALL & multiple locales(en_US.utf8, Ko_KR.utf8, zh_CN.utf8) -- 003- string(%d) "%s" 004- Checking currency settings in the new locale, expected: %s, Found: %s 005- Test PASSED. ================================================================================ ================================================================================ /usr/local/src/admin/php-5.2.5/ext/standard/tests/strings/setlocale_variation1.phpt ================================================================================ *** Testing setlocale() by passing multiple valid/invalid locales as argument *** Done ================================================================================ 002- -- Testing setlocale() by giving 'category' as LC_ALL & multiple locales(en_US.invalid, en_US.utf8, Ko_KR.utf8, KO_KR.invalid, zh_CN.utf8) -- 003- string(%d) "%s" 004- Checking currency settings in the new locale, expected: %s, Found: %s 005- Test PASSED. ================================================================================ ================================================================================ /usr/local/src/admin/php-5.2.5/ext/standard/tests/strings/setlocale_variation2.phpt ================================================================================ *** Testing setlocale() : usage variations *** -- Test setlocale() with all available locale in the system -- No of locales found on the machine = 363 No of setlocale() success = 362 Expected no of failures = 0 Test FAILED Names of locale() for which setlocale() failed ... array(1) { [0]=> string(16) "nb_NO.ISO-8859-1" } Done ================================================================================ 006+ Test FAILED 007+ Names of locale() for which setlocale() failed ... 008+ array(1) { 009+ [0]=> 010+ string(16) "nb_NO.ISO-8859-1" 011+ } 006- Test PASSED ================================================================================ ================================================================================ /usr/local/src/admin/php-5.2.5/ext/standard/tests/strings/setlocale_variation3.phpt ================================================================================ *** Testing setlocale() : usage variations - setting system locale = 0 *** Locale info, before setting the locale array(18) { ["decimal_point"]=> string(1) "." ["thousands_sep"]=> string(0) "" ["int_curr_symbol"]=> string(0) "" ["currency_symbol"]=> string(0) "" ["mon_decimal_point"]=> string(0) "" ["mon_thousands_sep"]=> string(0) "" ["positive_sign"]=> string(0) "" ["negative_sign"]=> string(0) "" ["int_frac_digits"]=> int(127) ["frac_digits"]=> int(127) ["p_cs_precedes"]=> int(127) ["p_sep_by_space"]=> int(127) ["n_cs_precedes"]=> int(127) ["n_sep_by_space"]=> int(127) ["p_sign_posn"]=> int(127) ["n_sign_posn"]=> int(127) ["grouping"]=> array(0) { } ["mon_grouping"]=> array(0) { } } Setting system locale, category = LC_ALL and locale = 0 Locale info, after setting the locale array(18) { ["decimal_point"]=> string(1) "." ["thousands_sep"]=> string(0) "" ["int_curr_symbol"]=> string(0) "" ["currency_symbol"]=> string(0) "" ["mon_decimal_point"]=> string(0) "" ["mon_thousands_sep"]=> string(0) "" ["positive_sign"]=> string(0) "" ["negative_sign"]=> string(0) "" ["int_frac_digits"]=> int(127) ["frac_digits"]=> int(127) ["p_cs_precedes"]=> int(127) ["p_sep_by_space"]=> int(127) ["n_cs_precedes"]=> int(127) ["n_sep_by_space"]=> int(127) ["p_sign_posn"]=> int(127) ["n_sign_posn"]=> int(127) ["grouping"]=> array(0) { } ["mon_grouping"]=> array(0) { } } Checking locale in the system, Expected : no change in the existing locale Test PASSED. Done ================================================================================ 007+ string(0) "" 007- string(1) "," 009+ string(0) "" 009- string(4) "USD " 011+ string(0) "" 011- string(1) "$" 013+ string(0) "" 013- string(1) "." 015+ string(0) "" 015- string(1) "," 019+ string(0) "" 019- string(1) "-" 021+ int(127) 021- int(2) 023+ int(127) 023- int(2) 025+ int(127) 025- int(1) 027+ int(127) 027- int(0) 029+ int(127) 029- int(1) 031+ int(127) 031- int(0) 033+ int(127) 033- int(1) 035+ int(127) 035- int(1) 037+ array(0) { 037- array(2) { 038- [0]=> 039- int(3) 040- [1]=> 041- int(3) 040+ array(0) { 044- array(2) { 045- [0]=> 046- int(3) 047- [1]=> 048- int(3) 049+ string(0) "" 051+ string(0) "" 053+ string(0) "" 055+ string(0) "" 057+ string(0) "" 057- string(1) "," 059- string(4) "USD " 061+ string(0) "" 061- string(1) "$" 063+ int(127) 063- string(1) "." 065+ int(127) 065- string(1) "," 067+ int(127) 069+ int(127) 069- string(1) "-" 071+ int(127) 071- int(2) 073+ int(127) 073- int(2) 075+ int(127) 075- int(1) 077+ int(127) 077- int(0) 079+ array(0) { 079- int(1) 081- int(0) 082+ array(0) { 083- int(1) 085- int(1) 087- array(2) { 088- [0]=> 089- int(3) 090- [1]=> 091- int(3) 094- array(2) { 095- [0]=> 096- int(3) 097- [1]=> 098- int(3) ================================================================================ ================================================================================ /usr/local/src/admin/php-5.2.5/ext/standard/tests/strings/setlocale_variation4.phpt ================================================================================ *** Testing setlocale() : usage variations - Setting system locale = null *** Locale info, before setting the locale array(18) { ["decimal_point"]=> string(1) "." ["thousands_sep"]=> string(0) "" ["int_curr_symbol"]=> string(0) "" ["currency_symbol"]=> string(0) "" ["mon_decimal_point"]=> string(0) "" ["mon_thousands_sep"]=> string(0) "" ["positive_sign"]=> string(0) "" ["negative_sign"]=> string(0) "" ["int_frac_digits"]=> int(127) ["frac_digits"]=> int(127) ["p_cs_precedes"]=> int(127) ["p_sep_by_space"]=> int(127) ["n_cs_precedes"]=> int(127) ["n_sep_by_space"]=> int(127) ["p_sign_posn"]=> int(127) ["n_sign_posn"]=> int(127) ["grouping"]=> array(0) { } ["mon_grouping"]=> array(0) { } } Setting system locale, category = LC_ALL and locale = null Locale info, after setting the locale array(18) { ["decimal_point"]=> string(1) "." ["thousands_sep"]=> string(0) "" ["int_curr_symbol"]=> string(0) "" ["currency_symbol"]=> string(0) "" ["mon_decimal_point"]=> string(0) "" ["mon_thousands_sep"]=> string(0) "" ["positive_sign"]=> string(0) "" ["negative_sign"]=> string(0) "" ["int_frac_digits"]=> int(127) ["frac_digits"]=> int(127) ["p_cs_precedes"]=> int(127) ["p_sep_by_space"]=> int(127) ["n_cs_precedes"]=> int(127) ["n_sep_by_space"]=> int(127) ["p_sign_posn"]=> int(127) ["n_sign_posn"]=> int(127) ["grouping"]=> array(0) { } ["mon_grouping"]=> array(0) { } } Checking new locale in the system, Expected : the locale names will be set from the values of environment variables Test FAILED. Done ================================================================================ 007+ string(0) "" 007- string(1) "," 009+ string(0) "" 009- string(4) "AUD " 011+ string(0) "" 011- string(1) "$" 013+ string(0) "" 013- string(1) "." 015+ string(0) "" 015- string(1) "," 019+ string(0) "" 019- string(1) "-" 021+ int(127) 021- int(2) 023+ int(127) 023- int(2) 025+ int(127) 025- int(1) 027+ int(127) 027- int(0) 029+ int(127) 029- int(1) 031+ int(127) 031- int(0) 033+ int(127) 033- int(1) 035+ int(127) 035- int(1) 037+ array(0) { 037- array(2) { 038- [0]=> 039- int(3) 040- [1]=> 041- int(3) 040+ array(0) { 044- array(2) { 045- [0]=> 046- int(3) 047- [1]=> 048- int(3) 049+ string(0) "" 051+ string(0) "" 053+ string(0) "" 055+ string(0) "" 057+ string(0) "" 057- string(1) "," 059- string(4) "USD " 061+ string(0) "" 061- string(1) "$" 063+ int(127) 063- string(1) "." 065+ int(127) 065- string(1) "," 067+ int(127) 069+ int(127) 069- string(1) "-" 071+ int(127) 071- int(2) 073+ int(127) 073- int(2) 075+ int(127) 075- int(1) 077+ int(127) 077- int(0) 079+ array(0) { 079- int(1) 081- int(0) 082+ array(0) { 083- int(1) 085- int(1) 086+ Test FAILED. 087- array(2) { 088- [0]=> 089- int(3) 090- [1]=> 091- int(3) 094- array(2) { 095- [0]=> 096- int(3) 097- [1]=> 098- int(3) 102- Test PASSED. ================================================================================ ================================================================================ /usr/local/src/admin/php-5.2.5/ext/standard/tests/strings/setlocale_variation5.phpt ================================================================================ *** Testing setlocale() : usage variations - setting system locale = "" *** Locale info, before setting the locale array(18) { ["decimal_point"]=> string(1) "." ["thousands_sep"]=> string(0) "" ["int_curr_symbol"]=> string(0) "" ["currency_symbol"]=> string(0) "" ["mon_decimal_point"]=> string(0) "" ["mon_thousands_sep"]=> string(0) "" ["positive_sign"]=> string(0) "" ["negative_sign"]=> string(0) "" ["int_frac_digits"]=> int(127) ["frac_digits"]=> int(127) ["p_cs_precedes"]=> int(127) ["p_sep_by_space"]=> int(127) ["n_cs_precedes"]=> int(127) ["n_sep_by_space"]=> int(127) ["p_sign_posn"]=> int(127) ["n_sign_posn"]=> int(127) ["grouping"]=> array(0) { } ["mon_grouping"]=> array(0) { } } Setting system locale, category = LC_ALL and locale = "" Locale info, after setting the locale array(18) { ["decimal_point"]=> string(1) "." ["thousands_sep"]=> string(0) "" ["int_curr_symbol"]=> string(0) "" ["currency_symbol"]=> string(0) "" ["mon_decimal_point"]=> string(0) "" ["mon_thousands_sep"]=> string(0) "" ["positive_sign"]=> string(0) "" ["negative_sign"]=> string(0) "" ["int_frac_digits"]=> int(127) ["frac_digits"]=> int(127) ["p_cs_precedes"]=> int(127) ["p_sep_by_space"]=> int(127) ["n_cs_precedes"]=> int(127) ["n_sep_by_space"]=> int(127) ["p_sign_posn"]=> int(127) ["n_sign_posn"]=> int(127) ["grouping"]=> array(0) { } ["mon_grouping"]=> array(0) { } } Checking new locale in the system, Expected : the locale names will be set from the values of environment variables Test FAILED. Done ================================================================================ 007+ string(0) "" 007- string(1) "," 009+ string(0) "" 009- string(4) "AUD " 011+ string(0) "" 011- string(1) "$" 013+ string(0) "" 013- string(1) "." 015+ string(0) "" 015- string(1) "," 019+ string(0) "" 019- string(1) "-" 021+ int(127) 021- int(2) 023+ int(127) 023- int(2) 025+ int(127) 025- int(1) 027+ int(127) 027- int(0) 029+ int(127) 029- int(1) 031+ int(127) 031- int(0) 033+ int(127) 033- int(1) 035+ int(127) 035- int(1) 037+ array(0) { 037- array(2) { 038- [0]=> 039- int(3) 040- [1]=> 041- int(3) 040+ array(0) { 044- array(2) { 045- [0]=> 046- int(3) 047- [1]=> 048- int(3) 049+ string(0) "" 051+ string(0) "" 053+ string(0) "" 055+ string(0) "" 057+ string(0) "" 057- string(1) "," 059- string(4) "USD " 061+ string(0) "" 061- string(1) "$" 063+ int(127) 063- string(1) "." 065+ int(127) 065- string(1) "," 067+ int(127) 069+ int(127) 069- string(1) "-" 071+ int(127) 071- int(2) 073+ int(127) 073- int(2) 075+ int(127) 075- int(1) 077+ int(127) 077- int(0) 079+ array(0) { 079- int(1) 081- int(0) 082+ array(0) { 083- int(1) 085- int(1) 086+ Test FAILED. 087- array(2) { 088- [0]=> 089- int(3) 090- [1]=> 091- int(3) 094- array(2) { 095- [0]=> 096- int(3) 097- [1]=> 098- int(3) 102- Test PASSED. ================================================================================ ================================================================================ BUILD ENVIRONMENT ================================================================================ OS: Linux - Linux virtualopalpkg 2.4.30-ow1 #5 Thu Mar 16 21:37:00 CET 2006 i686 Autoconf: autoconf (GNU Autoconf) 2.61 Copyright (C) 2006 Free Software Foundation, Inc. This is free software. You may redistribute copies of it under the terms of the GNU General Public License <http://www.gnu.org/licenses/gpl.html>. There is NO WARRANTY, to the extent permitted by law. Written by David J. MacKenzie and Akim Demaille. Bundled Libtool: ltmain.sh (GNU libtool) 1.5.20 (1.1220.2.287 2005/08/31 18:54:15) Copyright (C) 2005 Free Software Foundation, Inc. This is free software; see the source for copying conditions. There is NO warranty; not even for MERCHANTABILITY or FITNESS FOR A PARTICULAR PURPOSE. System Libtool: ltmain.sh (GNU libtool) 1.5.24 (1.1220.2.455 2007/06/24 02:13:29) Copyright (C) 2007 Free Software Foundation, Inc. This is free software; see the source for copying conditions. There is NO warranty; not even for MERCHANTABILITY or FITNESS FOR A PARTICULAR PURPOSE. Compiler: Reading specs from /usr/lib/gcc-lib/i486-slackware-linux/3.2.3/specs Configured with: ../gcc-3.2.3/configure --prefix=/usr --enable-shared --enable-threads=posix --enable-__cxa_atexit --disable-checking --with-gnu-ld --verbose --target=i486-slackware-linux --host=i486-slackware-linux Thread model: posix gcc version 3.2.3 Bison: bison (GNU Bison) 1.35 Copyright 1984, 1986, 1989, 1992, 2000, 2001, 2002 Free Software Foundation, Inc. This is free software; see the source for copying conditions. There is NO warranty; not even for MERCHANTABILITY or FITNESS FOR A PARTICULAR PURPOSE. Libraries: libcrypt.so.1 => /lib/libcrypt.so.1 (0x0012b000) librt.so.1 => /lib/librt.so.1 (0x00159000) libresolv.so.2 => /lib/libresolv.so.2 (0x0016b000) libm.so.6 => /lib/libm.so.6 (0x0017d000) libdl.so.2 => /lib/libdl.so.2 (0x001a0000) libnsl.so.1 => /lib/libnsl.so.1 (0x001a3000) libc.so.6 => /lib/libc.so.6 (0x001b8000) libpthread.so.0 => /lib/libpthread.so.0 (0x002ef000) /lib/ld-linux.so.2 => /lib/ld-linux.so.2 (0x00110000) User's E-mail: ================================================================================ PHPINFO ================================================================================ phpinfo() PHP Version => 5.2.5 System => Linux virtualopalpkg 2.4.30-ow1 #5 Thu Mar 16 21:37:00 CET 2006 i686 Build Date => Feb 5 2008 01:32:34 Configure Command => './configure' '--prefix=/usr/local/opal/web/php' '--exec-prefix=/usr/local/opal/web/php' '--with-apxs2=/usr/local/opal/web/bin/apxs' '--without-pear' '--disable-xml' '--disable-xmlreader' '--disable-xmlwriter' '--disable-libxml' '--disable-simplexml' '--disable-dom' Server API => Command Line Interface Virtual Directory Support => disabled Configuration File (php.ini) Path => /usr/local/opal/web/php/lib Loaded Configuration File => /usr/local/opal/web/php/lib/php.ini PHP API => 20041225 PHP Extension => 20060613 Zend Extension => 220060519 Debug Build => no Thread Safety => disabled Zend Memory Manager => enabled IPv6 Support => enabled Registered PHP Streams => php, file, data, http, ftp Registered Stream Socket Transports => tcp, udp, unix, udg Registered Stream Filters => string.rot13, string.toupper, string.tolower, string.strip_tags, convert.*, consumed, convert.iconv.* This program makes use of the Zend Scripting Language Engine: Zend Engine v2.2.0, Copyright (c) 1998-2007 Zend Technologies _______________________________________________________________________ Configuration PHP Core Directive => Local Value => Master Value allow_call_time_pass_reference => Off => Off allow_url_fopen => On => On allow_url_include => Off => Off always_populate_raw_post_data => Off => Off arg_separator.input => & => & arg_separator.output => & => & asp_tags => Off => Off auto_append_file => no value => no value auto_globals_jit => On => On auto_prepend_file => no value => no value browscap => no value => no value default_charset => no value => no value default_mimetype => text/html => text/html define_syslog_variables => Off => Off disable_classes => no value => no value disable_functions => no value => no value display_errors => Off => Off display_startup_errors => Off => Off doc_root => no value => no value docref_ext => no value => no value docref_root => no value => no value enable_dl => On => On error_append_string => no value => no value error_log => no value => no value error_prepend_string => no value => no value error_reporting => 6143 => 6143 expose_php => On => On extension_dir => ./ => ./ file_uploads => On => On highlight.bg => <font style="color: #FFFFFF">#FFFFFF</font> => <font style="color: #FFFFFF">#FFFFFF</font> highlight.comment => <font style="color: #FF8000">#FF8000</font> => <font style="color: #FF8000">#FF8000</font> highlight.default => <font style="color: #0000BB">#0000BB</font> => <font style="color: #0000BB">#0000BB</font> highlight.html => <font style="color: #000000">#000000</font> => <font style="color: #000000">#000000</font> highlight.keyword => <font style="color: #007700">#007700</font> => <font style="color: #007700">#007700</font> highlight.string => <font style="color: #DD0000">#DD0000</font> => <font style="color: #DD0000">#DD0000</font> html_errors => Off => Off ignore_repeated_errors => Off => Off ignore_repeated_source => Off => Off ignore_user_abort => Off => Off implicit_flush => On => On include_path => /usr/local/opal/webadmin/lib => /usr/local/opal/webadmin/lib log_errors => On => On log_errors_max_len => 1024 => 1024 magic_quotes_gpc => Off => Off magic_quotes_runtime => Off => Off magic_quotes_sybase => Off => Off mail.force_extra_parameters => no value => no value max_execution_time => 0 => 0 max_input_nesting_level => 64 => 64 max_input_time => -1 => -1 memory_limit => 128M => 128M open_basedir => no value => no value output_buffering => 0 => 0 output_handler => no value => no value post_max_size => 8M => 8M precision => 14 => 14 realpath_cache_size => 16K => 16K realpath_cache_ttl => 120 => 120 register_argc_argv => On => On register_globals => Off => Off register_long_arrays => Off => Off report_memleaks => On => On report_zend_debug => Off => Off safe_mode => Off => Off safe_mode_exec_dir => /usr/local/opal/webadmin/command => /usr/local/opal/webadmin/command safe_mode_gid => Off => Off safe_mode_include_dir => /usr/local/opal/webadmin/lib => /usr/local/opal/webadmin/lib sendmail_from => no value => no value sendmail_path => /usr/sbin/sendmail -t -i => /usr/sbin/sendmail -t -i serialize_precision => 100 => 100 short_open_tag => On => On SMTP => localhost => localhost smtp_port => 25 => 25 sql.safe_mode => Off => Off track_errors => Off => Off unserialize_callback_func => no value => no value upload_max_filesize => 100M => 100M upload_tmp_dir => no value => no value user_dir => no value => no value variables_order => GPCS => GPCS xmlrpc_error_number => 0 => 0 xmlrpc_errors => Off => Off y2k_compliance => On => On zend.ze1_compatibility_mode => Off => Off ctype ctype functions => enabled date date/time support => enabled "Olson" Timezone Database Version => 2007.9 Timezone Database => internal Default timezone => Europe/Berlin Directive => Local Value => Master Value date.default_latitude => 31.7667 => 31.7667 date.default_longitude => 35.2333 => 35.2333 date.sunrise_zenith => 90.583333 => 90.583333 date.sunset_zenith => 90.583333 => 90.583333 date.timezone => no value => no value filter Input Validation and Filtering => enabled Revision => $Revision: 1.52.2.39 $ Directive => Local Value => Master Value filter.default => unsafe_raw => unsafe_raw filter.default_flags => no value => no value hash hash support => enabled Hashing Engines => md2 md4 md5 sha1 sha256 sha384 sha512 ripemd128 ripemd160 ripemd256 ripemd320 whirlpool tiger128,3 tiger160,3 tiger192,3 tiger128,4 tiger160,4 tiger192,4 snefru gost adler32 crc32 crc32b haval128,3 haval160,3 haval192,3 haval224,3 haval256,3 haval128,4 haval160,4 haval192,4 haval224,4 haval256,4 haval128,5 haval160,5 haval192,5 haval224,5 haval256,5 iconv iconv support => enabled iconv implementation => glibc iconv library version => 2.3.2 Directive => Local Value => Master Value iconv.input_encoding => ISO-8859-1 => ISO-8859-1 iconv.internal_encoding => ISO-8859-1 => ISO-8859-1 iconv.output_encoding => ISO-8859-1 => ISO-8859-1 json json support => enabled json version => 1.2.1 pcre PCRE (Perl Compatible Regular Expressions) Support => enabled PCRE Library Version => 7.3 2007-08-28 Directive => Local Value => Master Value pcre.backtrack_limit => 100000 => 100000 pcre.recursion_limit => 100000 => 100000 PDO PDO support => enabled PDO drivers => sqlite2, sqlite pdo_sqlite PDO Driver for SQLite 3.x => enabled PECL Module version => (bundled) 1.0.1 $Id: pdo_sqlite.c,v 1.10.2.6.2.2 2007/03/23 14:30:00 wez Exp $ SQLite Library => 3.3.17 posix Revision => $Revision: 1.70.2.3.2.16 $ Reflection Reflection => enabled Version => $Id: php_reflection.c,v 1.164.2.33.2.47 2007/10/28 13:47:14 iliaa Exp $ session Session Support => enabled Registered save handlers => files user sqlite Registered serializer handlers => php php_binary Directive => Local Value => Master Value session.auto_start => Off => Off session.bug_compat_42 => Off => Off session.bug_compat_warn => On => On session.cache_expire => 180 => 180 session.cache_limiter => nocache => nocache session.cookie_domain => no value => no value session.cookie_httponly => Off => Off session.cookie_lifetime => 0 => 0 session.cookie_path => / => / session.cookie_secure => Off => Off session.entropy_file => no value => no value session.entropy_length => 0 => 0 session.gc_divisor => 1000 => 1000 session.gc_maxlifetime => 1440 => 1440 session.gc_probability => 1 => 1 session.hash_bits_per_character => 5 => 5 session.hash_function => 0 => 0 session.name => PHPSESSID => PHPSESSID session.referer_check => no value => no value session.save_handler => files => files session.save_path => /usr/local/opal/web/session => /usr/local/opal/web/session session.serialize_handler => php => php session.use_cookies => On => On session.use_only_cookies => Off => Off session.use_trans_sid => 0 => 0 SPL SPL support => enabled Interfaces => Countable, OuterIterator, RecursiveIterator, SeekableIterator, SplObserver, SplSubject Classes => AppendIterator, ArrayIterator, ArrayObject, BadFunctionCallException, BadMethodCallException, CachingIterator, DirectoryIterator, DomainException, EmptyIterator, FilterIterator, InfiniteIterator, InvalidArgumentException, IteratorIterator, LengthException, LimitIterator, LogicException, NoRewindIterator, OutOfBoundsException, OutOfRangeException, OverflowException, ParentIterator, RangeException, RecursiveArrayIterator, RecursiveCachingIterator, RecursiveDirectoryIterator, RecursiveFilterIterator, RecursiveIteratorIterator, RecursiveRegexIterator, RegexIterator, RuntimeException, SplFileInfo, SplFileObject, SplObjectStorage, SplTempFileObject, UnderflowException, UnexpectedValueException SQLite SQLite support => enabled PECL Module version => 2.0-dev $Id: sqlite.c,v 1.166.2.13.2.9 2007/05/19 17:58:22 iliaa Exp $ SQLite Library => 2.8.17 SQLite Encoding => iso8859 Directive => Local Value => Master Value sqlite.assoc_case => 0 => 0 standard Regex Library => Bundled library enabled Dynamic Library Support => enabled Path to sendmail => /usr/sbin/sendmail -t -i Directive => Local Value => Master Value assert.active => 1 => 1 assert.bail => 0 => 0 assert.callback => no value => no value assert.quiet_eval => 0 => 0 assert.warning => 1 => 1 auto_detect_line_endings => 0 => 0 default_socket_timeout => 60 => 60 safe_mode_allowed_env_vars => PHP_ => PHP_ safe_mode_protected_env_vars => LD_LIBRARY_PATH => LD_LIBRARY_PATH url_rewriter.tags => a=href,area=href,frame=src,input=src,form=fakeentry => a=href,area=href,frame=src,input=src,form=fakeentry user_agent => no value => no value tokenizer Tokenizer Support => enabled Additional Modules Module Name Environment Variable => Value MANPATH => /usr/local/man:/usr/man:/usr/X11R6/man HOSTNAME => virtualopalpkg.leicon.it TEST_PHP_SRCDIR => /usr/local/src/admin/php-5.2.5 SHELL => /bin/sh TERM => xterm MAKEFLAGS => SSH_CLIENT => deleted SSH_TTY => deleted USER => root LS_COLORS => no=00:fi=00:di=01;34:ln=01;36:pi=40;33:so=01;35:bd=40;33;01:cd=40;33;01:or=40;31;01:ex=01;32:*.cmd=01;32:*.exe=01;32:*.com=01;32:*.btm=01;32:*.bat=01;32:*.tar=01;31:*.tgz=01;31:*.arj=01;31:*.taz=01;31:*.lzh=01;31:*.zip=01;31:*.bz2=01;31:*.rpm=01;31:*.deb=01;31:*.z=01;31:*.Z=01;31:*.gz=01;31:*.jpg=01;35:*.gif=01;35:*.bmp=01;35:*.ppm=01;35:*.tga=01;35:*.xbm=01;35:*.xpm=01;35:*.tif=01;35:*.mpg=01;35:*.avi=01;35:*.mov=01;35: SSH_AUTH_SOCK => deleted MAKELEVEL => 1 MFLAGS => MINICOM => -c on PATH => /usr/local/sbin:/usr/sbin:/sbin:/usr/local/bin:/usr/bin:/bin:/usr/X11R6/bin:/usr/games:/usr/src/linux/include MAIL => /var/mail/root _ => /usr/local/src/admin/php-5.2.5/sapi/cli/php PWD => /usr/local/src/admin/php-5.2.5 INPUTRC => /etc/inputrc LANG => C TEST_PHP_EXECUTABLE => /usr/local/src/admin/php-5.2.5/sapi/cli/php HOME => /root SHLVL => 3 LS_OPTIONS => --color=auto -F -b -T 0 LOGNAME => root LESS => -M SSH_CONNECTION => deleted LESSOPEN => |lesspipe.sh %s CC => gcc PHP Variables Variable => Value _SERVER["MANPATH"] => /usr/local/man:/usr/man:/usr/X11R6/man _SERVER["HOSTNAME"] => virtualopalpkg.leicon.it _SERVER["TEST_PHP_SRCDIR"] => /usr/local/src/admin/php-5.2.5 _SERVER["SHELL"] => /bin/sh _SERVER["TERM"] => xterm _SERVER["MAKEFLAGS"] => _SERVER["SSH_CLIENT"] => deleted _SERVER["SSH_TTY"] => deleted _SERVER["USER"] => root _SERVER["LS_COLORS"] => no=00:fi=00:di=01;34:ln=01;36:pi=40;33:so=01;35:bd=40;33;01:cd=40;33;01:or=40;31;01:ex=01;32:*.cmd=01;32:*.exe=01;32:*.com=01;32:*.btm=01;32:*.bat=01;32:*.tar=01;31:*.tgz=01;31:*.arj=01;31:*.taz=01;31:*.lzh=01;31:*.zip=01;31:*.bz2=01;31:*.rpm=01;31:*.deb=01;31:*.z=01;31:*.Z=01;31:*.gz=01;31:*.jpg=01;35:*.gif=01;35:*.bmp=01;35:*.ppm=01;35:*.tga=01;35:*.xbm=01;35:*.xpm=01;35:*.tif=01;35:*.mpg=01;35:*.avi=01;35:*.mov=01;35: _SERVER["SSH_AUTH_SOCK"] => deleted _SERVER["MAKELEVEL"] => 1 _SERVER["MFLAGS"] => _SERVER["MINICOM"] => -c on _SERVER["PATH"] => /usr/local/sbin:/usr/sbin:/sbin:/usr/local/bin:/usr/bin:/bin:/usr/X11R6/bin:/usr/games:/usr/src/linux/include _SERVER["MAIL"] => /var/mail/root _SERVER["_"] => /usr/local/src/admin/php-5.2.5/sapi/cli/php _SERVER["PWD"] => /usr/local/src/admin/php-5.2.5 _SERVER["INPUTRC"] => /etc/inputrc _SERVER["LANG"] => C _SERVER["TEST_PHP_EXECUTABLE"] => /usr/local/src/admin/php-5.2.5/sapi/cli/php _SERVER["HOME"] => /root _SERVER["SHLVL"] => 3 _SERVER["LS_OPTIONS"] => --color=auto -F -b -T 0 _SERVER["LOGNAME"] => root _SERVER["LESS"] => -M _SERVER["SSH_CONNECTION"] => deleted _SERVER["LESSOPEN"] => |lesspipe.sh %s _SERVER["CC"] => gcc _SERVER["PHP_SELF"] => _SERVER["SCRIPT_NAME"] => _SERVER["SCRIPT_FILENAME"] => _SERVER["PATH_TRANSLATED"] => _SERVER["DOCUMENT_ROOT"] => _SERVER["REQUEST_TIME"] => 1202171853 _SERVER["argv"] => Array ( ) _SERVER["argc"] => 0 PHP License This program is free software; you can redistribute it and/or modify it under the terms of the PHP License as published by the PHP Group and included in the distribution in the file: LICENSE This program is distributed in the hope that it will be useful, but WITHOUT ANY WARRANTY; without even the implied warranty of MERCHANTABILITY or FITNESS FOR A PARTICULAR PURPOSE. If you did not receive a copy of the PHP license, or have any questions about PHP licensing, please contact license@php.net.

« previous php.qa (#62831) next »