Test results
| From: | noreply@php.net | Date: | Wed, 20 Nov 2002 20:39:07 +0000 |
| Subject: | Test results | ||
| Groups: | php.qa | ||
| Request: | Send a blank email to php-qa+get-6916@lists.php.net to get a copy of this message | ||
OS:
Linux
Automake:
automake (GNU automake) 1.4-p5
Copyright (C) 1999, 2001 Free Software Foundation, Inc.
This is free software; see the source for copying conditions. There is NO
warranty; not even for MERCHANTABILITY or FITNESS FOR A PARTICULAR PURPOSE.
Written by Tom Tromey <tromey@cygnus.com>
Autoconf:
Autoconf version 2.13
Libtool:
ltmain.sh (GNU libtool) 1.4.2 (1.922.2.54 2001/09/11 03:33:37)
Compiler:
Reading specs from /usr/lib/gcc-lib/i386-redhat-linux/2.96/specs
gcc version 2.96 20000731 (Red Hat Linux 7.3 2.96-110)
Bison:
bison (GNU Bison) 1.35
Copyright 1984, 1986, 1989, 1992, 2000, 2001, 2002
Free Software Foundation, Inc.
This is free software; see the source for copying conditions. There is NO
warranty; not even for MERCHANTABILITY or FITNESS FOR A PARTICULAR PURPOSE.
=====================================================================
FAILED TEST SUMMARY
---------------------------------------------------------------------
session object serialization [ext/session/tests/001.phpt]
session object deserialization [ext/session/tests/003.phpt]
correct instantiation of references between variables in sessions [ext/session/tests/006.phpt]
bug compatibility: unset($c) with enabled register_globals [ext/session/tests/007.phpt]
bug compatibility: global is used albeit register_globals=0 [ext/session/tests/008-php4.2.3.phpt]
unset($_SESSION["name"]); should work with register_globals=off
[ext/session/tests/009.phpt]
registering $_SESSION should not segfault [ext/session/tests/012.phpt]
redefining SID should not cause warnings [ext/session/tests/013.phpt]
a script should not be able to modify session.use_trans_sid [ext/session/tests/014.phpt]
use_trans_sid should not affect SID [ext/session/tests/015.phpt]
setting $_SESSION before session_start() should not cause segfault [ext/session/tests/017.phpt]
rewriter correctly handles attribute names which contain dashes [ext/session/tests/018.phpt]
serializing references test case using globals [ext/session/tests/019.phpt]
rewriter uses arg_seperator.output for modifying URLs [ext/session/tests/020.phpt]
rewriter handles form and fieldset tags correctly [ext/session/tests/021.phpt]
fopencookie detected and working (or cast mechanism works)
[ext/standard/tests/file/fopencookie.phpt]
=====================================================================
================================================================================
/home/dave/download/web/apache/build/php-4.3.0RC1/ext/session/tests/001.phpt
================================================================================
---- EXPECTED OUTPUT
baz|O:3:"foo":2:{s:3:"bar";s:2:"ok";s:3:"yes";s:4:"done";}arr|a:1:{i:3;O:3:"foo":2:{s:3:"bar";s:2:"ok";s:3:"yes";s:4:"done";}}
---- ACTUAL OUTPUT
Warning: open(/tmp/sess/sess_8a41d519f5f4720af9d363d42929a64c, O_RDWR) failed: No such file or
directory (2) in /home/dave/download/web/apache/build/php-4.3.0RC1/ext/session/tests/001.php on line
16
baz|O:3:"foo":2:{s:3:"bar";s:2:"ok";s:3:"yes";s:4:"done";}arr|a:1:{i:3;O:3:"foo":2:{s:3:"bar";s:2:"ok";s:3:"yes";s:4:"done";}}
Warning: Session object destruction failed in
/home/dave/download/web/apache/build/php-4.3.0RC1/ext/session/tests/001.php on line 21
---- FAILED
================================================================================
001-
baz|O:3:"foo":2:{s:3:"bar";s:2:"ok";s:3:"yes";s:4:"done";}arr|a:1:{i:3;O:3:"foo":2:{s:3:"bar";s:2:"ok";s:3:"yes";s:4:"done";}}
001+ Warning: open(/tmp/sess/sess_8a41d519f5f4720af9d363d42929a64c, O_RDWR) failed: No such file or
directory (2) in /home/dave/download/web/apache/build/php-4.3.0RC1/ext/session/tests/001.php on line
16
002+
baz|O:3:"foo":2:{s:3:"bar";s:2:"ok";s:3:"yes";s:4:"done";}arr|a:1:{i:3;O:3:"foo":2:{s:3:"bar";s:2:"ok";s:3:"yes";s:4:"done";}}
003+
004+ Warning: Session object destruction failed in
/home/dave/download/web/apache/build/php-4.3.0RC1/ext/session/tests/001.php on line 21
================================================================================
================================================================================
/home/dave/download/web/apache/build/php-4.3.0RC1/ext/session/tests/003.phpt
================================================================================
---- EXPECTED OUTPUT
object(foo)(2) {
["bar"]=>
string(2) "ok"
["yes"]=>
int(2)
}
array(1) {
[3]=>
&object(foo)(2) {
["bar"]=>
string(2) "ok"
["yes"]=>
int(2)
}
}
---- ACTUAL OUTPUT
Warning: open(/tmp/sess/sess_abtest, O_RDWR) failed: No such file or directory (2) in
/home/dave/download/web/apache/build/php-4.3.0RC1/ext/session/tests/003.php on line 10
object(foo)(2) {
["bar"]=>
string(2) "ok"
["yes"]=>
int(2)
}
array(1) {
[3]=>
&object(foo)(2) {
["bar"]=>
string(2) "ok"
["yes"]=>
int(2)
}
}
Warning: Session object destruction failed in
/home/dave/download/web/apache/build/php-4.3.0RC1/ext/session/tests/003.php on line 18
---- FAILED
================================================================================
001- object(foo)(2) {
001+ Warning: open(/tmp/sess/sess_abtest, O_RDWR) failed: No such file or directory (2) in
/home/dave/download/web/apache/build/php-4.3.0RC1/ext/session/tests/003.php on line 10
002- ["bar"]=>
002+ object(foo)(2) {
003- string(2) "ok"
003+ ["bar"]=>
004- ["yes"]=>
004+ string(2) "ok"
005- int(2)
005+ ["yes"]=>
006- }
006+ int(2)
007- array(1) {
007+ }
008- [3]=>
008+ array(1) {
009- &object(foo)(2) {
009+ [3]=>
010- ["bar"]=>
010+ &object(foo)(2) {
011- string(2) "ok"
011+ ["bar"]=>
012- ["yes"]=>
012+ string(2) "ok"
013- int(2)
013+ ["yes"]=>
014- }
014+ int(2)
015- }
015+ }
016+ }
017+
018+ Warning: Session object destruction failed in
/home/dave/download/web/apache/build/php-4.3.0RC1/ext/session/tests/003.php on line 18
================================================================================
================================================================================
/home/dave/download/web/apache/build/php-4.3.0RC1/ext/session/tests/006.phpt
================================================================================
---- EXPECTED OUTPUT
original values:
object(a)(1) {
["test"]=>
string(5) "hallo"
}
object(b)(1) {
["a"]=>
&object(a)(1) {
["test"]=>
string(5) "hallo"
}
}
values after session:
object(a)(1) {
["test"]=>
string(5) "hallo"
}
object(b)(1) {
["a"]=>
&object(a)(1) {
["test"]=>
string(5) "hallo"
}
}
---- ACTUAL OUTPUT
Warning: open(/tmp/sess/sess_abtest, O_RDWR) failed: No such file or directory (2) in
/home/dave/download/web/apache/build/php-4.3.0RC1/ext/session/tests/006.php on line 5
original values:
object(a)(1) {
["test"]=>
string(5) "hallo"
}
object(b)(1) {
["a"]=>
&object(a)(1) {
["test"]=>
string(5) "hallo"
}
}
Warning: open(/tmp/sess/sess_abtest, O_RDWR) failed: No such file or directory (2) in
/home/dave/download/web/apache/build/php-4.3.0RC1/ext/session/tests/006.php on line 26
Warning: Failed to write session data (files). Please verify that the current setting of
session.save_path is correct (/tmp/sess) in
/home/dave/download/web/apache/build/php-4.3.0RC1/ext/session/tests/006.php on line 26
Warning: open(/tmp/sess/sess_abtest, O_RDWR) failed: No such file or directory (2) in
/home/dave/download/web/apache/build/php-4.3.0RC1/ext/session/tests/006.php on line 31
values after session:
object(a)(1) {
["test"]=>
string(5) "hallo"
}
object(b)(1) {
["a"]=>
&object(a)(1) {
["test"]=>
string(5) "hallo"
}
}
Warning: open(/tmp/sess/sess_abtest, O_RDWR) failed: No such file or directory (2) in Unknown on
line 0
Warning: Failed to write session data (files). Please verify that the current setting of
session.save_path is correct (/tmp/sess) in Unknown on line 0
---- FAILED
================================================================================
001- original values:
001+ Warning: open(/tmp/sess/sess_abtest, O_RDWR) failed: No such file or directory (2) in
/home/dave/download/web/apache/build/php-4.3.0RC1/ext/session/tests/006.php on line 5
002- object(a)(1) {
002+ original values:
003- ["test"]=>
003+ object(a)(1) {
004- string(5) "hallo"
004+ ["test"]=>
005- }
005+ string(5) "hallo"
006- object(b)(1) {
006+ }
007- ["a"]=>
007+ object(b)(1) {
008- &object(a)(1) {
008+ ["a"]=>
009- ["test"]=>
009+ &object(a)(1) {
010- string(5) "hallo"
010+ ["test"]=>
011- }
011+ string(5) "hallo"
012- }
012+ }
013- values after session:
013+ }
014- object(a)(1) {
014+
015- ["test"]=>
015+ Warning: open(/tmp/sess/sess_abtest, O_RDWR) failed: No such file or directory (2) in
/home/dave/download/web/apache/build/php-4.3.0RC1/ext/session/tests/006.php on line 26
016- string(5) "hallo"
016+
017- }
017+ Warning: Failed to write session data (files). Please verify that the current setting of
session.save_path is correct (/tmp/sess) in
/home/dave/download/web/apache/build/php-4.3.0RC1/ext/session/tests/006.php on line 26
018- object(b)(1) {
018+
019- ["a"]=>
019+ Warning: open(/tmp/sess/sess_abtest, O_RDWR) failed: No such file or directory (2) in
/home/dave/download/web/apache/build/php-4.3.0RC1/ext/session/tests/006.php on line 31
020- &object(a)(1) {
020+ values after session:
021- ["test"]=>
021+ object(a)(1) {
022- string(5) "hallo"
022+ ["test"]=>
023- }
023+ string(5) "hallo"
025+ object(b)(1) {
026+ ["a"]=>
027+ &object(a)(1) {
028+ ["test"]=>
029+ string(5) "hallo"
030+ }
031+ }
032+
033+ Warning: open(/tmp/sess/sess_abtest, O_RDWR) failed: No such file or directory (2) in Unknown
on line 0
034+
035+ Warning: Failed to write session data (files). Please verify that the current setting of
session.save_path is correct (/tmp/sess) in Unknown on line 0
================================================================================
================================================================================
/home/dave/download/web/apache/build/php-4.3.0RC1/ext/session/tests/007.phpt
================================================================================
---- EXPECTED OUTPUT
float(3.14)
array(1) {
["c"]=>
&float(3.14)
}
float(3.14)
array(1) {
["c"]=>
&float(3.14)
}
---- ACTUAL OUTPUT
Warning: open(/tmp/sess/sess_abtest, O_RDWR) failed: No such file or directory (2) in
/home/dave/download/web/apache/build/php-4.3.0RC1/ext/session/tests/007.php on line 7
Warning: Session object destruction failed in
/home/dave/download/web/apache/build/php-4.3.0RC1/ext/session/tests/007.php on line 8
Warning: open(/tmp/sess/sess_abtest, O_RDWR) failed: No such file or directory (2) in
/home/dave/download/web/apache/build/php-4.3.0RC1/ext/session/tests/007.php on line 12
Warning: open(/tmp/sess/sess_abtest, O_RDWR) failed: No such file or directory (2) in
/home/dave/download/web/apache/build/php-4.3.0RC1/ext/session/tests/007.php on line 15
Warning: Failed to write session data (files). Please verify that the current setting of
session.save_path is correct (/tmp/sess) in
/home/dave/download/web/apache/build/php-4.3.0RC1/ext/session/tests/007.php on line 15
Warning: open(/tmp/sess/sess_abtest, O_RDWR) failed: No such file or directory (2) in
/home/dave/download/web/apache/build/php-4.3.0RC1/ext/session/tests/007.php on line 20
Notice: Undefined variable: c in
/home/dave/download/web/apache/build/php-4.3.0RC1/ext/session/tests/007.php on line 21
NULL
array(0) {
}
Warning: open(/tmp/sess/sess_abtest, O_RDWR) failed: No such file or directory (2) in
/home/dave/download/web/apache/build/php-4.3.0RC1/ext/session/tests/007.php on line 26
Warning: Failed to write session data (files). Please verify that the current setting of
session.save_path is correct (/tmp/sess) in
/home/dave/download/web/apache/build/php-4.3.0RC1/ext/session/tests/007.php on line 26
Warning: open(/tmp/sess/sess_abtest, O_RDWR) failed: No such file or directory (2) in
/home/dave/download/web/apache/build/php-4.3.0RC1/ext/session/tests/007.php on line 32
Notice: Undefined variable: c in
/home/dave/download/web/apache/build/php-4.3.0RC1/ext/session/tests/007.php on line 33
NULL
array(0) {
}
Warning: Session object destruction failed in
/home/dave/download/web/apache/build/php-4.3.0RC1/ext/session/tests/007.php on line 36
---- FAILED
================================================================================
001- float(3.14)
001+ Warning: open(/tmp/sess/sess_abtest, O_RDWR) failed: No such file or directory (2) in
/home/dave/download/web/apache/build/php-4.3.0RC1/ext/session/tests/007.php on line 7
002- array(1) {
002+
003- ["c"]=>
003+ Warning: Session object destruction failed in
/home/dave/download/web/apache/build/php-4.3.0RC1/ext/session/tests/007.php on line 8
004- &float(3.14)
004+
005- }
005+ Warning: open(/tmp/sess/sess_abtest, O_RDWR) failed: No such file or directory (2) in
/home/dave/download/web/apache/build/php-4.3.0RC1/ext/session/tests/007.php on line 12
006- float(3.14)
006+
007- array(1) {
007+ Warning: open(/tmp/sess/sess_abtest, O_RDWR) failed: No such file or directory (2) in
/home/dave/download/web/apache/build/php-4.3.0RC1/ext/session/tests/007.php on line 15
008- ["c"]=>
008+
009- &float(3.14)
009+ Warning: Failed to write session data (files). Please verify that the current setting of
session.save_path is correct (/tmp/sess) in
/home/dave/download/web/apache/build/php-4.3.0RC1/ext/session/tests/007.php on line 15
010- }
010+
011+ Warning: open(/tmp/sess/sess_abtest, O_RDWR) failed: No such file or directory (2) in
/home/dave/download/web/apache/build/php-4.3.0RC1/ext/session/tests/007.php on line 20
012+
013+ Notice: Undefined variable: c in
/home/dave/download/web/apache/build/php-4.3.0RC1/ext/session/tests/007.php on line 21
014+ NULL
015+ array(0) {
016+ }
017+
018+ Warning: open(/tmp/sess/sess_abtest, O_RDWR) failed: No such file or directory (2) in
/home/dave/download/web/apache/build/php-4.3.0RC1/ext/session/tests/007.php on line 26
019+
020+ Warning: Failed to write session data (files). Please verify that the current setting of
session.save_path is correct (/tmp/sess) in
/home/dave/download/web/apache/build/php-4.3.0RC1/ext/session/tests/007.php on line 26
021+
022+ Warning: open(/tmp/sess/sess_abtest, O_RDWR) failed: No such file or directory (2) in
/home/dave/download/web/apache/build/php-4.3.0RC1/ext/session/tests/007.php on line 32
023+
024+ Notice: Undefined variable: c in
/home/dave/download/web/apache/build/php-4.3.0RC1/ext/session/tests/007.php on line 33
025+ NULL
026+ array(0) {
027+ }
028+
029+ Warning: Session object destruction failed in
/home/dave/download/web/apache/build/php-4.3.0RC1/ext/session/tests/007.php on line 36
================================================================================
================================================================================
/home/dave/download/web/apache/build/php-4.3.0RC1/ext/session/tests/008-php4.2.3.phpt
================================================================================
---- EXPECTED OUTPUT
NULL
Your script possibly relies on a session side-effect which existed until PHP 4.2.3. Please be
advised that the session extension does not consider global variables as a source of data, unless
register_globals is enabled. You can disable this functionality and this warning by setting
session.bug_compat_42 or session.bug_compat_warn to off, respectively.
array(1) {
["c"]=>
float(3.14)
}
NULL
array(1) {
["c"]=>
float(3.14)
}
---- ACTUAL OUTPUT
Warning: open(/tmp/sess/sess_abtest, O_RDWR) failed: No such file or directory (2) in
/home/dave/download/web/apache/build/php-4.3.0RC1/ext/session/tests/008-php4.2.3.php on line 5
Warning: Session object destruction failed in
/home/dave/download/web/apache/build/php-4.3.0RC1/ext/session/tests/008-php4.2.3.php on line 6
Warning: open(/tmp/sess/sess_abtest, O_RDWR) failed: No such file or directory (2) in
/home/dave/download/web/apache/build/php-4.3.0RC1/ext/session/tests/008-php4.2.3.php on line 10
NULL
Failed to write session data (files). Please verify that the current setting of session.save_path is
correct (/tmp/sess)
Warning: open(/tmp/sess/sess_abtest, O_RDWR) failed: No such file or directory (2) in
/home/dave/download/web/apache/build/php-4.3.0RC1/ext/session/tests/008-php4.2.3.php on line 21
array(0) {
}
Warning: open(/tmp/sess/sess_abtest, O_RDWR) failed: No such file or directory (2) in
/home/dave/download/web/apache/build/php-4.3.0RC1/ext/session/tests/008-php4.2.3.php on line 26
Warning: Failed to write session data (files). Please verify that the current setting of
session.save_path is correct (/tmp/sess) in
/home/dave/download/web/apache/build/php-4.3.0RC1/ext/session/tests/008-php4.2.3.php on line 26
Warning: open(/tmp/sess/sess_abtest, O_RDWR) failed: No such file or directory (2) in
/home/dave/download/web/apache/build/php-4.3.0RC1/ext/session/tests/008-php4.2.3.php on line 32
NULL
array(0) {
}
Warning: Session object destruction failed in
/home/dave/download/web/apache/build/php-4.3.0RC1/ext/session/tests/008-php4.2.3.php on line 36
---- FAILED
================================================================================
001- NULL
001+ Warning: open(/tmp/sess/sess_abtest, O_RDWR) failed: No such file or directory (2) in
/home/dave/download/web/apache/build/php-4.3.0RC1/ext/session/tests/008-php4.2.3.php on line 5
002- Your script possibly relies on a session side-effect which existed until PHP 4.2.3. Please be
advised that the session extension does not consider global variables as a source of data, unless
register_globals is enabled. You can disable this functionality and this warning by setting
session.bug_compat_42 or session.bug_compat_warn to off, respectively.
002+
003- array(1) {
003+ Warning: Session object destruction failed in
/home/dave/download/web/apache/build/php-4.3.0RC1/ext/session/tests/008-php4.2.3.php on line 6
004- ["c"]=>
004+
005- float(3.14)
005+ Warning: open(/tmp/sess/sess_abtest, O_RDWR) failed: No such file or directory (2) in
/home/dave/download/web/apache/build/php-4.3.0RC1/ext/session/tests/008-php4.2.3.php on line 10
006- }
006+ NULL
007- NULL
007+ Failed to write session data (files). Please verify that the current setting of
session.save_path is correct (/tmp/sess)
008- array(1) {
008+
009- ["c"]=>
009+ Warning: open(/tmp/sess/sess_abtest, O_RDWR) failed: No such file or directory (2) in
/home/dave/download/web/apache/build/php-4.3.0RC1/ext/session/tests/008-php4.2.3.php on line 21
010- float(3.14)
010+ array(0) {
012+
013+ Warning: open(/tmp/sess/sess_abtest, O_RDWR) failed: No such file or directory (2) in
/home/dave/download/web/apache/build/php-4.3.0RC1/ext/session/tests/008-php4.2.3.php on line 26
014+
015+ Warning: Failed to write session data (files). Please verify that the current setting of
session.save_path is correct (/tmp/sess) in
/home/dave/download/web/apache/build/php-4.3.0RC1/ext/session/tests/008-php4.2.3.php on line 26
016+
017+ Warning: open(/tmp/sess/sess_abtest, O_RDWR) failed: No such file or directory (2) in
/home/dave/download/web/apache/build/php-4.3.0RC1/ext/session/tests/008-php4.2.3.php on line 32
018+ NULL
019+ array(0) {
020+ }
021+
022+ Warning: Session object destruction failed in
/home/dave/download/web/apache/build/php-4.3.0RC1/ext/session/tests/008-php4.2.3.php on line 36
================================================================================
================================================================================
/home/dave/download/web/apache/build/php-4.3.0RC1/ext/session/tests/009.phpt
================================================================================
---- EXPECTED OUTPUT
array(0) {
}
array(1) {
["name"]=>
string(3) "foo"
}
array(1) {
["name"]=>
string(3) "foo"
}
array(0) {
}
array(0) {
}
---- ACTUAL OUTPUT
Warning: open(/tmp/sess/sess_abtest, O_RDWR) failed: No such file or directory (2) in
/home/dave/download/web/apache/build/php-4.3.0RC1/ext/session/tests/009.php on line 7
Warning: Session object destruction failed in
/home/dave/download/web/apache/build/php-4.3.0RC1/ext/session/tests/009.php on line 8
Warning: open(/tmp/sess/sess_abtest, O_RDWR) failed: No such file or directory (2) in
/home/dave/download/web/apache/build/php-4.3.0RC1/ext/session/tests/009.php on line 12
array(0) {
}
array(1) {
["name"]=>
string(3) "foo"
}
Warning: open(/tmp/sess/sess_abtest, O_RDWR) failed: No such file or directory (2) in
/home/dave/download/web/apache/build/php-4.3.0RC1/ext/session/tests/009.php on line 16
Warning: Failed to write session data (files). Please verify that the current setting of
session.save_path is correct (/tmp/sess) in
/home/dave/download/web/apache/build/php-4.3.0RC1/ext/session/tests/009.php on line 16
Warning: open(/tmp/sess/sess_abtest, O_RDWR) failed: No such file or directory (2) in
/home/dave/download/web/apache/build/php-4.3.0RC1/ext/session/tests/009.php on line 19
array(0) {
}
array(0) {
}
Warning: open(/tmp/sess/sess_abtest, O_RDWR) failed: No such file or directory (2) in
/home/dave/download/web/apache/build/php-4.3.0RC1/ext/session/tests/009.php on line 23
Warning: Failed to write session data (files). Please verify that the current setting of
session.save_path is correct (/tmp/sess) in
/home/dave/download/web/apache/build/php-4.3.0RC1/ext/session/tests/009.php on line 23
Warning: open(/tmp/sess/sess_abtest, O_RDWR) failed: No such file or directory (2) in
/home/dave/download/web/apache/build/php-4.3.0RC1/ext/session/tests/009.php on line 27
array(0) {
}
Warning: Session object destruction failed in
/home/dave/download/web/apache/build/php-4.3.0RC1/ext/session/tests/009.php on line 29
---- FAILED
================================================================================
001- array(0) {
001+ Warning: open(/tmp/sess/sess_abtest, O_RDWR) failed: No such file or directory (2) in
/home/dave/download/web/apache/build/php-4.3.0RC1/ext/session/tests/009.php on line 7
002- }
002+
003- array(1) {
003+ Warning: Session object destruction failed in
/home/dave/download/web/apache/build/php-4.3.0RC1/ext/session/tests/009.php on line 8
004- ["name"]=>
004+
005- string(3) "foo"
005+ Warning: open(/tmp/sess/sess_abtest, O_RDWR) failed: No such file or directory (2) in
/home/dave/download/web/apache/build/php-4.3.0RC1/ext/session/tests/009.php on line 12
006- }
006+ array(0) {
007- array(1) {
007+ }
008- ["name"]=>
008+ array(1) {
009- string(3) "foo"
009+ ["name"]=>
010- }
010+ string(3) "foo"
011- array(0) {
011+ }
012- }
012+
013- array(0) {
013+ Warning: open(/tmp/sess/sess_abtest, O_RDWR) failed: No such file or directory (2) in
/home/dave/download/web/apache/build/php-4.3.0RC1/ext/session/tests/009.php on line 16
014- }
014+
015+ Warning: Failed to write session data (files). Please verify that the current setting of
session.save_path is correct (/tmp/sess) in
/home/dave/download/web/apache/build/php-4.3.0RC1/ext/session/tests/009.php on line 16
016+
017+ Warning: open(/tmp/sess/sess_abtest, O_RDWR) failed: No such file or directory (2) in
/home/dave/download/web/apache/build/php-4.3.0RC1/ext/session/tests/009.php on line 19
018+ array(0) {
019+ }
020+ array(0) {
021+ }
022+
023+ Warning: open(/tmp/sess/sess_abtest, O_RDWR) failed: No such file or directory (2) in
/home/dave/download/web/apache/build/php-4.3.0RC1/ext/session/tests/009.php on line 23
024+
025+ Warning: Failed to write session data (files). Please verify that the current setting of
session.save_path is correct (/tmp/sess) in
/home/dave/download/web/apache/build/php-4.3.0RC1/ext/session/tests/009.php on line 23
026+
027+ Warning: open(/tmp/sess/sess_abtest, O_RDWR) failed: No such file or directory (2) in
/home/dave/download/web/apache/build/php-4.3.0RC1/ext/session/tests/009.php on line 27
028+ array(0) {
029+ }
030+
031+ Warning: Session object destruction failed in
/home/dave/download/web/apache/build/php-4.3.0RC1/ext/session/tests/009.php on line 29
================================================================================
================================================================================
/home/dave/download/web/apache/build/php-4.3.0RC1/ext/session/tests/012.phpt
================================================================================
---- EXPECTED OUTPUT
I live
---- ACTUAL OUTPUT
Warning: open(/tmp/sess/sess_abtest, O_RDWR) failed: No such file or directory (2) in
/home/dave/download/web/apache/build/php-4.3.0RC1/ext/session/tests/012.php on line 7
Warning: open(/tmp/sess/sess_abtest, O_RDWR) failed: No such file or directory (2) in
/home/dave/download/web/apache/build/php-4.3.0RC1/ext/session/tests/012.php on line 15
Warning: Session object destruction failed in
/home/dave/download/web/apache/build/php-4.3.0RC1/ext/session/tests/012.php on line 17
I live
---- FAILED
================================================================================
001- I live
001+ Warning: open(/tmp/sess/sess_abtest, O_RDWR) failed: No such file or directory (2) in
/home/dave/download/web/apache/build/php-4.3.0RC1/ext/session/tests/012.php on line 7
002+
003+ Warning: open(/tmp/sess/sess_abtest, O_RDWR) failed: No such file or directory (2) in
/home/dave/download/web/apache/build/php-4.3.0RC1/ext/session/tests/012.php on line 15
004+
005+ Warning: Session object destruction failed in
/home/dave/download/web/apache/build/php-4.3.0RC1/ext/session/tests/012.php on line 17
006+ I live
================================================================================
================================================================================
/home/dave/download/web/apache/build/php-4.3.0RC1/ext/session/tests/013.phpt
================================================================================
---- EXPECTED OUTPUT
I live
---- ACTUAL OUTPUT
Warning: open(/tmp/sess/sess_abtest, O_RDWR) failed: No such file or directory (2) in
/home/dave/download/web/apache/build/php-4.3.0RC1/ext/session/tests/013.php on line 5
Warning: Session object destruction failed in
/home/dave/download/web/apache/build/php-4.3.0RC1/ext/session/tests/013.php on line 6
Warning: open(/tmp/sess/sess_abtest2, O_RDWR) failed: No such file or directory (2) in
/home/dave/download/web/apache/build/php-4.3.0RC1/ext/session/tests/013.php on line 8
Warning: Session object destruction failed in
/home/dave/download/web/apache/build/php-4.3.0RC1/ext/session/tests/013.php on line 9
I live
---- FAILED
================================================================================
001- I live
001+ Warning: open(/tmp/sess/sess_abtest, O_RDWR) failed: No such file or directory (2) in
/home/dave/download/web/apache/build/php-4.3.0RC1/ext/session/tests/013.php on line 5
002+
003+ Warning: Session object destruction failed in
/home/dave/download/web/apache/build/php-4.3.0RC1/ext/session/tests/013.php on line 6
004+
005+ Warning: open(/tmp/sess/sess_abtest2, O_RDWR) failed: No such file or directory (2) in
/home/dave/download/web/apache/build/php-4.3.0RC1/ext/session/tests/013.php on line 8
006+
007+ Warning: Session object destruction failed in
/home/dave/download/web/apache/build/php-4.3.0RC1/ext/session/tests/013.php on line 9
008+ I live
================================================================================
================================================================================
/home/dave/download/web/apache/build/php-4.3.0RC1/ext/session/tests/014.phpt
================================================================================
---- EXPECTED OUTPUT
<a href="/link?PHPSESSID=abtest">
<a href="/link?PHPSESSID=abtest">
<a href="/link?PHPSESSID=abtest">
---- ACTUAL OUTPUT
Warning: open(/tmp/sess/sess_abtest, O_RDWR) failed: No such file or directory (2) in
/home/dave/download/web/apache/build/php-4.3.0RC1/ext/session/tests/014.php on line 5
<a href="/link?PHPSESSID=abtest">
<a href="/link?PHPSESSID=abtest">
<a href="/link?PHPSESSID=abtest">
Warning: Session object destruction failed in
/home/dave/download/web/apache/build/php-4.3.0RC1/ext/session/tests/014.php on line 18
---- FAILED
================================================================================
001- <a href="/link?PHPSESSID=abtest">
001+ Warning: open(/tmp/sess/sess_abtest, O_RDWR) failed: No such file or directory (2) in
/home/dave/download/web/apache/build/php-4.3.0RC1/ext/session/tests/014.php on line 5
004+ <a href="/link?PHPSESSID=abtest">
005+
006+ Warning: Session object destruction failed in
/home/dave/download/web/apache/build/php-4.3.0RC1/ext/session/tests/014.php on line 18
================================================================================
================================================================================
/home/dave/download/web/apache/build/php-4.3.0RC1/ext/session/tests/015.phpt
================================================================================
---- EXPECTED OUTPUT
<a href="/link?PHPSESSID=abtest&PHPSESSID=abtest">
---- ACTUAL OUTPUT
Warning: open(/tmp/sess/sess_abtest, O_RDWR) failed: No such file or directory (2) in
/home/dave/download/web/apache/build/php-4.3.0RC1/ext/session/tests/015.php on line 5
<a href="/link?PHPSESSID=abtest&PHPSESSID=abtest">
Warning: Session object destruction failed in
/home/dave/download/web/apache/build/php-4.3.0RC1/ext/session/tests/015.php on line 9
---- FAILED
================================================================================
001- <a href="/link?PHPSESSID=abtest&PHPSESSID=abtest">
001+ Warning: open(/tmp/sess/sess_abtest, O_RDWR) failed: No such file or directory (2) in
/home/dave/download/web/apache/build/php-4.3.0RC1/ext/session/tests/015.php on line 5
002+ <a href="/link?PHPSESSID=abtest&PHPSESSID=abtest">
003+
004+ Warning: Session object destruction failed in
/home/dave/download/web/apache/build/php-4.3.0RC1/ext/session/tests/015.php on line 9
================================================================================
================================================================================
/home/dave/download/web/apache/build/php-4.3.0RC1/ext/session/tests/017.phpt
================================================================================
---- EXPECTED OUTPUT
I live
---- ACTUAL OUTPUT
Warning: open(/tmp/sess/sess_09dc326bed7f1f69d88864e21abed7d3, O_RDWR) failed: No such file or
directory (2) in /home/dave/download/web/apache/build/php-4.3.0RC1/ext/session/tests/017.php on line
8
I live
Warning: open(/tmp/sess/sess_09dc326bed7f1f69d88864e21abed7d3, O_RDWR) failed: No such file or
directory (2) in Unknown on line 0
Warning: Failed to write session data (files). Please verify that the current setting of
session.save_path is correct (/tmp/sess) in Unknown on line 0
---- FAILED
================================================================================
001- I live
001+ Warning: open(/tmp/sess/sess_09dc326bed7f1f69d88864e21abed7d3, O_RDWR) failed: No such file or
directory (2) in /home/dave/download/web/apache/build/php-4.3.0RC1/ext/session/tests/017.php on line
8
002+ I live
003+
004+ Warning: open(/tmp/sess/sess_09dc326bed7f1f69d88864e21abed7d3, O_RDWR) failed: No such file or
directory (2) in Unknown on line 0
005+
006+ Warning: Failed to write session data (files). Please verify that the current setting of
session.save_path is correct (/tmp/sess) in Unknown on line 0
================================================================================
================================================================================
/home/dave/download/web/apache/build/php-4.3.0RC1/ext/session/tests/018.phpt
================================================================================
---- EXPECTED OUTPUT
<form accept-charset="ISO-8859-15, ISO-8859-1" action=url.php><input
type="hidden" name="PHPSESSID" value="abtest" />
---- ACTUAL OUTPUT
Warning: open(/tmp/sess/sess_abtest, O_RDWR) failed: No such file or directory (2) in
/home/dave/download/web/apache/build/php-4.3.0RC1/ext/session/tests/018.php on line 6
<form accept-charset="ISO-8859-15, ISO-8859-1" action=url.php><input
type="hidden" name="PHPSESSID" value="abtest" />
Warning: Session object destruction failed in
/home/dave/download/web/apache/build/php-4.3.0RC1/ext/session/tests/018.php on line 10
---- FAILED
================================================================================
001- <form accept-charset="ISO-8859-15, ISO-8859-1" action=url.php><input
type="hidden" name="PHPSESSID" value="abtest" />
001+ Warning: open(/tmp/sess/sess_abtest, O_RDWR) failed: No such file or directory (2) in
/home/dave/download/web/apache/build/php-4.3.0RC1/ext/session/tests/018.php on line 6
002+ <form accept-charset="ISO-8859-15, ISO-8859-1" action=url.php><input
type="hidden" name="PHPSESSID" value="abtest" />
003+
004+ Warning: Session object destruction failed in
/home/dave/download/web/apache/build/php-4.3.0RC1/ext/session/tests/018.php on line 10
================================================================================
================================================================================
/home/dave/download/web/apache/build/php-4.3.0RC1/ext/session/tests/019.phpt
================================================================================
---- EXPECTED OUTPUT
array(2) {
["o1"]=>
&object(tfoo)(1) {
["c"]=>
int(42)
}
["o2"]=>
&object(tfoo)(1) {
["c"]=>
int(42)
}
}
array(2) {
["o1"]=>
&object(tfoo)(1) {
["c"]=>
int(44)
}
["o2"]=>
&object(tfoo)(1) {
["c"]=>
int(44)
}
}
---- ACTUAL OUTPUT
Warning: open(/tmp/sess/sess_abtest, O_RDWR) failed: No such file or directory (2) in
/home/dave/download/web/apache/build/php-4.3.0RC1/ext/session/tests/019.php on line 16
Warning: open(/tmp/sess/sess_abtest, O_RDWR) failed: No such file or directory (2) in
/home/dave/download/web/apache/build/php-4.3.0RC1/ext/session/tests/019.php on line 22
Warning: Failed to write session data (files). Please verify that the current setting of
session.save_path is correct (/tmp/sess) in
/home/dave/download/web/apache/build/php-4.3.0RC1/ext/session/tests/019.php on line 22
Warning: open(/tmp/sess/sess_abtest, O_RDWR) failed: No such file or directory (2) in
/home/dave/download/web/apache/build/php-4.3.0RC1/ext/session/tests/019.php on line 27
array(0) {
}
Fatal error: Call to a member function on a non-object in
/home/dave/download/web/apache/build/php-4.3.0RC1/ext/session/tests/019.php on line 31
Warning: open(/tmp/sess/sess_abtest, O_RDWR) failed: No such file or directory (2) in Unknown on
line 0
Warning: Failed to write session data (files). Please verify that the current setting of
session.save_path is correct (/tmp/sess) in Unknown on line 0
---- FAILED
================================================================================
001- array(2) {
001+ Warning: open(/tmp/sess/sess_abtest, O_RDWR) failed: No such file or directory (2) in
/home/dave/download/web/apache/build/php-4.3.0RC1/ext/session/tests/019.php on line 16
002- ["o1"]=>
002+
003- &object(tfoo)(1) {
003+ Warning: open(/tmp/sess/sess_abtest, O_RDWR) failed: No such file or directory (2) in
/home/dave/download/web/apache/build/php-4.3.0RC1/ext/session/tests/019.php on line 22
004- ["c"]=>
004+
005- int(42)
005+ Warning: Failed to write session data (files). Please verify that the current setting of
session.save_path is correct (/tmp/sess) in
/home/dave/download/web/apache/build/php-4.3.0RC1/ext/session/tests/019.php on line 22
006- }
006+
007- ["o2"]=>
007+ Warning: open(/tmp/sess/sess_abtest, O_RDWR) failed: No such file or directory (2) in
/home/dave/download/web/apache/build/php-4.3.0RC1/ext/session/tests/019.php on line 27
008- &object(tfoo)(1) {
008+ array(0) {
009- ["c"]=>
009+ }
010- int(42)
010+
011- }
011+ Fatal error: Call to a member function on a non-object in
/home/dave/download/web/apache/build/php-4.3.0RC1/ext/session/tests/019.php on line 31
012- }
012+
013- array(2) {
013+ Warning: open(/tmp/sess/sess_abtest, O_RDWR) failed: No such file or directory (2) in Unknown
on line 0
014- ["o1"]=>
014+
015- &object(tfoo)(1) {
015+ Warning: Failed to write session data (files). Please verify that the current setting of
session.save_path is correct (/tmp/sess) in Unknown on line 0
016- ["c"]=>
017- int(44)
018- }
019- ["o2"]=>
020- &object(tfoo)(1) {
021- ["c"]=>
022- int(44)
023- }
024- }
================================================================================
================================================================================
/home/dave/download/web/apache/build/php-4.3.0RC1/ext/session/tests/020.phpt
================================================================================
---- EXPECTED OUTPUT
<a href="link.php?a=b&PHPSESSID=abtest">
---- ACTUAL OUTPUT
Warning: open(/tmp/sess/sess_abtest, O_RDWR) failed: No such file or directory (2) in
/home/dave/download/web/apache/build/php-4.3.0RC1/ext/session/tests/020.php on line 6
<a href="link.php?a=b&PHPSESSID=abtest">
Warning: Session object destruction failed in
/home/dave/download/web/apache/build/php-4.3.0RC1/ext/session/tests/020.php on line 10
---- FAILED
================================================================================
001- <a href="link.php?a=b&PHPSESSID=abtest">
001+ Warning: open(/tmp/sess/sess_abtest, O_RDWR) failed: No such file or directory (2) in
/home/dave/download/web/apache/build/php-4.3.0RC1/ext/session/tests/020.php on line 6
002+ <a href="link.php?a=b&PHPSESSID=abtest">
003+
004+ Warning: Session object destruction failed in
/home/dave/download/web/apache/build/php-4.3.0RC1/ext/session/tests/020.php on line 10
================================================================================
================================================================================
/home/dave/download/web/apache/build/php-4.3.0RC1/ext/session/tests/021.phpt
================================================================================
---- EXPECTED OUTPUT
<form><input type="hidden" name="PHPSESSID" value="abtest"
/>
<fieldset><input type="hidden" name="PHPSESSID"
value="abtest" />
<form><input type="hidden" name="PHPSESSID" value="abtest"
/>
<fieldset>
<form><input type="hidden" name="PHPSESSID" value="abtest"
/>
<fieldset>
<form>
<fieldset><input type="hidden" name="PHPSESSID"
value="abtest" />
---- ACTUAL OUTPUT
Warning: open(/tmp/sess/sess_abtest, O_RDWR) failed: No such file or directory (2) in
/home/dave/download/web/apache/build/php-4.3.0RC1/ext/session/tests/021.php on line 6
<form><input type="hidden" name="PHPSESSID" value="abtest"
/>
<fieldset><input type="hidden" name="PHPSESSID"
value="abtest" />
<form><input type="hidden" name="PHPSESSID" value="abtest"
/>
<fieldset>
<form><input type="hidden" name="PHPSESSID" value="abtest"
/>
<fieldset>
<form>
<fieldset><input type="hidden" name="PHPSESSID"
value="abtest" />
Warning: Session object destruction failed in
/home/dave/download/web/apache/build/php-4.3.0RC1/ext/session/tests/021.php on line 39
---- FAILED
================================================================================
001- <form><input type="hidden" name="PHPSESSID"
value="abtest" />
001+ Warning: open(/tmp/sess/sess_abtest, O_RDWR) failed: No such file or directory (2) in
/home/dave/download/web/apache/build/php-4.3.0RC1/ext/session/tests/021.php on line 6
002- <fieldset><input type="hidden" name="PHPSESSID"
value="abtest" />
002+ <form><input type="hidden" name="PHPSESSID"
value="abtest" />
003- <form><input type="hidden" name="PHPSESSID"
value="abtest" />
003+ <fieldset><input type="hidden" name="PHPSESSID"
value="abtest" />
004- <fieldset>
004+ <form><input type="hidden" name="PHPSESSID"
value="abtest" />
005- <form><input type="hidden" name="PHPSESSID"
value="abtest" />
005+ <fieldset>
006- <fieldset>
006+ <form><input type="hidden" name="PHPSESSID"
value="abtest" />
007- <form>
007+ <fieldset>
008- <fieldset><input type="hidden" name="PHPSESSID"
value="abtest" />
008+ <form>
009+ <fieldset><input type="hidden" name="PHPSESSID"
value="abtest" />
010+
011+ Warning: Session object destruction failed in
/home/dave/download/web/apache/build/php-4.3.0RC1/ext/session/tests/021.php on line 39
================================================================================
================================================================================
/home/dave/download/web/apache/build/php-4.3.0RC1/ext/standard/tests/file/fopencookie.phpt
================================================================================
---- EXPECTED OUTPUT
If you can read this, it worked
---- ACTUAL OUTPUT
Warning: main() [/phpmanual/function.main.html]: cannot represent a stream of type user-space as a
STDIO FILE* in
/home/dave/download/web/apache/build/php-4.3.0RC1/ext/standard/tests/file/fopencookie.php on line 79
Warning: Failed opening 'cookietest://foo' for inclusion
(include_path='.:/php/includes:/usr/share/php') in
/home/dave/download/web/apache/build/php-4.3.0RC1/ext/standard/tests/file/fopencookie.php on line 79
---- FAILED
================================================================================
001- If you can read this, it worked
001+ Warning: main() [/phpmanual/function.main.html]: cannot represent a stream of type user-space
as a STDIO FILE* in
/home/dave/download/web/apache/build/php-4.3.0RC1/ext/standard/tests/file/fopencookie.php on line 79
002+
003+ Warning: Failed opening 'cookietest://foo' for inclusion
(include_path='.:/php/includes:/usr/share/php') in
/home/dave/download/web/apache/build/php-4.3.0RC1/ext/standard/tests/file/fopencookie.php on line 79
================================================================================
================================================================================
PHPINFO
================================================================================
phpinfo()
PHP Version => 4.3.0RC1
System => Linux brug.whitinger.net 2.4.18-3 #1 Thu Apr 18 07:32:41 EDT 2002 i686
Build Date => Nov 20 2002 15:27:40
Configure Command => './configure' '--with-mysql'
'--with-apache=../apache_1.3.27/'
Server API => Command Line Interface
Virtual Directory Support => disabled
Configuration File (php.ini) Path => /usr/local/lib/php.ini
PHP API => 20020918
PHP Extension => 20020429
Zend Extension => 20021010
Debug Build => no
Thread Safety => disabled
Registered PHP Streams => php, http, ftp
This program makes use of the Zend Scripting Language Engine:
Zend Engine v1.3.0, Copyright (c) 1998-2002 Zend Technologies
_______________________________________________________________________
Configuration
PHP Core
Directive => Local Value => Master Value
allow_call_time_pass_reference => On => On
allow_url_fopen => On => On
always_populate_raw_post_data => Off => Off
arg_separator.input => & => &
arg_separator.output => & => &
asp_tags => Off => Off
auto_append_file => no value => no value
auto_prepend_file => no value => no value
browscap => no value => no value
default_charset => no value => no value
default_mimetype => text/html => text/html
define_syslog_variables => Off => Off
disable_functions => no value => no value
display_errors => On => On
display_startup_errors => Off => Off
doc_root => no value => no value
docref_ext => no value => no value
docref_root => http://www.php.net/ => http://www.php.net/
enable_dl => On => On
error_append_string => no value => no value
error_log => /tmp/phplogfile => /tmp/phplogfile
error_prepend_string => no value => no value
error_reporting => 2039 => 2039
expose_php => On => On
extension_dir => /usr/local/lib/php/extensions => /usr/local/lib/php/extensions
file_uploads => On => On
gpc_order => GPC => GPC
highlight.bg => #FFFFFF => #FFFFFF
highlight.comment => #FF9900 => #FF9900
highlight.default => #0000CC => #0000CC
highlight.html => #000000 => #000000
highlight.keyword => #006600 => #006600
highlight.string => #CC0000 => #CC0000
html_errors => Off => On
ignore_repeated_errors => Off => Off
ignore_repeated_source => Off => Off
ignore_user_abort => Off => Off
implicit_flush => On => Off
include_path => .:/php/includes:/usr/share/php => .:/php/includes:/usr/share/php
log_errors => On => On
log_errors_max_len => 1024 => 1024
magic_quotes_gpc => On => On
magic_quotes_runtime => Off => Off
magic_quotes_sybase => Off => Off
max_execution_time => 0 => 120
max_input_time => -1 => -1
open_basedir => no value => no value
output_buffering => no value => no value
output_handler => no value => no value
post_max_size => 8M => 8M
precision => 14 => 14
register_argc_argv => On => On
register_globals => On => On
report_memleaks => On => On
safe_mode => Off => Off
safe_mode_exec_dir => no value => no value
safe_mode_gid => Off => Off
safe_mode_include_dir => no value => no value
sendmail_from => me@localhost.com => me@localhost.com
sendmail_path => /usr/sbin/sendmail -t -i => /usr/sbin/sendmail -t -i
short_open_tag => On => On
SMTP => localhost => localhost
smtp_port => 25 => 25
sql.safe_mode => Off => Off
track_errors => Off => Off
unserialize_callback_func => no value => no value
upload_max_filesize => 2M => 2M
upload_tmp_dir => no value => no value
user_dir => no value => no value
variables_order => EGPCS => EGPCS
xmlrpc_error_number => 0 => 0
xmlrpc_errors => Off => Off
y2k_compliance => Off => Off
xml
XML Support => active
XML Namespace Support => active
EXPAT Version => 1.95.2
tokenizer
Tokenizer Support => enabled
standard
Regex Library => Bundled library enabled
Dynamic Library Support => enabled
Path to sendmail => /usr/sbin/sendmail -t -i
Directive => Local Value => Master Value
assert.active => 1 => 1
assert.bail => 0 => 0
assert.callback => no value => no value
assert.quiet_eval => 0 => 0
assert.warning => 1 => 1
auto_detect_line_endings => 0 => 0
default_socket_timeout => 60 => 60
safe_mode_allowed_env_vars => PHP_ => PHP_
safe_mode_protected_env_vars => LD_LIBRARY_PATH => LD_LIBRARY_PATH
url_rewriter.tags => a=href,area=href,frame=src,input=src,form=fakeentry =>
a=href,area=href,frame=src,input=src,form=fakeentry
user_agent => no value => no value
session
Session Support => enabled
Registered save handlers => files user
Directive => Local Value => Master Value
session.auto_start => Off => Off
session.bug_compat_42 => On => On
session.bug_compat_warn => On => On
session.cache_expire => 180 => 180
session.cache_limiter => nocache => nocache
session.cookie_domain => no value => no value
session.cookie_lifetime => 0 => 0
session.cookie_path => / => /
session.cookie_secure => Off => Off
session.entropy_file => no value => no value
session.entropy_length => 0 => 0
session.gc_dividend => 100 => 100
session.gc_maxlifetime => 1440 => 1440
session.gc_probability => 1 => 1
session.name => PHPSESSID => PHPSESSID
session.referer_check => no value => no value
session.save_handler => files => files
session.save_path => /tmp/sess => /tmp/sess
session.serialize_handler => php => php
session.use_cookies => On => On
session.use_only_cookies => Off => Off
session.use_trans_sid => On => On
posix
Revision => $Revision: 1.51 $
pcre
PCRE (Perl Compatible Regular Expressions) Support => enabled
PCRE Library Version => 3.92 11-Sep-2002
overload
User-Space Object Overloading Support => enabled
mysql
MySQL Support => enabled
Active Persistent Links => 0
Active Links => 0
Client API version => 3.23.49
MYSQL_MODULE_TYPE => builtin
MYSQL_SOCKET => /var/lib/mysql/mysql.sock
MYSQL_INCLUDE => MYSQL_LIBS =>
Directive => Local Value => Master Value
mysql.allow_persistent => On => On
mysql.connect_timeout => -1 => -1
mysql.default_host => no value => no value
mysql.default_password => no value => no value
mysql.default_port => no value => no value
mysql.default_socket => no value => no value
mysql.default_user => no value => no value
mysql.max_links => Unlimited => Unlimited
mysql.max_persistent => Unlimited => Unlimited
mysql.trace_mode => Off => Off
ctype
ctype functions => enabled
tclink
TCLink PHP Module => 3.3.1-PHP-Linux-i686
Additional Modules
Module Name
Environment
Variable => Value
PWD => /home/dave/download/web/apache/build/php-4.3.0RC1
XAUTHORITY => /root/.xauthgLdi2k
MAKEFLAGS => MFLAGS => HOSTNAME => brug.whitinger.net
REDIRECT_STATUS => 1
TEST_PHP_EXECUTABLE => /home/dave/download/web/apache/build/php-4.3.0RC1/sapi/cli/php
QTDIR => /usr/lib/qt3-gcc2.96
LESSOPEN => |/usr/bin/lesspipe.sh %s
CC => gcc
LS_COLORS =>
no=00:fi=00:di=01;34:ln=01;36:pi=40;33:so=01;35:bd=40;33;01:cd=40;33;01:or=01;05;37;41:mi=01;05;37;41:ex=01;32:*.cmd=01;32:*.exe=01;32:*.com=01;32:*.btm=01;32:*.bat=01;32:*.sh=01;32:*.csh=01;32:*.tar=01;31:*.tgz=01;31:*.arj=01;31:*.taz=01;31:*.lzh=01;31:*.zip=01;31:*.z=01;31:*.Z=01;31:*.gz=01;31:*.bz2=01;31:*.bz=01;31:*.tz=01;31:*.rpm=01;31:*.cpio=01;31:*.jpg=01;35:*.gif=01;35:*.bmp=01;35:*.xbm=01;35:*.xpm=01;35:*.png=01;35:*.tif=01;35:
USER => root
SCRIPT_FILENAME => /home/dave/download/web/apache/build/php-4.3.0RC1/tests/strings/004.php
MAIL => /var/spool/mail/root
INPUTRC => /etc/inputrc
BASH_ENV => /root/.bashrc
PATH_TRANSLATED => /home/dave/download/web/apache/build/php-4.3.0RC1/tests/strings/004.php
LANG => en_US.iso885915
QUERY_STRING => CONTENT_LENGTH => MAKELEVEL => 1
DISPLAY => :0.0
SHLVL => 3
LOGNAME => root
_ => /home/dave/download/web/apache/build/php-4.3.0RC1/sapi/cli/php
REQUEST_METHOD => GET
SHELL => /bin/sh
USERNAME => root
TEST_PHP_SRCDIR => /home/dave/download/web/apache/build/php-4.3.0RC1
HISTSIZE => 1000
TERM => xterm
HOME => /root
SSH_ASKPASS => /usr/libexec/openssh/gnome-ssh-askpass
PATH =>
/bin:/sbin:/usr/bin:/usr/sbin:/usr/local/bin:/usr/local/sbin:/usr/bin/X11:/usr/X11R6/bin:/usr/local/Acrobat5/bin/:/root/bin
CONTENT_TYPE =>
PHP Variables
Variable => Value
PHP_SELF => _SERVER["PWD"] => /home/dave/download/web/apache/build/php-4.3.0RC1
_SERVER["XAUTHORITY"] => /root/.xauthgLdi2k
_SERVER["MAKEFLAGS"] =>
_SERVER["MFLAGS"] =>
_SERVER["HOSTNAME"] => brug.whitinger.net
_SERVER["REDIRECT_STATUS"] => 1
_SERVER["TEST_PHP_EXECUTABLE"] =>
/home/dave/download/web/apache/build/php-4.3.0RC1/sapi/cli/php
_SERVER["QTDIR"] => /usr/lib/qt3-gcc2.96
_SERVER["LESSOPEN"] => |/usr/bin/lesspipe.sh %s
_SERVER["CC"] => gcc
_SERVER["LS_COLORS"] =>
no=00:fi=00:di=01;34:ln=01;36:pi=40;33:so=01;35:bd=40;33;01:cd=40;33;01:or=01;05;37;41:mi=01;05;37;41:ex=01;32:*.cmd=01;32:*.exe=01;32:*.com=01;32:*.btm=01;32:*.bat=01;32:*.sh=01;32:*.csh=01;32:*.tar=01;31:*.tgz=01;31:*.arj=01;31:*.taz=01;31:*.lzh=01;31:*.zip=01;31:*.z=01;31:*.Z=01;31:*.gz=01;31:*.bz2=01;31:*.bz=01;31:*.tz=01;31:*.rpm=01;31:*.cpio=01;31:*.jpg=01;35:*.gif=01;35:*.bmp=01;35:*.xbm=01;35:*.xpm=01;35:*.png=01;35:*.tif=01;35:
_SERVER["USER"] => root
_SERVER["SCRIPT_FILENAME"] =>
_SERVER["MAIL"] => /var/spool/mail/root
_SERVER["INPUTRC"] => /etc/inputrc
_SERVER["BASH_ENV"] => /root/.bashrc
_SERVER["PATH_TRANSLATED"] =>
_SERVER["LANG"] => en_US.iso885915
_SERVER["QUERY_STRING"] =>
_SERVER["CONTENT_LENGTH"] =>
_SERVER["MAKELEVEL"] => 1
_SERVER["DISPLAY"] => :0.0
_SERVER["SHLVL"] => 3
_SERVER["LOGNAME"] => root
_SERVER["_"] => /home/dave/download/web/apache/build/php-4.3.0RC1/sapi/cli/php
_SERVER["REQUEST_METHOD"] => GET
_SERVER["SHELL"] => /bin/sh
_SERVER["USERNAME"] => root
_SERVER["TEST_PHP_SRCDIR"] => /home/dave/download/web/apache/build/php-4.3.0RC1
_SERVER["HISTSIZE"] => 1000
_SERVER["TERM"] => xterm
_SERVER["HOME"] => /root
_SERVER["SSH_ASKPASS"] => /usr/libexec/openssh/gnome-ssh-askpass
_SERVER["PATH"] =>
/bin:/sbin:/usr/bin:/usr/sbin:/usr/local/bin:/usr/local/sbin:/usr/bin/X11:/usr/X11R6/bin:/usr/local/Acrobat5/bin/:/root/bin
_SERVER["CONTENT_TYPE"] =>
_SERVER["PHP_SELF"] =>
_SERVER["SCRIPT_NAME"] =>
_SERVER["DOCUMENT_ROOT"] =>
_SERVER["argv"] => Array
(
)
_SERVER["argc"] => 0
_ENV["PWD"] => /home/dave/download/web/apache/build/php-4.3.0RC1
_ENV["XAUTHORITY"] => /root/.xauthgLdi2k
_ENV["MAKEFLAGS"] =>
_ENV["MFLAGS"] =>
_ENV["HOSTNAME"] => brug.whitinger.net
_ENV["REDIRECT_STATUS"] => 1
_ENV["TEST_PHP_EXECUTABLE"] =>
/home/dave/download/web/apache/build/php-4.3.0RC1/sapi/cli/php
_ENV["QTDIR"] => /usr/lib/qt3-gcc2.96
_ENV["LESSOPEN"] => |/usr/bin/lesspipe.sh %s
_ENV["CC"] => gcc
_ENV["LS_COLORS"] =>
no=00:fi=00:di=01;34:ln=01;36:pi=40;33:so=01;35:bd=40;33;01:cd=40;33;01:or=01;05;37;41:mi=01;05;37;41:ex=01;32:*.cmd=01;32:*.exe=01;32:*.com=01;32:*.btm=01;32:*.bat=01;32:*.sh=01;32:*.csh=01;32:*.tar=01;31:*.tgz=01;31:*.arj=01;31:*.taz=01;31:*.lzh=01;31:*.zip=01;31:*.z=01;31:*.Z=01;31:*.gz=01;31:*.bz2=01;31:*.bz=01;31:*.tz=01;31:*.rpm=01;31:*.cpio=01;31:*.jpg=01;35:*.gif=01;35:*.bmp=01;35:*.xbm=01;35:*.xpm=01;35:*.png=01;35:*.tif=01;35:
_ENV["USER"] => root
_ENV["SCRIPT_FILENAME"] =>
/home/dave/download/web/apache/build/php-4.3.0RC1/tests/strings/004.php
_ENV["MAIL"] => /var/spool/mail/root
_ENV["INPUTRC"] => /etc/inputrc
_ENV["BASH_ENV"] => /root/.bashrc
_ENV["PATH_TRANSLATED"] =>
/home/dave/download/web/apache/build/php-4.3.0RC1/tests/strings/004.php
_ENV["LANG"] => en_US.iso885915
_ENV["QUERY_STRING"] =>
_ENV["CONTENT_LENGTH"] =>
_ENV["MAKELEVEL"] => 1
_ENV["DISPLAY"] => :0.0
_ENV["SHLVL"] => 3
_ENV["LOGNAME"] => root
_ENV["_"] => /home/dave/download/web/apache/build/php-4.3.0RC1/sapi/cli/php
_ENV["REQUEST_METHOD"] => GET
_ENV["SHELL"] => /bin/sh
_ENV["USERNAME"] => root
_ENV["TEST_PHP_SRCDIR"] => /home/dave/download/web/apache/build/php-4.3.0RC1
_ENV["HISTSIZE"] => 1000
_ENV["TERM"] => xterm
_ENV["HOME"] => /root
_ENV["SSH_ASKPASS"] => /usr/libexec/openssh/gnome-ssh-askpass
_ENV["PATH"] =>
/bin:/sbin:/usr/bin:/usr/sbin:/usr/local/bin:/usr/local/sbin:/usr/bin/X11:/usr/X11R6/bin:/usr/local/Acrobat5/bin/:/root/bin
_ENV["CONTENT_TYPE"] =>
PHP License
This program is free software; you can redistribute it and/or modify
it under the terms of the PHP License as published by the PHP Group
and included in the distribution in the file: LICENSE
This program is distributed in the hope that it will be useful,
but WITHOUT ANY WARRANTY; without even the implied warranty of
MERCHANTABILITY or FITNESS FOR A PARTICULAR PURPOSE.
If you did not receive a copy of the PHP license, or have any
questions about PHP licensing, please contact license@php.net.