Test results

From: Date: Thu, 21 Nov 2002 18:44:41 +0000
Subject: Test results
Groups: php.qa 
Request: Send a blank email to php-qa+get-6939@lists.php.net to get a copy of this message
OS: Linux Automake: automake (GNU automake) 1.5 Written by Tom Tromey <tromey@cygnus.com>. Copyright 1994, 1995, 1996, 1997, 1998, 1999, 2000, 2001 Free Software Foundation, Inc. This is free software; see the source for copying conditions. There is NO warranty; not even for MERCHANTABILITY or FITNESS FOR A PARTICULAR PURPOSE. Autoconf: autoconf (GNU Autoconf) 2.53 Written by David J. MacKenzie and Akim Demaille. Copyright 2002 Free Software Foundation, Inc. This is free software; see the source for copying conditions. There is NO warranty; not even for MERCHANTABILITY or FITNESS FOR A PARTICULAR PURPOSE. Libtool: ltmain.sh (GNU libtool) 1.4.2 (1.922.2.53 2001/09/11 03:18:52) Compiler: Reading specs from /usr/lib/gcc-lib/i386-slackware-linux/2.95.3/specs gcc version 2.95.3 20010315 (release) Bison: bison (GNU Bison) 1.35 Copyright 1984, 1986, 1989, 1992, 2000, 2001, 2002 Free Software Foundation, Inc. This is free software; see the source for copying conditions. There is NO warranty; not even for MERCHANTABILITY or FITNESS FOR A PARTICULAR PURPOSE. ===================================================================== FAILED TEST SUMMARY --------------------------------------------------------------------- Check for exif_read_data [ext/exif/tests/exif001.phpt] Check for exif_thumbnail [ext/exif/tests/exif002.phpt] Check for exif_read_data, Unicode user comment [ext/exif/tests/exif003.phpt] Check for exif_read_data, unusual IFD start [ext/exif/tests/exif005.phpt] OpenSSL private key functions [ext/openssl/tests/001.phpt] rewriter handles form and fieldset tags correctly [ext/session/tests/021.phpt] File type functions [ext/standard/tests/file/001.phpt] is_*() and file_exists() return values are boolean. [ext/standard/tests/file/003.phpt] Bug #20424: stream_get_meta_data craches on a normal file stream [ext/standard/tests/file/bug20424.phpt] fgetcsv() with tab delimited fields (BUG #8258) [ext/standard/tests/general_functions/004.phpt] is_scalar() function test [ext/standard/tests/general_functions/005.phpt] Bug #13213 (GetImageSize and wrong JPEG Comments [ext/standard/tests/image/bug13213.phpt] GetImageSize() [ext/standard/tests/image/getimagesize.phpt] GetImageSize() for compressed swf files [ext/standard/tests/image/getimagesize_swc.phpt] image_type_to_mime_type() [ext/standard/tests/image/image_type_to_mime_type.phpt] Bug #20169 [ext/standard/tests/strings/bug20169.phpt] microtime() function [ext/standard/tests/time/001.phpt] strtotime() function [ext/standard/tests/time/002.phpt] Check for mktime with out-of-range parameters [ext/standard/tests/time/003.phpt] XML parser test, function callbacks [ext/xml/tests/xml001.phpt] XML parser test, object tuple callbacks [ext/xml/tests/xml002.phpt] XML parser test, xml_set_object callbacks [ext/xml/tests/xml003.phpt] XML parser case folding test [ext/xml/tests/xml004.phpt] ===================================================================== ================================================================================ /usr/src/php-4.3.0RC1/ext/exif/tests/exif001.phpt ================================================================================ ---- EXPECTED OUTPUT array(5) { ["FILE"]=> array(6) { ["FileName"]=> string(9) "test2.jpg" ["FileDateTime"]=> int(%d) ["FileSize"]=> int(1240) ["FileType"]=> int(2) ["MimeType"]=> string(10) "image/jpeg" ["SectionsFound"]=> string(33) "ANY_TAG, IFD0, THUMBNAIL, COMMENT" } ["COMPUTED"]=> array(12) { ["html"]=> string(20) "width="1" height="1"" ["Height"]=> int(1) ["Width"]=> int(1) ["IsColor"]=> int(1) ["ByteOrderMotorola"]=> int(1) ["UserComment"]=> string(16) "Exif test image." ["UserCommentEncoding"]=> string(5) "ASCII" ["Copyright"]=> string(41) "Photo (c) M.Boerger, Edited by M.Boerger." ["Copyright.Photographer"]=> string(19) "Photo (c) M.Boerger" ["Copyright.Editor"]=> string(20) "Edited by M.Boerger." ["Thumbnail.FileType"]=> int(2) ["Thumbnail.MimeType"]=> string(10) "image/jpeg" } ["IFD0"]=> array(2) { ["Copyright"]=> string(19) "Photo (c) M.Boerger" ["UserComment"]=> string(5) "ASCII" } ["THUMBNAIL"]=> array(2) { ["JPEGInterchangeFormat"]=> int(134) ["JPEGInterchangeFormatLength"]=> int(523) } ["COMMENT"]=> array(3) { [0]=> string(11) "Comment #1." [1]=> string(11) "Comment #2." [2]=> string(13) "Comment #3end" } } ---- ACTUAL OUTPUT Warning: exif_read_data() [/phpmanual/function.exif-read-data.html]: SAFE MODE Restriction in effect. The script whose uid is 0 is not allowed to access ./ext/exif/tests/test2.jpg owned by uid 500 in /usr/src/php-4.3.0RC1/ext/exif/tests/exif001.php on line 7 Warning: exif_read_data() [/phpmanual/function.exif-read-data.html]: unable to open file in /usr/src/php-4.3.0RC1/ext/exif/tests/exif001.php on line 7 bool(false) ---- FAILED ================================================================================ 001- array(5) { 001+ Warning: exif_read_data() [/phpmanual/function.exif-read-data.html]: SAFE MODE Restriction in effect. The script whose uid is 0 is not allowed to access ./ext/exif/tests/test2.jpg owned by uid 500 in /usr/src/php-4.3.0RC1/ext/exif/tests/exif001.php on line 7 002- ["FILE"]=> 002+ 003- array(6) { 003+ Warning: exif_read_data() [/phpmanual/function.exif-read-data.html]: unable to open file in /usr/src/php-4.3.0RC1/ext/exif/tests/exif001.php on line 7 004- ["FileName"]=> 004+ bool(false) 005- string(9) "test2.jpg" 006- ["FileDateTime"]=> 007- int(%d) 008- ["FileSize"]=> 009- int(1240) 010- ["FileType"]=> 011- int(2) 012- ["MimeType"]=> 013- string(10) "image/jpeg" 014- ["SectionsFound"]=> 015- string(33) "ANY_TAG, IFD0, THUMBNAIL, COMMENT" 016- } 017- ["COMPUTED"]=> 018- array(12) { 019- ["html"]=> 020- string(20) "width="1" height="1"" 021- ["Height"]=> 022- int(1) 023- ["Width"]=> 024- int(1) 025- ["IsColor"]=> 026- int(1) 027- ["ByteOrderMotorola"]=> 028- int(1) 029- ["UserComment"]=> 030- string(16) "Exif test image." 031- ["UserCommentEncoding"]=> 032- string(5) "ASCII" 033- ["Copyright"]=> 034- string(41) "Photo (c) M.Boerger, Edited by M.Boerger." 035- ["Copyright.Photographer"]=> 036- string(19) "Photo (c) M.Boerger" 037- ["Copyright.Editor"]=> 038- string(20) "Edited by M.Boerger." 039- ["Thumbnail.FileType"]=> 040- int(2) 041- ["Thumbnail.MimeType"]=> 042- string(10) "image/jpeg" 043- } 044- ["IFD0"]=> 045- array(2) { 046- ["Copyright"]=> 047- string(19) "Photo (c) M.Boerger" 048- ["UserComment"]=> 049- string(5) "ASCII" 050- } 051- ["THUMBNAIL"]=> 052- array(2) { 053- ["JPEGInterchangeFormat"]=> 054- int(134) 055- ["JPEGInterchangeFormatLength"]=> 056- int(523) 057- } 058- ["COMMENT"]=> 059- array(3) { 060- [0]=> 061- string(11) "Comment #1." 062- [1]=> 063- string(11) "Comment #2." 064- [2]=> 065- string(13) "Comment #3end" 066- } 067- } ================================================================================ ================================================================================ /usr/src/php-4.3.0RC1/ext/exif/tests/exif002.phpt ================================================================================ ---- EXPECTED OUTPUT 27bbfd9fc10e1e663d749f5225447905_523 == 27bbfd9fc10e1e663d749f5225447905_523 ---- ACTUAL OUTPUT Warning: md5_file() [/phpmanual/function.md5-file.html]: SAFE MODE Restriction in effect. The script whose uid is 0 is not allowed to access ./ext/exif/tests/test1.jpg owned by uid 500 in /usr/src/php-4.3.0RC1/ext/exif/tests/exif002.php on line 8 Warning: filesize() [/phpmanual/function.filesize.html]: SAFE MODE Restriction in effect. The script whose uid is 0 is not allowed to access ./ext/exif/tests/test1.jpg owned by uid 500 in /usr/src/php-4.3.0RC1/ext/exif/tests/exif002.php on line 8 _ Warning: exif_thumbnail() [/phpmanual/function.exif-thumbnail.html]: SAFE MODE Restriction in effect. The script whose uid is 0 is not allowed to access ./ext/exif/tests/test2.jpg owned by uid 500 in /usr/src/php-4.3.0RC1/ext/exif/tests/exif002.php on line 9 Warning: exif_thumbnail() [/phpmanual/function.exif-thumbnail.html]: unable to open file in /usr/src/php-4.3.0RC1/ext/exif/tests/exif002.php on line 9 == d41d8cd98f00b204e9800998ecf8427e_0 ---- FAILED ================================================================================ 001- 27bbfd9fc10e1e663d749f5225447905_523 == 27bbfd9fc10e1e663d749f5225447905_523 001+ Warning: md5_file() [/phpmanual/function.md5-file.html]: SAFE MODE Restriction in effect. The script whose uid is 0 is not allowed to access ./ext/exif/tests/test1.jpg owned by uid 500 in /usr/src/php-4.3.0RC1/ext/exif/tests/exif002.php on line 8 002+ 003+ Warning: filesize() [/phpmanual/function.filesize.html]: SAFE MODE Restriction in effect. The script whose uid is 0 is not allowed to access ./ext/exif/tests/test1.jpg owned by uid 500 in /usr/src/php-4.3.0RC1/ext/exif/tests/exif002.php on line 8 004+ _ 005+ Warning: exif_thumbnail() [/phpmanual/function.exif-thumbnail.html]: SAFE MODE Restriction in effect. The script whose uid is 0 is not allowed to access ./ext/exif/tests/test2.jpg owned by uid 500 in /usr/src/php-4.3.0RC1/ext/exif/tests/exif002.php on line 9 006+ 007+ Warning: exif_thumbnail() [/phpmanual/function.exif-thumbnail.html]: unable to open file in /usr/src/php-4.3.0RC1/ext/exif/tests/exif002.php on line 9 008+ == d41d8cd98f00b204e9800998ecf8427e_0 ================================================================================ ================================================================================ /usr/src/php-4.3.0RC1/ext/exif/tests/exif003.phpt ================================================================================ ---- EXPECTED OUTPUT array(5) { ["FILE"]=> array(6) { ["FileName"]=> string(9) "test3.jpg" ["FileDateTime"]=> int(%s) ["FileSize"]=> int(1240) ["FileType"]=> int(2) ["MimeType"]=> string(10) "image/jpeg" ["SectionsFound"]=> string(33) "ANY_TAG, IFD0, THUMBNAIL, COMMENT" } ["COMPUTED"]=> array(12) { ["html"]=> string(20) "width="1" height="1"" ["Height"]=> int(1) ["Width"]=> int(1) ["IsColor"]=> int(1) ["ByteOrderMotorola"]=> int(1) ["UserComment"]=> string(7) "ÄÖÜßäöü" ["UserCommentEncoding"]=> string(7) "UNICODE" ["Copyright"]=> string(41) "Photo (c) M.Boerger, Edited by M.Boerger." ["Copyright.Photographer"]=> string(19) "Photo (c) M.Boerger" ["Copyright.Editor"]=> string(20) "Edited by M.Boerger." ["Thumbnail.FileType"]=> int(2) ["Thumbnail.MimeType"]=> string(10) "image/jpeg" } ["IFD0"]=> array(2) { ["Copyright"]=> string(19) "Photo (c) M.Boerger" ["UserComment"]=> string(7) "UNICODE" } ["THUMBNAIL"]=> array(2) { ["JPEGInterchangeFormat"]=> int(134) ["JPEGInterchangeFormatLength"]=> int(523) } ["COMMENT"]=> array(3) { [0]=> string(11) "Comment #1." [1]=> string(11) "Comment #2." [2]=> string(13) "Comment #3end" } } ---- ACTUAL OUTPUT Warning: exif_read_data() [/phpmanual/function.exif-read-data.html]: SAFE MODE Restriction in effect. The script whose uid is 0 is not allowed to access ./ext/exif/tests/test3.jpg owned by uid 500 in /usr/src/php-4.3.0RC1/ext/exif/tests/exif003.php on line 8 Warning: exif_read_data() [/phpmanual/function.exif-read-data.html]: unable to open file in /usr/src/php-4.3.0RC1/ext/exif/tests/exif003.php on line 8 bool(false) ---- FAILED ================================================================================ 001- array(5) { 001+ Warning: exif_read_data() [/phpmanual/function.exif-read-data.html]: SAFE MODE Restriction in effect. The script whose uid is 0 is not allowed to access ./ext/exif/tests/test3.jpg owned by uid 500 in /usr/src/php-4.3.0RC1/ext/exif/tests/exif003.php on line 8 002- ["FILE"]=> 002+ 003- array(6) { 003+ Warning: exif_read_data() [/phpmanual/function.exif-read-data.html]: unable to open file in /usr/src/php-4.3.0RC1/ext/exif/tests/exif003.php on line 8 004- ["FileName"]=> 004+ bool(false) 005- string(9) "test3.jpg" 006- ["FileDateTime"]=> 007- int(%s) 008- ["FileSize"]=> 009- int(1240) 010- ["FileType"]=> 011- int(2) 012- ["MimeType"]=> 013- string(10) "image/jpeg" 014- ["SectionsFound"]=> 015- string(33) "ANY_TAG, IFD0, THUMBNAIL, COMMENT" 016- } 017- ["COMPUTED"]=> 018- array(12) { 019- ["html"]=> 020- string(20) "width="1" height="1"" 021- ["Height"]=> 022- int(1) 023- ["Width"]=> 024- int(1) 025- ["IsColor"]=> 026- int(1) 027- ["ByteOrderMotorola"]=> 028- int(1) 029- ["UserComment"]=> 030- string(7) "ÄÖÜßäöü" 031- ["UserCommentEncoding"]=> 032- string(7) "UNICODE" 033- ["Copyright"]=> 034- string(41) "Photo (c) M.Boerger, Edited by M.Boerger." 035- ["Copyright.Photographer"]=> 036- string(19) "Photo (c) M.Boerger" 037- ["Copyright.Editor"]=> 038- string(20) "Edited by M.Boerger." 039- ["Thumbnail.FileType"]=> 040- int(2) 041- ["Thumbnail.MimeType"]=> 042- string(10) "image/jpeg" 043- } 044- ["IFD0"]=> 045- array(2) { 046- ["Copyright"]=> 047- string(19) "Photo (c) M.Boerger" 048- ["UserComment"]=> 049- string(7) "UNICODE" 050- } 051- ["THUMBNAIL"]=> 052- array(2) { 053- ["JPEGInterchangeFormat"]=> 054- int(134) 055- ["JPEGInterchangeFormatLength"]=> 056- int(523) 057- } 058- ["COMMENT"]=> 059- array(3) { 060- [0]=> 061- string(11) "Comment #1." 062- [1]=> 063- string(11) "Comment #2." 064- [2]=> 065- string(13) "Comment #3end" 066- } 067- } ================================================================================ ================================================================================ /usr/src/php-4.3.0RC1/ext/exif/tests/exif005.phpt ================================================================================ ---- EXPECTED OUTPUT array(2) { ["ImageDescription"]=> string(11) "Ifd00000009" ["DateTime"]=> string(19) "2002:10:18 20:06:00" } ---- ACTUAL OUTPUT Warning: exif_read_data() [/phpmanual/function.exif-read-data.html]: SAFE MODE Restriction in effect. The script whose uid is 0 is not allowed to access ./ext/exif/tests/test5.jpg owned by uid 500 in /usr/src/php-4.3.0RC1/ext/exif/tests/exif005.php on line 5 Warning: exif_read_data() [/phpmanual/function.exif-read-data.html]: unable to open file in /usr/src/php-4.3.0RC1/ext/exif/tests/exif005.php on line 5 NULL ---- FAILED ================================================================================ 001- array(2) { 001+ Warning: exif_read_data() [/phpmanual/function.exif-read-data.html]: SAFE MODE Restriction in effect. The script whose uid is 0 is not allowed to access ./ext/exif/tests/test5.jpg owned by uid 500 in /usr/src/php-4.3.0RC1/ext/exif/tests/exif005.php on line 5 002- ["ImageDescription"]=> 002+ 003- string(11) "Ifd00000009" 003+ Warning: exif_read_data() [/phpmanual/function.exif-read-data.html]: unable to open file in /usr/src/php-4.3.0RC1/ext/exif/tests/exif005.php on line 5 004- ["DateTime"]=> 004+ NULL 005- string(19) "2002:10:18 20:06:00" 006- } ================================================================================ ================================================================================ /usr/src/php-4.3.0RC1/ext/openssl/tests/001.phpt ================================================================================ ---- EXPECTED OUTPUT Creating private key Export key to file Load key from file - array syntax Load key using direct syntax Load key manually and use string syntax OK! ---- ACTUAL OUTPUT Creating private key Export key to file Load key from file - array syntax failed to load key using array syntax ---- FAILED ================================================================================ 004- Load key using direct syntax 004+ failed to load key using array syntax 005- Load key manually and use string syntax 006- OK! ================================================================================ ================================================================================ /usr/src/php-4.3.0RC1/ext/session/tests/021.phpt ================================================================================ ---- EXPECTED OUTPUT <form><input type="hidden" name="PHPSESSID" value="abtest" /> <fieldset><input type="hidden" name="PHPSESSID" value="abtest" /> <form><input type="hidden" name="PHPSESSID" value="abtest" /> <fieldset> <form><input type="hidden" name="PHPSESSID" value="abtest" /> <fieldset> <form> <fieldset><input type="hidden" name="PHPSESSID" value="abtest" /> ---- ACTUAL OUTPUT <form><input type="hidden" name="PHPSESSID" value="abtest" /> <fieldset><input type="hidden" name="PHPSESSID" value="abtest" /> Warning: ini_set() [/phpmanual/function.ini-set.html]: SAFE MODE Restriction in effect. The script whose uid is 0 is not allowed to access /usr/src/php-4.3.0RC1 owned by uid 500 in /usr/src/php-4.3.0RC1/ext/session/tests/021.php on line 14 <form><input type="hidden" name="PHPSESSID" value="abtest" /> <fieldset><input type="hidden" name="PHPSESSID" value="abtest" /> Warning: ini_set() [/phpmanual/function.ini-set.html]: SAFE MODE Restriction in effect. The script whose uid is 0 is not allowed to access /usr/src/php-4.3.0RC1 owned by uid 500 in /usr/src/php-4.3.0RC1/ext/session/tests/021.php on line 23 <form><input type="hidden" name="PHPSESSID" value="abtest" /> <fieldset><input type="hidden" name="PHPSESSID" value="abtest" /> Warning: ini_set() [/phpmanual/function.ini-set.html]: SAFE MODE Restriction in effect. The script whose uid is 0 is not allowed to access /usr/src/php-4.3.0RC1 owned by uid 500 in /usr/src/php-4.3.0RC1/ext/session/tests/021.php on line 32 <form><input type="hidden" name="PHPSESSID" value="abtest" /> <fieldset><input type="hidden" name="PHPSESSID" value="abtest" /> ---- FAILED ================================================================================ 003- <form><input type="hidden" name="PHPSESSID" value="abtest" /> 003+ 004- <fieldset> 004+ Warning: ini_set() [/phpmanual/function.ini-set.html]: SAFE MODE Restriction in effect. The script whose uid is 0 is not allowed to access /usr/src/php-4.3.0RC1 owned by uid 500 in /usr/src/php-4.3.0RC1/ext/session/tests/021.php on line 14 006- <fieldset> 006+ <fieldset><input type="hidden" name="PHPSESSID" value="abtest" /> 007- <form> 007+ 008- <fieldset><input type="hidden" name="PHPSESSID" value="abtest" /> 008+ Warning: ini_set() [/phpmanual/function.ini-set.html]: SAFE MODE Restriction in effect. The script whose uid is 0 is not allowed to access /usr/src/php-4.3.0RC1 owned by uid 500 in /usr/src/php-4.3.0RC1/ext/session/tests/021.php on line 23 009+ <form><input type="hidden" name="PHPSESSID" value="abtest" /> 010+ <fieldset><input type="hidden" name="PHPSESSID" value="abtest" /> 011+ 012+ Warning: ini_set() [/phpmanual/function.ini-set.html]: SAFE MODE Restriction in effect. The script whose uid is 0 is not allowed to access /usr/src/php-4.3.0RC1 owned by uid 500 in /usr/src/php-4.3.0RC1/ext/session/tests/021.php on line 32 013+ <form><input type="hidden" name="PHPSESSID" value="abtest" /> 014+ <fieldset><input type="hidden" name="PHPSESSID" value="abtest" /> ================================================================================ ================================================================================ /usr/src/php-4.3.0RC1/ext/standard/tests/file/001.phpt ================================================================================ ---- EXPECTED OUTPUT test.file does not exist test.file exists test.link exists test.file is not a symlink test.link is a symlink test.file exists test.link lstat and stat differ at element 1 test.link lstat and stat differ at element 2 test.link lstat and stat differ at element 7 test.link lstat and stat differ at element 8 test.link lstat and stat differ at element 9 test.link lstat and stat differ at element 10 test.file is file test.link is link test.file permissions are 0744 test.file size is 0 test.file is writeable test.file is readable test.file is executable test.file is a regular file test.link is a regular file test.link is not a directory ../file is a directory test.file is not a directory test.file does not exist test.file does not exist ---- ACTUAL OUTPUT Warning: chdir() [/phpmanual/function.chdir.html]: SAFE MODE Restriction in effect. The script whose uid is 0 is not allowed to access /usr/src/php-4.3.0RC1/ext/standard/tests/file owned by uid 500 in /usr/src/php-4.3.0RC1/ext/standard/tests/file/001.php on line 2 Warning: file_exists() [/phpmanual/function.file-exists.html]: SAFE MODE Restriction in effect. The script whose uid is 0 is not allowed to access /usr/src/php-4.3.0RC1 owned by uid 500 in /usr/src/php-4.3.0RC1/ext/standard/tests/file/001.php on line 5 test.file does not exist Warning: fopen() [/phpmanual/function.fopen.html]: SAFE MODE Restriction in effect. The script whose uid is 0 is not allowed to access /usr/src/php-4.3.0RC1 owned by uid 500 in /usr/src/php-4.3.0RC1/ext/standard/tests/file/001.php on line 10 Warning: fopen(test.file) [/phpmanual/function.fopen.html]: failed to create stream: No such file or directory in /usr/src/php-4.3.0RC1/ext/standard/tests/file/001.php on line 10 Warning: fclose(): supplied argument is not a valid stream resource in /usr/src/php-4.3.0RC1/ext/standard/tests/file/001.php on line 10 Warning: chmod() [/phpmanual/function.chmod.html]: Unable to access test.file in /usr/src/php-4.3.0RC1/ext/standard/tests/file/001.php on line 11 Warning: chmod() [/phpmanual/function.chmod.html]: No such file or directory in /usr/src/php-4.3.0RC1/ext/standard/tests/file/001.php on line 11 Warning: file_exists() [/phpmanual/function.file-exists.html]: SAFE MODE Restriction in effect. The script whose uid is 0 is not allowed to access /usr/src/php-4.3.0RC1 owned by uid 500 in /usr/src/php-4.3.0RC1/ext/standard/tests/file/001.php on line 12 test.file does not exist Warning: symlink() [/phpmanual/function.symlink.html]: SAFE MODE Restriction in effect. The script whose uid is 0 is not allowed to access /usr/src/php-4.3.0RC1 owned by uid 500 in /usr/src/php-4.3.0RC1/ext/standard/tests/file/001.php on line 18 Warning: file_exists() [/phpmanual/function.file-exists.html]: SAFE MODE Restriction in effect. The script whose uid is 0 is not allowed to access /usr/src/php-4.3.0RC1 owned by uid 500 in /usr/src/php-4.3.0RC1/ext/standard/tests/file/001.php on line 19 test.link does not exist Warning: is_link() [/phpmanual/function.is-link.html]: SAFE MODE Restriction in effect. The script whose uid is 0 is not allowed to access /usr/src/php-4.3.0RC1 owned by uid 500 in /usr/src/php-4.3.0RC1/ext/standard/tests/file/001.php on line 24 test.file is not a symlink Warning: is_link() [/phpmanual/function.is-link.html]: SAFE MODE Restriction in effect. The script whose uid is 0 is not allowed to access /usr/src/php-4.3.0RC1 owned by uid 500 in /usr/src/php-4.3.0RC1/ext/standard/tests/file/001.php on line 29 test.link is not a symlink Warning: file_exists() [/phpmanual/function.file-exists.html]: SAFE MODE Restriction in effect. The script whose uid is 0 is not allowed to access /usr/src/php-4.3.0RC1 owned by uid 500 in /usr/src/php-4.3.0RC1/ext/standard/tests/file/001.php on line 34 test.file does not exist Warning: stat() [/phpmanual/function.stat.html]: SAFE MODE Restriction in effect. The script whose uid is 0 is not allowed to access /usr/src/php-4.3.0RC1 owned by uid 500 in /usr/src/php-4.3.0RC1/ext/standard/tests/file/001.php on line 39 Warning: lstat() [/phpmanual/function.lstat.html]: SAFE MODE Restriction in effect. The script whose uid is 0 is not allowed to access /usr/src/php-4.3.0RC1 owned by uid 500 in /usr/src/php-4.3.0RC1/ext/standard/tests/file/001.php on line 40 Warning: stat() [/phpmanual/function.stat.html]: SAFE MODE Restriction in effect. The script whose uid is 0 is not allowed to access /usr/src/php-4.3.0RC1 owned by uid 500 in /usr/src/php-4.3.0RC1/ext/standard/tests/file/001.php on line 46 Warning: lstat() [/phpmanual/function.lstat.html]: SAFE MODE Restriction in effect. The script whose uid is 0 is not allowed to access /usr/src/php-4.3.0RC1 owned by uid 500 in /usr/src/php-4.3.0RC1/ext/standard/tests/file/001.php on line 47 Warning: filetype() [/phpmanual/function.filetype.html]: SAFE MODE Restriction in effect. The script whose uid is 0 is not allowed to access /usr/src/php-4.3.0RC1 owned by uid 500 in /usr/src/php-4.3.0RC1/ext/standard/tests/file/001.php on line 53 test.file is Warning: filetype() [/phpmanual/function.filetype.html]: SAFE MODE Restriction in effect. The script whose uid is 0 is not allowed to access /usr/src/php-4.3.0RC1 owned by uid 500 in /usr/src/php-4.3.0RC1/ext/standard/tests/file/001.php on line 54 test.link is Warning: fileperms() [/phpmanual/function.fileperms.html]: SAFE MODE Restriction in effect. The script whose uid is 0 is not allowed to access /usr/src/php-4.3.0RC1 owned by uid 500 in /usr/src/php-4.3.0RC1/ext/standard/tests/file/001.php on line 55 test.file permissions are 00 Warning: filesize() [/phpmanual/function.filesize.html]: SAFE MODE Restriction in effect. The script whose uid is 0 is not allowed to access /usr/src/php-4.3.0RC1 owned by uid 500 in /usr/src/php-4.3.0RC1/ext/standard/tests/file/001.php on line 56 test.file size is Warning: is_writeable() [/phpmanual/function.is-writeable.html]: SAFE MODE Restriction in effect. The script whose uid is 0 is not allowed to access /usr/src/php-4.3.0RC1 owned by uid 500 in /usr/src/php-4.3.0RC1/ext/standard/tests/file/001.php on line 57 test.file is not writeable Warning: is_readable() [/phpmanual/function.is-readable.html]: SAFE MODE Restriction in effect. The script whose uid is 0 is not allowed to access /usr/src/php-4.3.0RC1 owned by uid 500 in /usr/src/php-4.3.0RC1/ext/standard/tests/file/001.php on line 62 test.file is not readable Warning: is_executable() [/phpmanual/function.is-executable.html]: SAFE MODE Restriction in effect. The script whose uid is 0 is not allowed to access /usr/src/php-4.3.0RC1 owned by uid 500 in /usr/src/php-4.3.0RC1/ext/standard/tests/file/001.php on line 67 test.file is not executable Warning: is_file() [/phpmanual/function.is-file.html]: SAFE MODE Restriction in effect. The script whose uid is 0 is not allowed to access /usr/src/php-4.3.0RC1 owned by uid 500 in /usr/src/php-4.3.0RC1/ext/standard/tests/file/001.php on line 72 test.file is not a regular file Warning: is_file() [/phpmanual/function.is-file.html]: SAFE MODE Restriction in effect. The script whose uid is 0 is not allowed to access /usr/src/php-4.3.0RC1 owned by uid 500 in /usr/src/php-4.3.0RC1/ext/standard/tests/file/001.php on line 77 test.link is not a regular file Warning: is_dir() [/phpmanual/function.is-dir.html]: SAFE MODE Restriction in effect. The script whose uid is 0 is not allowed to access /usr/src/php-4.3.0RC1 owned by uid 500 in /usr/src/php-4.3.0RC1/ext/standard/tests/file/001.php on line 82 test.link is not a directory ../file is not a directory Warning: is_dir() [/phpmanual/function.is-dir.html]: SAFE MODE Restriction in effect. The script whose uid is 0 is not allowed to access /usr/src/php-4.3.0RC1 owned by uid 500 in /usr/src/php-4.3.0RC1/ext/standard/tests/file/001.php on line 92 test.file is not a directory Warning: unlink() [/phpmanual/function.unlink.html]: SAFE MODE Restriction in effect. The script whose uid is 0 is not allowed to access /usr/src/php-4.3.0RC1 owned by uid 500 in /usr/src/php-4.3.0RC1/ext/standard/tests/file/001.php on line 97 Warning: unlink() [/phpmanual/function.unlink.html]: SAFE MODE Restriction in effect. The script whose uid is 0 is not allowed to access /usr/src/php-4.3.0RC1 owned by uid 500 in /usr/src/php-4.3.0RC1/ext/standard/tests/file/001.php on line 98 Warning: file_exists() [/phpmanual/function.file-exists.html]: SAFE MODE Restriction in effect. The script whose uid is 0 is not allowed to access /usr/src/php-4.3.0RC1 owned by uid 500 in /usr/src/php-4.3.0RC1/ext/standard/tests/file/001.php on line 99 test.file does not exist Warning: file_exists() [/phpmanual/function.file-exists.html]: SAFE MODE Restriction in effect. The script whose uid is 0 is not allowed to access /usr/src/php-4.3.0RC1 owned by uid 500 in /usr/src/php-4.3.0RC1/ext/standard/tests/file/001.php on line 105 test.file does not exist ---- FAILED ================================================================================ 001- test.file does not exist 001+ Warning: chdir() [/phpmanual/function.chdir.html]: SAFE MODE Restriction in effect. The script whose uid is 0 is not allowed to access /usr/src/php-4.3.0RC1/ext/standard/tests/file owned by uid 500 in /usr/src/php-4.3.0RC1/ext/standard/tests/file/001.php on line 2 002- test.file exists 002+ 003- test.link exists 003+ Warning: file_exists() [/phpmanual/function.file-exists.html]: SAFE MODE Restriction in effect. The script whose uid is 0 is not allowed to access /usr/src/php-4.3.0RC1 owned by uid 500 in /usr/src/php-4.3.0RC1/ext/standard/tests/file/001.php on line 5 004- test.file is not a symlink 004+ test.file does not exist 005- test.link is a symlink 005+ 006- test.file exists 006+ Warning: fopen() [/phpmanual/function.fopen.html]: SAFE MODE Restriction in effect. The script whose uid is 0 is not allowed to access /usr/src/php-4.3.0RC1 owned by uid 500 in /usr/src/php-4.3.0RC1/ext/standard/tests/file/001.php on line 10 007- test.link lstat and stat differ at element 1 007+ 008- test.link lstat and stat differ at element 2 008+ Warning: fopen(test.file) [/phpmanual/function.fopen.html]: failed to create stream: No such file or directory in /usr/src/php-4.3.0RC1/ext/standard/tests/file/001.php on line 10 009- test.link lstat and stat differ at element 7 009+ 010- test.link lstat and stat differ at element 8 010+ Warning: fclose(): supplied argument is not a valid stream resource in /usr/src/php-4.3.0RC1/ext/standard/tests/file/001.php on line 10 011- test.link lstat and stat differ at element 9 011+ 012- test.link lstat and stat differ at element 10 012+ Warning: chmod() [/phpmanual/function.chmod.html]: Unable to access test.file in /usr/src/php-4.3.0RC1/ext/standard/tests/file/001.php on line 11 013- test.file is file 013+ 014- test.link is link 014+ Warning: chmod() [/phpmanual/function.chmod.html]: No such file or directory in /usr/src/php-4.3.0RC1/ext/standard/tests/file/001.php on line 11 015- test.file permissions are 0744 015+ 016- test.file size is 0 016+ Warning: file_exists() [/phpmanual/function.file-exists.html]: SAFE MODE Restriction in effect. The script whose uid is 0 is not allowed to access /usr/src/php-4.3.0RC1 owned by uid 500 in /usr/src/php-4.3.0RC1/ext/standard/tests/file/001.php on line 12 017- test.file is writeable 017+ test.file does not exist 018- test.file is readable 018+ 019- test.file is executable 019+ Warning: symlink() [/phpmanual/function.symlink.html]: SAFE MODE Restriction in effect. The script whose uid is 0 is not allowed to access /usr/src/php-4.3.0RC1 owned by uid 500 in /usr/src/php-4.3.0RC1/ext/standard/tests/file/001.php on line 18 020- test.file is a regular file 020+ 021- test.link is a regular file 021+ Warning: file_exists() [/phpmanual/function.file-exists.html]: SAFE MODE Restriction in effect. The script whose uid is 0 is not allowed to access /usr/src/php-4.3.0RC1 owned by uid 500 in /usr/src/php-4.3.0RC1/ext/standard/tests/file/001.php on line 19 022- test.link is not a directory 022+ test.link does not exist 023- ../file is a directory 023+ 024- test.file is not a directory 024+ Warning: is_link() [/phpmanual/function.is-link.html]: SAFE MODE Restriction in effect. The script whose uid is 0 is not allowed to access /usr/src/php-4.3.0RC1 owned by uid 500 in /usr/src/php-4.3.0RC1/ext/standard/tests/file/001.php on line 24 025- test.file does not exist 025+ test.file is not a symlink 026- test.file does not exist 026+ 027+ Warning: is_link() [/phpmanual/function.is-link.html]: SAFE MODE Restriction in effect. The script whose uid is 0 is not allowed to access /usr/src/php-4.3.0RC1 owned by uid 500 in /usr/src/php-4.3.0RC1/ext/standard/tests/file/001.php on line 29 028+ test.link is not a symlink 029+ 030+ Warning: file_exists() [/phpmanual/function.file-exists.html]: SAFE MODE Restriction in effect. The script whose uid is 0 is not allowed to access /usr/src/php-4.3.0RC1 owned by uid 500 in /usr/src/php-4.3.0RC1/ext/standard/tests/file/001.php on line 34 031+ test.file does not exist 032+ 033+ Warning: stat() [/phpmanual/function.stat.html]: SAFE MODE Restriction in effect. The script whose uid is 0 is not allowed to access /usr/src/php-4.3.0RC1 owned by uid 500 in /usr/src/php-4.3.0RC1/ext/standard/tests/file/001.php on line 39 034+ 035+ Warning: lstat() [/phpmanual/function.lstat.html]: SAFE MODE Restriction in effect. The script whose uid is 0 is not allowed to access /usr/src/php-4.3.0RC1 owned by uid 500 in /usr/src/php-4.3.0RC1/ext/standard/tests/file/001.php on line 40 036+ 037+ Warning: stat() [/phpmanual/function.stat.html]: SAFE MODE Restriction in effect. The script whose uid is 0 is not allowed to access /usr/src/php-4.3.0RC1 owned by uid 500 in /usr/src/php-4.3.0RC1/ext/standard/tests/file/001.php on line 46 038+ 039+ Warning: lstat() [/phpmanual/function.lstat.html]: SAFE MODE Restriction in effect. The script whose uid is 0 is not allowed to access /usr/src/php-4.3.0RC1 owned by uid 500 in /usr/src/php-4.3.0RC1/ext/standard/tests/file/001.php on line 47 040+ 041+ Warning: filetype() [/phpmanual/function.filetype.html]: SAFE MODE Restriction in effect. The script whose uid is 0 is not allowed to access /usr/src/php-4.3.0RC1 owned by uid 500 in /usr/src/php-4.3.0RC1/ext/standard/tests/file/001.php on line 53 042+ test.file is 043+ 044+ Warning: filetype() [/phpmanual/function.filetype.html]: SAFE MODE Restriction in effect. The script whose uid is 0 is not allowed to access /usr/src/php-4.3.0RC1 owned by uid 500 in /usr/src/php-4.3.0RC1/ext/standard/tests/file/001.php on line 54 045+ test.link is 046+ 047+ Warning: fileperms() [/phpmanual/function.fileperms.html]: SAFE MODE Restriction in effect. The script whose uid is 0 is not allowed to access /usr/src/php-4.3.0RC1 owned by uid 500 in /usr/src/php-4.3.0RC1/ext/standard/tests/file/001.php on line 55 048+ test.file permissions are 00 049+ 050+ Warning: filesize() [/phpmanual/function.filesize.html]: SAFE MODE Restriction in effect. The script whose uid is 0 is not allowed to access /usr/src/php-4.3.0RC1 owned by uid 500 in /usr/src/php-4.3.0RC1/ext/standard/tests/file/001.php on line 56 051+ test.file size is 052+ 053+ Warning: is_writeable() [/phpmanual/function.is-writeable.html]: SAFE MODE Restriction in effect. The script whose uid is 0 is not allowed to access /usr/src/php-4.3.0RC1 owned by uid 500 in /usr/src/php-4.3.0RC1/ext/standard/tests/file/001.php on line 57 054+ test.file is not writeable 055+ 056+ Warning: is_readable() [/phpmanual/function.is-readable.html]: SAFE MODE Restriction in effect. The script whose uid is 0 is not allowed to access /usr/src/php-4.3.0RC1 owned by uid 500 in /usr/src/php-4.3.0RC1/ext/standard/tests/file/001.php on line 62 057+ test.file is not readable 058+ 059+ Warning: is_executable() [/phpmanual/function.is-executable.html]: SAFE MODE Restriction in effect. The script whose uid is 0 is not allowed to access /usr/src/php-4.3.0RC1 owned by uid 500 in /usr/src/php-4.3.0RC1/ext/standard/tests/file/001.php on line 67 060+ test.file is not executable 061+ 062+ Warning: is_file() [/phpmanual/function.is-file.html]: SAFE MODE Restriction in effect. The script whose uid is 0 is not allowed to access /usr/src/php-4.3.0RC1 owned by uid 500 in /usr/src/php-4.3.0RC1/ext/standard/tests/file/001.php on line 72 063+ test.file is not a regular file 064+ 065+ Warning: is_file() [/phpmanual/function.is-file.html]: SAFE MODE Restriction in effect. The script whose uid is 0 is not allowed to access /usr/src/php-4.3.0RC1 owned by uid 500 in /usr/src/php-4.3.0RC1/ext/standard/tests/file/001.php on line 77 066+ test.link is not a regular file 067+ 068+ Warning: is_dir() [/phpmanual/function.is-dir.html]: SAFE MODE Restriction in effect. The script whose uid is 0 is not allowed to access /usr/src/php-4.3.0RC1 owned by uid 500 in /usr/src/php-4.3.0RC1/ext/standard/tests/file/001.php on line 82 069+ test.link is not a directory 070+ ../file is not a directory 071+ 072+ Warning: is_dir() [/phpmanual/function.is-dir.html]: SAFE MODE Restriction in effect. The script whose uid is 0 is not allowed to access /usr/src/php-4.3.0RC1 owned by uid 500 in /usr/src/php-4.3.0RC1/ext/standard/tests/file/001.php on line 92 073+ test.file is not a directory 074+ 075+ Warning: unlink() [/phpmanual/function.unlink.html]: SAFE MODE Restriction in effect. The script whose uid is 0 is not allowed to access /usr/src/php-4.3.0RC1 owned by uid 500 in /usr/src/php-4.3.0RC1/ext/standard/tests/file/001.php on line 97 076+ 077+ Warning: unlink() [/phpmanual/function.unlink.html]: SAFE MODE Restriction in effect. The script whose uid is 0 is not allowed to access /usr/src/php-4.3.0RC1 owned by uid 500 in /usr/src/php-4.3.0RC1/ext/standard/tests/file/001.php on line 98 078+ 079+ Warning: file_exists() [/phpmanual/function.file-exists.html]: SAFE MODE Restriction in effect. The script whose uid is 0 is not allowed to access /usr/src/php-4.3.0RC1 owned by uid 500 in /usr/src/php-4.3.0RC1/ext/standard/tests/file/001.php on line 99 080+ test.file does not exist 081+ 082+ Warning: file_exists() [/phpmanual/function.file-exists.html]: SAFE MODE Restriction in effect. The script whose uid is 0 is not allowed to access /usr/src/php-4.3.0RC1 owned by uid 500 in /usr/src/php-4.3.0RC1/ext/standard/tests/file/001.php on line 105 083+ test.file does not exist ================================================================================ ================================================================================ /usr/src/php-4.3.0RC1/ext/standard/tests/file/003.phpt ================================================================================ ---- EXPECTED OUTPUT boolean boolean boolean boolean boolean boolean boolean boolean boolean boolean ---- ACTUAL OUTPUT Warning: is_writable() [/phpmanual/function.is-writable.html]: Unable to access in /usr/src/php-4.3.0RC1/ext/standard/tests/file/003.php on line 14 boolean Warning: is_readable() [/phpmanual/function.is-readable.html]: Unable to access in /usr/src/php-4.3.0RC1/ext/standard/tests/file/003.php on line 14 boolean Warning: is_executable() [/phpmanual/function.is-executable.html]: Unable to access in /usr/src/php-4.3.0RC1/ext/standard/tests/file/003.php on line 14 boolean Warning: is_file() [/phpmanual/function.is-file.html]: Unable to access in /usr/src/php-4.3.0RC1/ext/standard/tests/file/003.php on line 14 boolean Warning: file_exists() [/phpmanual/function.file-exists.html]: Unable to access in /usr/src/php-4.3.0RC1/ext/standard/tests/file/003.php on line 14 boolean Warning: is_writable() [/phpmanual/function.is-writable.html]: SAFE MODE Restriction in effect. The script whose uid is 0 is not allowed to access run-tests.php owned by uid 500 in /usr/src/php-4.3.0RC1/ext/standard/tests/file/003.php on line 22 boolean Warning: is_readable() [/phpmanual/function.is-readable.html]: SAFE MODE Restriction in effect. The script whose uid is 0 is not allowed to access run-tests.php owned by uid 500 in /usr/src/php-4.3.0RC1/ext/standard/tests/file/003.php on line 22 boolean Warning: is_executable() [/phpmanual/function.is-executable.html]: SAFE MODE Restriction in effect. The script whose uid is 0 is not allowed to access run-tests.php owned by uid 500 in /usr/src/php-4.3.0RC1/ext/standard/tests/file/003.php on line 22 boolean Warning: is_file() [/phpmanual/function.is-file.html]: SAFE MODE Restriction in effect. The script whose uid is 0 is not allowed to access run-tests.php owned by uid 500 in /usr/src/php-4.3.0RC1/ext/standard/tests/file/003.php on line 22 boolean Warning: file_exists() [/phpmanual/function.file-exists.html]: SAFE MODE Restriction in effect. The script whose uid is 0 is not allowed to access run-tests.php owned by uid 500 in /usr/src/php-4.3.0RC1/ext/standard/tests/file/003.php on line 22 boolean ---- FAILED ================================================================================ 001- boolean 001+ Warning: is_writable() [/phpmanual/function.is-writable.html]: Unable to access in /usr/src/php-4.3.0RC1/ext/standard/tests/file/003.php on line 14 003- boolean 003+ 004- boolean 004+ Warning: is_readable() [/phpmanual/function.is-readable.html]: Unable to access in /usr/src/php-4.3.0RC1/ext/standard/tests/file/003.php on line 14 006- boolean 006+ 007- boolean 007+ Warning: is_executable() [/phpmanual/function.is-executable.html]: Unable to access in /usr/src/php-4.3.0RC1/ext/standard/tests/file/003.php on line 14 009- boolean 009+ 010- boolean 010+ Warning: is_file() [/phpmanual/function.is-file.html]: Unable to access in /usr/src/php-4.3.0RC1/ext/standard/tests/file/003.php on line 14 011+ boolean 012+ 013+ Warning: file_exists() [/phpmanual/function.file-exists.html]: Unable to access in /usr/src/php-4.3.0RC1/ext/standard/tests/file/003.php on line 14 014+ boolean 015+ 016+ Warning: is_writable() [/phpmanual/function.is-writable.html]: SAFE MODE Restriction in effect. The script whose uid is 0 is not allowed to access run-tests.php owned by uid 500 in /usr/src/php-4.3.0RC1/ext/standard/tests/file/003.php on line 22 017+ boolean 018+ 019+ Warning: is_readable() [/phpmanual/function.is-readable.html]: SAFE MODE Restriction in effect. The script whose uid is 0 is not allowed to access run-tests.php owned by uid 500 in /usr/src/php-4.3.0RC1/ext/standard/tests/file/003.php on line 22 020+ boolean 021+ 022+ Warning: is_executable() [/phpmanual/function.is-executable.html]: SAFE MODE Restriction in effect. The script whose uid is 0 is not allowed to access run-tests.php owned by uid 500 in /usr/src/php-4.3.0RC1/ext/standard/tests/file/003.php on line 22 023+ boolean 024+ 025+ Warning: is_file() [/phpmanual/function.is-file.html]: SAFE MODE Restriction in effect. The script whose uid is 0 is not allowed to access run-tests.php owned by uid 500 in /usr/src/php-4.3.0RC1/ext/standard/tests/file/003.php on line 22 026+ boolean 027+ 028+ Warning: file_exists() [/phpmanual/function.file-exists.html]: SAFE MODE Restriction in effect. The script whose uid is 0 is not allowed to access run-tests.php owned by uid 500 in /usr/src/php-4.3.0RC1/ext/standard/tests/file/003.php on line 22 029+ boolean ================================================================================ ================================================================================ /usr/src/php-4.3.0RC1/ext/standard/tests/file/bug20424.phpt ================================================================================ ---- EXPECTED OUTPUT I'm alive! ---- ACTUAL OUTPUT Warning: fopen() [/phpmanual/function.fopen.html]: SAFE MODE Restriction in effect. The script whose uid is 0 is not allowed to access run-tests.php owned by uid 500 in /usr/src/php-4.3.0RC1/ext/standard/tests/file/bug20424.php on line 2 Warning: fopen(run-tests.php) [/phpmanual/function.fopen.html]: failed to create stream: Inappropriate ioctl for device in /usr/src/php-4.3.0RC1/ext/standard/tests/file/bug20424.php on line 2 Warning: stream_get_meta_data(): supplied argument is not a valid stream resource in /usr/src/php-4.3.0RC1/ext/standard/tests/file/bug20424.php on line 3 I'm alive! ---- FAILED ================================================================================ 001- I'm alive! 001+ Warning: fopen() [/phpmanual/function.fopen.html]: SAFE MODE Restriction in effect. The script whose uid is 0 is not allowed to access run-tests.php owned by uid 500 in /usr/src/php-4.3.0RC1/ext/standard/tests/file/bug20424.php on line 2 002+ 003+ Warning: fopen(run-tests.php) [/phpmanual/function.fopen.html]: failed to create stream: Inappropriate ioctl for device in /usr/src/php-4.3.0RC1/ext/standard/tests/file/bug20424.php on line 2 004+ 005+ Warning: stream_get_meta_data(): supplied argument is not a valid stream resource in /usr/src/php-4.3.0RC1/ext/standard/tests/file/bug20424.php on line 3 006+ I'm alive! ================================================================================ ================================================================================ /usr/src/php-4.3.0RC1/ext/standard/tests/general_functions/004.phpt ================================================================================ ---- EXPECTED OUTPUT name,value,comment true,1,boolean true false,0,boolean false empty,,nothing ---- ACTUAL OUTPUT Warning: chdir() [/phpmanual/function.chdir.html]: SAFE MODE Restriction in effect. The script whose uid is 0 is not allowed to access /usr/src/php-4.3.0RC1/ext/standard/tests/general_functions owned by uid 500 in /usr/src/php-4.3.0RC1/ext/standard/tests/general_functions/004.php on line 2 Warning: fopen() [/phpmanual/function.fopen.html]: Unable to access 004.data in /usr/src/php-4.3.0RC1/ext/standard/tests/general_functions/004.php on line 3 Warning: fopen(004.data) [/phpmanual/function.fopen.html]: failed to create stream: No such file or directory in /usr/src/php-4.3.0RC1/ext/standard/tests/general_functions/004.php on line 3 Warning: fgetcsv(): supplied argument is not a valid stream resource in /usr/src/php-4.3.0RC1/ext/standard/tests/general_functions/004.php on line 4 Warning: fclose(): supplied argument is not a valid stream resource in /usr/src/php-4.3.0RC1/ext/standard/tests/general_functions/004.php on line 7 ---- FAILED ================================================================================ 001- name,value,comment 001+ Warning: chdir() [/phpmanual/function.chdir.html]: SAFE MODE Restriction in effect. The script whose uid is 0 is not allowed to access /usr/src/php-4.3.0RC1/ext/standard/tests/general_functions owned by uid 500 in /usr/src/php-4.3.0RC1/ext/standard/tests/general_functions/004.php on line 2 002- true,1,boolean true 002+ 003- false,0,boolean false 003+ Warning: fopen() [/phpmanual/function.fopen.html]: Unable to access 004.data in /usr/src/php-4.3.0RC1/ext/standard/tests/general_functions/004.php on line 3 004- empty,,nothing 004+ 005+ Warning: fopen(004.data) [/phpmanual/function.fopen.html]: failed to create stream: No such file or directory in /usr/src/php-4.3.0RC1/ext/standard/tests/general_functions/004.php on line 3 006+ 007+ Warning: fgetcsv(): supplied argument is not a valid stream resource in /usr/src/php-4.3.0RC1/ext/standard/tests/general_functions/004.php on line 4 008+ 009+ Warning: fclose(): supplied argument is not a valid stream resource in /usr/src/php-4.3.0RC1/ext/standard/tests/general_functions/004.php on line 7 ================================================================================ ================================================================================ /usr/src/php-4.3.0RC1/ext/standard/tests/general_functions/005.phpt ================================================================================ ---- EXPECTED OUTPUT bool(true) bool(true) bool(true) bool(true) bool(false) bool(false) bool(false) bool(false) ---- ACTUAL OUTPUT bool(true) bool(true) bool(true) bool(true) bool(false) bool(false) bool(false) Warning: opendir() [/phpmanual/function.opendir.html]: SAFE MODE Restriction in effect. The script whose uid is 0 is not allowed to access . owned by uid 500 in /usr/src/php-4.3.0RC1/ext/standard/tests/general_functions/005.php on line 10 Warning: opendir(.) [/phpmanual/function.opendir.html]: failed to open dir: Inappropriate ioctl for device in /usr/src/php-4.3.0RC1/ext/standard/tests/general_functions/005.php on line 10 bool(true) ---- FAILED ================================================================================ 008- bool(false) 008+ 009+ Warning: opendir() [/phpmanual/function.opendir.html]: SAFE MODE Restriction in effect. The script whose uid is 0 is not allowed to access . owned by uid 500 in /usr/src/php-4.3.0RC1/ext/standard/tests/general_functions/005.php on line 10 010+ 011+ Warning: opendir(.) [/phpmanual/function.opendir.html]: failed to open dir: Inappropriate ioctl for device in /usr/src/php-4.3.0RC1/ext/standard/tests/general_functions/005.php on line 10 012+ bool(true) ================================================================================ ================================================================================ /usr/src/php-4.3.0RC1/ext/standard/tests/image/bug13213.phpt ================================================================================ ---- EXPECTED OUTPUT array(7) { [0]=> int(1) [1]=> int(1) [2]=> int(2) [3]=> string(20) "width="1" height="1"" ["bits"]=> int(8) ["channels"]=> int(3) ["mime"]=> string(10) "image/jpeg" } ---- ACTUAL OUTPUT Warning: getimagesize() [/phpmanual/function.getimagesize.html]: SAFE MODE Restriction in effect. The script whose uid is 0 is not allowed to access /usr/src/php-4.3.0RC1/ext/standard/tests/image/bug13213.jpg owned by uid 500 in /usr/src/php-4.3.0RC1/ext/standard/tests/image/bug13213.php on line 2 Warning: getimagesize(/usr/src/php-4.3.0RC1/ext/standard/tests/image/bug13213.jpg) [/phpmanual/function.getimagesize.html]: failed to create stream: Inappropriate ioctl for device in /usr/src/php-4.3.0RC1/ext/standard/tests/image/bug13213.php on line 2 bool(false) ---- FAILED ================================================================================ 001- array(7) { 001+ Warning: getimagesize() [/phpmanual/function.getimagesize.html]: SAFE MODE Restriction in effect. The script whose uid is 0 is not allowed to access /usr/src/php-4.3.0RC1/ext/standard/tests/image/bug13213.jpg owned by uid 500 in /usr/src/php-4.3.0RC1/ext/standard/tests/image/bug13213.php on line 2 002- [0]=> 002+ 003- int(1) 003+ Warning: getimagesize(/usr/src/php-4.3.0RC1/ext/standard/tests/image/bug13213.jpg) [/phpmanual/function.getimagesize.html]: failed to create stream: Inappropriate ioctl for device in /usr/src/php-4.3.0RC1/ext/standard/tests/image/bug13213.php on line 2 004- [1]=> 004+ bool(false) 005- int(1) 006- [2]=> 007- int(2) 008- [3]=> 009- string(20) "width="1" height="1"" 010- ["bits"]=> 011- int(8) 012- ["channels"]=> 013- int(3) 014- ["mime"]=> 015- string(10) "image/jpeg" 016- } ================================================================================ ================================================================================ /usr/src/php-4.3.0RC1/ext/standard/tests/image/getimagesize.phpt ================================================================================ ---- EXPECTED OUTPUT array(10) { ["test1pix.bmp"]=> array(6) { [0]=> int(1) [1]=> int(1) [2]=> int(6) [3]=> string(20) "width="1" height="1"" ["bits"]=> int(24) ["mime"]=> string(9) "image/bmp" } ["test1pix.jpc"]=> array(6) { [0]=> int(1) [1]=> int(1) [2]=> int(9) [3]=> string(20) "width="1" height="1"" ["bits"]=> int(3) ["mime"]=> string(10) "image/jpeg" } ["test1pix.jpg"]=> array(7) { [0]=> int(1) [1]=> int(1) [2]=> int(2) [3]=> string(20) "width="1" height="1"" ["bits"]=> int(8) ["channels"]=> int(3) ["mime"]=> string(10) "image/jpeg" } ["test2pix.gif"]=> array(7) { [0]=> int(2) [1]=> int(1) [2]=> int(1) [3]=> string(20) "width="2" height="1"" ["bits"]=> int(1) ["channels"]=> int(3) ["mime"]=> string(9) "image/gif" } ["test4pix.gif"]=> array(7) { [0]=> int(4) [1]=> int(1) [2]=> int(1) [3]=> string(20) "width="4" height="1"" ["bits"]=> int(2) ["channels"]=> int(3) ["mime"]=> string(9) "image/gif" } ["test4pix.iff"]=> array(6) { [0]=> int(4) [1]=> int(1) [2]=> int(14) [3]=> string(20) "width="4" height="1"" ["bits"]=> int(4) ["mime"]=> string(9) "image/iff" } ["test4pix.png"]=> array(5) { [0]=> int(4) [1]=> int(1) [2]=> int(3) [3]=> string(20) "width="4" height="1"" ["mime"]=> string(9) "image/png" } ["test4pix.psd"]=> array(5) { [0]=> int(4) [1]=> int(1) [2]=> int(5) [3]=> string(20) "width="4" height="1"" ["mime"]=> string(9) "image/psd" } ["test4pix.swf"]=> array(5) { [0]=> int(550) [1]=> int(400) [2]=> int(4) [3]=> string(24) "width="550" height="400"" ["mime"]=> string(29) "application/x-shockwave-flash" } ["test4pix.tif"]=> array(5) { [0]=> int(4) [1]=> int(1) [2]=> int(7) [3]=> string(20) "width="4" height="1"" ["mime"]=> string(10) "image/tiff" } } ---- ACTUAL OUTPUT Warning: opendir() [/phpmanual/function.opendir.html]: SAFE MODE Restriction in effect. The script whose uid is 0 is not allowed to access /usr/src/php-4.3.0RC1/ext/standard/tests/image owned by uid 500 in /usr/src/php-4.3.0RC1/ext/standard/tests/image/getimagesize.php on line 3 Warning: opendir(/usr/src/php-4.3.0RC1/ext/standard/tests/image) [/phpmanual/function.opendir.html]: failed to open dir: Inappropriate ioctl for device in /usr/src/php-4.3.0RC1/ext/standard/tests/image/getimagesize.php on line 3 cannot open directory: /usr/src/php-4.3.0RC1/ext/standard/tests/image ---- FAILED ================================================================================ 001- array(10) { 001+ Warning: opendir() [/phpmanual/function.opendir.html]: SAFE MODE Restriction in effect. The script whose uid is 0 is not allowed to access /usr/src/php-4.3.0RC1/ext/standard/tests/image owned by uid 500 in /usr/src/php-4.3.0RC1/ext/standard/tests/image/getimagesize.php on line 3 002- ["test1pix.bmp"]=> 002+ 003- array(6) { 003+ Warning: opendir(/usr/src/php-4.3.0RC1/ext/standard/tests/image) [/phpmanual/function.opendir.html]: failed to open dir: Inappropriate ioctl for device in /usr/src/php-4.3.0RC1/ext/standard/tests/image/getimagesize.php on line 3 004- [0]=> 004+ cannot open directory: /usr/src/php-4.3.0RC1/ext/standard/tests/image 005- int(1) 006- [1]=> 007- int(1) 008- [2]=> 009- int(6) 010- [3]=> 011- string(20) "width="1" height="1"" 012- ["bits"]=> 013- int(24) 014- ["mime"]=> 015- string(9) "image/bmp" 016- } 017- ["test1pix.jpc"]=> 018- array(6) { 019- [0]=> 020- int(1) 021- [1]=> 022- int(1) 023- [2]=> 024- int(9) 025- [3]=> 026- string(20) "width="1" height="1"" 027- ["bits"]=> 028- int(3) 029- ["mime"]=> 030- string(10) "image/jpeg" 031- } 032- ["test1pix.jpg"]=> 033- array(7) { 034- [0]=> 035- int(1) 036- [1]=> 037- int(1) 038- [2]=> 039- int(2) 040- [3]=> 041- string(20) "width="1" height="1"" 042- ["bits"]=> 043- int(8) 044- ["channels"]=> 045- int(3) 046- ["mime"]=> 047- string(10) "image/jpeg" 048- } 049- ["test2pix.gif"]=> 050- array(7) { 051- [0]=> 052- int(2) 053- [1]=> 054- int(1) 055- [2]=> 056- int(1) 057- [3]=> 058- string(20) "width="2" height="1"" 059- ["bits"]=> 060- int(1) 061- ["channels"]=> 062- int(3) 063- ["mime"]=> 064- string(9) "image/gif" 065- } 066- ["test4pix.gif"]=> 067- array(7) { 068- [0]=> 069- int(4) 070- [1]=> 071- int(1) 072- [2]=> 073- int(1) 074- [3]=> 075- string(20) "width="4" height="1"" 076- ["bits"]=> 077- int(2) 078- ["channels"]=> 079- int(3) 080- ["mime"]=> 081- string(9) "image/gif" 082- } 083- ["test4pix.iff"]=> 084- array(6) { 085- [0]=> 086- int(4) 087- [1]=> 088- int(1) 089- [2]=> 090- int(14) 091- [3]=> 092- string(20) "width="4" height="1"" 093- ["bits"]=> 094- int(4) 095- ["mime"]=> 096- string(9) "image/iff" 097- } 098- ["test4pix.png"]=> 099- array(5) { 100- [0]=> 101- int(4) 102- [1]=> 103- int(1) 104- [2]=> 105- int(3) 106- [3]=> 107- string(20) "width="4" height="1"" 108- ["mime"]=> 109- string(9) "image/png" 110- } 111- ["test4pix.psd"]=> 112- array(5) { 113- [0]=> 114- int(4) 115- [1]=> 116- int(1) 117- [2]=> 118- int(5) 119- [3]=> 120- string(20) "width="4" height="1"" 121- ["mime"]=> 122- string(9) "image/psd" 123- } 124- ["test4pix.swf"]=> 125- array(5) { 126- [0]=> 127- int(550) 128- [1]=> 129- int(400) 130- [2]=> 131- int(4) 132- [3]=> 133- string(24) "width="550" height="400"" 134- ["mime"]=> 135- string(29) "application/x-shockwave-flash" 136- } 137- ["test4pix.tif"]=> 138- array(5) { 139- [0]=> 140- int(4) 141- [1]=> 142- int(1) 143- [2]=> 144- int(7) 145- [3]=> 146- string(20) "width="4" height="1"" 147- ["mime"]=> 148- string(10) "image/tiff" 149- } 150- } ================================================================================ ================================================================================ /usr/src/php-4.3.0RC1/ext/standard/tests/image/getimagesize_swc.phpt ================================================================================ ---- EXPECTED OUTPUT array(5) { [0]=> int(550) [1]=> int(400) [2]=> int(13) [3]=> string(24) "width="550" height="400"" ["mime"]=> string(29) "application/x-shockwave-flash" } ---- ACTUAL OUTPUT Warning: getimagesize() [/phpmanual/function.getimagesize.html]: SAFE MODE Restriction in effect. The script whose uid is 0 is not allowed to access /usr/src/php-4.3.0RC1/ext/standard/tests/image/test13pix.swf owned by uid 500 in /usr/src/php-4.3.0RC1/ext/standard/tests/image/getimagesize_swc.php on line 2 Warning: getimagesize(/usr/src/php-4.3.0RC1/ext/standard/tests/image/test13pix.swf) [/phpmanual/function.getimagesize.html]: failed to create stream: Inappropriate ioctl for device in /usr/src/php-4.3.0RC1/ext/standard/tests/image/getimagesize_swc.php on line 2 bool(false) ---- FAILED ================================================================================ 001- array(5) { 001+ Warning: getimagesize() [/phpmanual/function.getimagesize.html]: SAFE MODE Restriction in effect. The script whose uid is 0 is not allowed to access /usr/src/php-4.3.0RC1/ext/standard/tests/image/test13pix.swf owned by uid 500 in /usr/src/php-4.3.0RC1/ext/standard/tests/image/getimagesize_swc.php on line 2 002- [0]=> 002+ 003- int(550) 003+ Warning: getimagesize(/usr/src/php-4.3.0RC1/ext/standard/tests/image/test13pix.swf) [/phpmanual/function.getimagesize.html]: failed to create stream: Inappropriate ioctl for device in /usr/src/php-4.3.0RC1/ext/standard/tests/image/getimagesize_swc.php on line 2 004- [1]=> 004+ bool(false) 005- int(400) 006- [2]=> 007- int(13) 008- [3]=> 009- string(24) "width="550" height="400"" 010- ["mime"]=> 011- string(29) "application/x-shockwave-flash" 012- } ================================================================================ ================================================================================ /usr/src/php-4.3.0RC1/ext/standard/tests/image/image_type_to_mime_type.phpt ================================================================================ ---- EXPECTED OUTPUT array(10) { ["test1pix.bmp"]=> string(9) "image/bmp" ["test1pix.jpc"]=> string(10) "image/jpeg" ["test1pix.jpg"]=> string(10) "image/jpeg" ["test2pix.gif"]=> string(9) "image/gif" ["test4pix.gif"]=> string(9) "image/gif" ["test4pix.iff"]=> string(9) "image/iff" ["test4pix.png"]=> string(9) "image/png" ["test4pix.psd"]=> string(9) "image/psd" ["test4pix.swf"]=> string(29) "application/x-shockwave-flash" ["test4pix.tif"]=> string(10) "image/tiff" } ---- ACTUAL OUTPUT Warning: opendir() [/phpmanual/function.opendir.html]: SAFE MODE Restriction in effect. The script whose uid is 0 is not allowed to access /usr/src/php-4.3.0RC1/ext/standard/tests/image owned by uid 500 in /usr/src/php-4.3.0RC1/ext/standard/tests/image/image_type_to_mime_type.php on line 3 Warning: opendir(/usr/src/php-4.3.0RC1/ext/standard/tests/image) [/phpmanual/function.opendir.html]: failed to open dir: Inappropriate ioctl for device in /usr/src/php-4.3.0RC1/ext/standard/tests/image/image_type_to_mime_type.php on line 3 cannot open directory: /usr/src/php-4.3.0RC1/ext/standard/tests/image ---- FAILED ================================================================================ 001- array(10) { 001+ Warning: opendir() [/phpmanual/function.opendir.html]: SAFE MODE Restriction in effect. The script whose uid is 0 is not allowed to access /usr/src/php-4.3.0RC1/ext/standard/tests/image owned by uid 500 in /usr/src/php-4.3.0RC1/ext/standard/tests/image/image_type_to_mime_type.php on line 3 002- ["test1pix.bmp"]=> 002+ 003- string(9) "image/bmp" 003+ Warning: opendir(/usr/src/php-4.3.0RC1/ext/standard/tests/image) [/phpmanual/function.opendir.html]: failed to open dir: Inappropriate ioctl for device in /usr/src/php-4.3.0RC1/ext/standard/tests/image/image_type_to_mime_type.php on line 3 004- ["test1pix.jpc"]=> 004+ cannot open directory: /usr/src/php-4.3.0RC1/ext/standard/tests/image 005- string(10) "image/jpeg" 006- ["test1pix.jpg"]=> 007- string(10) "image/jpeg" 008- ["test2pix.gif"]=> 009- string(9) "image/gif" 010- ["test4pix.gif"]=> 011- string(9) "image/gif" 012- ["test4pix.iff"]=> 013- string(9) "image/iff" 014- ["test4pix.png"]=> 015- string(9) "image/png" 016- ["test4pix.psd"]=> 017- string(9) "image/psd" 018- ["test4pix.swf"]=> 019- string(29) "application/x-shockwave-flash" 020- ["test4pix.tif"]=> 021- string(10) "image/tiff" 022- } ================================================================================ ================================================================================ /usr/src/php-4.3.0RC1/ext/standard/tests/strings/bug20169.phpt ================================================================================ ---- EXPECTED OUTPUT delimiter: | delimiter: | ---- ACTUAL OUTPUT Warning: Cannot set time limit in safe mode in /usr/src/php-4.3.0RC1/ext/standard/tests/strings/bug20169.php on line 2 delimiter: | delimiter: | ---- FAILED ================================================================================ 001- delimiter: | 001+ Warning: Cannot set time limit in safe mode in /usr/src/php-4.3.0RC1/ext/standard/tests/strings/bug20169.php on line 2 003+ delimiter: | ================================================================================ ================================================================================ /usr/src/php-4.3.0RC1/ext/standard/tests/time/001.phpt ================================================================================ ---- EXPECTED OUTPUT Passed: 100000 Failed: 0 ---- ACTUAL OUTPUT Warning: Cannot set time limit in safe mode in /usr/src/php-4.3.0RC1/ext/standard/tests/time/001.php on line 8 Passed: 99990 Failed: 10 000141: 1037900796 0.42363200 < 1037900796 0.42374700 003454: 1037900796 0.52357100 < 1037900796 0.52387800 004942: 1037900796 0.56361900 < 1037900796 0.56548600 007878: 1037900796 0.64358800 < 1037900796 0.64540900 022288: 1037900797 0.02362700 < 1037900797 0.02491400 068573: 1037900798 0.23360100 < 1037900798 0.23481300 074648: 1037900798 0.38365000 < 1037900798 0.38431400 080326: 1037900798 0.53362300 < 1037900798 0.53381100 081168: 1037900798 0.56367500 < 1037900798 0.56552800 085659: 1037900798 0.68362900 < 1037900798 0.68494100 ---- FAILED ================================================================================ 001- Passed: 100000 001+ Warning: Cannot set time limit in safe mode in /usr/src/php-4.3.0RC1/ext/standard/tests/time/001.php on line 8 002- Failed: 0 002+ Passed: 99990 003+ Failed: 10 004+ 000141: 1037900796 0.42363200 < 1037900796 0.42374700 005+ 003454: 1037900796 0.52357100 < 1037900796 0.52387800 006+ 004942: 1037900796 0.56361900 < 1037900796 0.56548600 007+ 007878: 1037900796 0.64358800 < 1037900796 0.64540900 008+ 022288: 1037900797 0.02362700 < 1037900797 0.02491400 009+ 068573: 1037900798 0.23360100 < 1037900798 0.23481300 010+ 074648: 1037900798 0.38365000 < 1037900798 0.38431400 011+ 080326: 1037900798 0.53362300 < 1037900798 0.53381100 012+ 081168: 1037900798 0.56367500 < 1037900798 0.56552800 013+ 085659: 1037900798 0.68362900 < 1037900798 0.68494100 ================================================================================ ================================================================================ /usr/src/php-4.3.0RC1/ext/standard/tests/time/002.phpt ================================================================================ ---- EXPECTED OUTPUT 1999-10-13 00:00:00 1999-10-13 00:00:00 2000-01-19 00:00:00 2000-01-19 00:00:00 2001-12-21 00:00:00 2001-12-21 00:00:00 2001-12-21 12:16:00 2001-12-21 12:16:00 1969-12-31 23:59:59 2001-10-22 21:19:58 2001-10-22 23:19:58 2001-10-22 23:32:58 2001-10-22 19:19:58 2001-10-22 19:06:58 1999-10-13 00:00:00 1999-10-13 00:00:00 2000-01-19 00:00:00 2000-01-19 00:00:00 2001-12-21 00:00:00 2001-12-21 00:00:00 2001-12-21 12:16:00 2001-12-21 12:16:00 1970-01-01 00:59:59 2001-10-22 21:19:58 2001-10-23 01:19:58 2001-10-23 01:32:58 2001-10-22 21:19:58 2001-10-22 21:06:58 ---- ACTUAL OUTPUT Warning: putenv() [/phpmanual/function.putenv.html]: Safe Mode warning: Cannot set environment variable 'TZ' - it's not in the allowed list in /usr/src/php-4.3.0RC1/ext/standard/tests/time/002.php on line 19 1999-10-13 00:00:00 1999-10-13 00:00:00 2000-01-19 00:00:00 2000-01-19 00:00:00 2001-12-21 00:00:00 2001-12-21 00:00:00 2001-12-21 12:16:00 2001-12-21 12:16:00 1969-12-31 18:59:59 2001-10-22 21:19:58 2001-10-22 19:19:58 2001-10-22 19:32:58 2001-10-22 15:19:58 2001-10-22 15:06:58 Warning: putenv() [/phpmanual/function.putenv.html]: Safe Mode warning: Cannot set environment variable 'TZ' - it's not in the allowed list in /usr/src/php-4.3.0RC1/ext/standard/tests/time/002.php on line 24 1999-10-13 00:00:00 1999-10-13 00:00:00 2000-01-19 00:00:00 2000-01-19 00:00:00 2001-12-21 00:00:00 2001-12-21 00:00:00 2001-12-21 12:16:00 2001-12-21 12:16:00 1969-12-31 18:59:59 2001-10-22 21:19:58 2001-10-22 19:19:58 2001-10-22 19:32:58 2001-10-22 15:19:58 2001-10-22 15:06:58 ---- FAILED ================================================================================ 001- 1999-10-13 00:00:00 001+ Warning: putenv() [/phpmanual/function.putenv.html]: Safe Mode warning: Cannot set environment variable 'TZ' - it's not in the allowed list in /usr/src/php-4.3.0RC1/ext/standard/tests/time/002.php on line 19 003- 2000-01-19 00:00:00 003+ 1999-10-13 00:00:00 005- 2001-12-21 00:00:00 005+ 2000-01-19 00:00:00 007- 2001-12-21 12:16:00 007+ 2001-12-21 00:00:00 009- 1969-12-31 23:59:59 009+ 2001-12-21 12:16:00 010- 2001-10-22 21:19:58 010+ 1969-12-31 18:59:59 011- 2001-10-22 23:19:58 011+ 2001-10-22 21:19:58 012- 2001-10-22 23:32:58 012+ 2001-10-22 19:19:58 013- 2001-10-22 19:19:58 013+ 2001-10-22 19:32:58 014- 2001-10-22 19:06:58 014+ 2001-10-22 15:19:58 015- 1999-10-13 00:00:00 015+ 2001-10-22 15:06:58 016- 1999-10-13 00:00:00 016+ 017- 2000-01-19 00:00:00 017+ Warning: putenv() [/phpmanual/function.putenv.html]: Safe Mode warning: Cannot set environment variable 'TZ' - it's not in the allowed list in /usr/src/php-4.3.0RC1/ext/standard/tests/time/002.php on line 24 018- 2000-01-19 00:00:00 018+ 1999-10-13 00:00:00 019- 2001-12-21 00:00:00 019+ 1999-10-13 00:00:00 020- 2001-12-21 00:00:00 020+ 2000-01-19 00:00:00 021- 2001-12-21 12:16:00 021+ 2000-01-19 00:00:00 022- 2001-12-21 12:16:00 022+ 2001-12-21 00:00:00 023- 1970-01-01 00:59:59 023+ 2001-12-21 00:00:00 024- 2001-10-22 21:19:58 024+ 2001-12-21 12:16:00 025- 2001-10-23 01:19:58 025+ 2001-12-21 12:16:00 026- 2001-10-23 01:32:58 026+ 1969-12-31 18:59:59 028- 2001-10-22 21:06:58 028+ 2001-10-22 19:19:58 029+ 2001-10-22 19:32:58 030+ 2001-10-22 15:19:58 031+ 2001-10-22 15:06:58 ================================================================================ ================================================================================ /usr/src/php-4.3.0RC1/ext/standard/tests/time/003.phpt ================================================================================ ---- EXPECTED OUTPUT 2000-02-29 2000-02-28 2000-02-29 2001-02-28 2001-03-01 1999-11-30 2000-05-29 12:00:00 2000-05-29 13:00:00 2000-05-29 12:00:00 2000-01-31 12:00:00 2000-01-31 12:00:00 2000-01-31 11:00:00 2000-04-29 12:00:00 2000-04-29 13:00:00 2000-04-29 12:00:00 ---- ACTUAL OUTPUT 2000-02-29 2000-02-28 2000-02-29 2001-02-28 2001-03-01 1999-11-30 Warning: putenv() [/phpmanual/function.putenv.html]: Safe Mode warning: Cannot set environment variable 'TZ' - it's not in the allowed list in /usr/src/php-4.3.0RC1/ext/standard/tests/time/003.php on line 12 2000-05-29 12:00:00 2000-05-29 13:00:00 2000-05-29 12:00:00 2000-01-31 12:00:00 2000-01-31 12:00:00 2000-01-31 11:00:00 2000-04-29 12:00:00 2000-04-29 13:00:00 2000-04-29 12:00:00 ---- FAILED ================================================================================ 007- 2000-05-29 12:00:00 007+ 008- 2000-05-29 13:00:00 008+ Warning: putenv() [/phpmanual/function.putenv.html]: Safe Mode warning: Cannot set environment variable 'TZ' - it's not in the allowed list in /usr/src/php-4.3.0RC1/ext/standard/tests/time/003.php on line 12 010- 2000-01-31 12:00:00 010+ 2000-05-29 13:00:00 011- 2000-01-31 12:00:00 011+ 2000-05-29 12:00:00 012- 2000-01-31 11:00:00 012+ 2000-01-31 12:00:00 013- 2000-04-29 12:00:00 013+ 2000-01-31 12:00:00 014- 2000-04-29 13:00:00 014+ 2000-01-31 11:00:00 016+ 2000-04-29 13:00:00 017+ 2000-04-29 12:00:00 ================================================================================ ================================================================================ /usr/src/php-4.3.0RC1/ext/xml/tests/xml001.phpt ================================================================================ ---- EXPECTED OUTPUT {?[<?xml version="1.0" encoding="ISO-8859-1"?>]}{?[ ]}{?[<!DOCTYPE]}{?[ ]}{?[phptest]}{?[ ]}{?[SYSTEM]}{?[ ]}{?["notfound.dtd"]}{?[ ]}{?[[]}{?[ ]}{?[<!ENTITY]}{?[ ]}{?[%]}{?[ ]}{?[incent]}{?[ ]}{?[SYSTEM]}{?[ ]}{?["inc.ent"]}{?[>]}{?[ ]}{?[%incent;]}{?[ ]}{?[]]}{?[>]}{?[ ]}{ROOT ID="elem1"}{CDATA[ ]}{CDATA[ Plain text.]}{CDATA[ ]}{CDATA[ ]}{ELEM1}{CDATA[ ]}{CDATA[ ]}{?[<!-- comment -->]}{CDATA[ ]}{CDATA[ ]}{ELEM2}{CDATA[ ]}{CDATA[ ]}{?[<![CDATA[]}{CDATA[CDATA block]}{?[]]>]}{CDATA[ ]}{CDATA[ ]}{ELEM3}{CDATA[ ]}{CDATA[ ]}{ENTREF[&included-entity;]}{CDATA[ ]}{CDATA[ ]}{ELEM4}{CDATA[ ]}{CDATA[ ]}{PI[test,processing instruction ]}{CDATA[ ]}{CDATA[ ]}{/ELEM4}{CDATA[ ]}{CDATA[ ]}{/ELEM3}{CDATA[ ]}{CDATA[ ]}{/ELEM2}{CDATA[ ]}{CDATA[ ]}{/ELEM1}{CDATA[ ]}{/ROOT}{?[ ]}parse complete ---- ACTUAL OUTPUT Warning: chdir() [/phpmanual/function.chdir.html]: SAFE MODE Restriction in effect. The script whose uid is 0 is not allowed to access /usr/src/php-4.3.0RC1/ext/xml/tests owned by uid 500 in /usr/src/php-4.3.0RC1/ext/xml/tests/xml001.php on line 2 could not open XML input ---- FAILED ================================================================================ 001- {?[<?xml version="1.0" encoding="ISO-8859-1"?>]}{?[ 001+ Warning: chdir() [/phpmanual/function.chdir.html]: SAFE MODE Restriction in effect. The script whose uid is 0 is not allowed to access /usr/src/php-4.3.0RC1/ext/xml/tests owned by uid 500 in /usr/src/php-4.3.0RC1/ext/xml/tests/xml001.php on line 2 002- ]}{?[<!DOCTYPE]}{?[ ]}{?[phptest]}{?[ ]}{?[SYSTEM]}{?[ ]}{?["notfound.dtd"]}{?[ ]}{?[[]}{?[ 002+ could not open XML input 003- ]}{?[<!ENTITY]}{?[ ]}{?[%]}{?[ ]}{?[incent]}{?[ ]}{?[SYSTEM]}{?[ ]}{?["inc.ent"]}{?[>]}{?[ 004- ]}{?[%incent;]}{?[ 005- ]}{?[]]}{?[>]}{?[ 006- ]}{ROOT ID="elem1"}{CDATA[ 007- ]}{CDATA[ Plain text.]}{CDATA[ 008- ]}{CDATA[ ]}{ELEM1}{CDATA[ 009- ]}{CDATA[ ]}{?[<!-- comment -->]}{CDATA[ 010- ]}{CDATA[ ]}{ELEM2}{CDATA[ 011- ]}{CDATA[ ]}{?[<![CDATA[]}{CDATA[CDATA block]}{?[]]>]}{CDATA[ 012- ]}{CDATA[ ]}{ELEM3}{CDATA[ 013- ]}{CDATA[ ]}{ENTREF[&included-entity;]}{CDATA[ 014- ]}{CDATA[ ]}{ELEM4}{CDATA[ 015- ]}{CDATA[ ]}{PI[test,processing instruction ]}{CDATA[ 016- ]}{CDATA[ ]}{/ELEM4}{CDATA[ 017- ]}{CDATA[ ]}{/ELEM3}{CDATA[ 018- ]}{CDATA[ ]}{/ELEM2}{CDATA[ 019- ]}{CDATA[ ]}{/ELEM1}{CDATA[ 020- ]}{/ROOT}{?[ 021- ]}parse complete ================================================================================ ================================================================================ /usr/src/php-4.3.0RC1/ext/xml/tests/xml002.phpt ================================================================================ ---- EXPECTED OUTPUT {?[<?xml version="1.0" encoding="ISO-8859-1"?>]}{?[ ]}{?[<!DOCTYPE]}{?[ ]}{?[phptest]}{?[ ]}{?[SYSTEM]}{?[ ]}{?["notfound.dtd"]}{?[ ]}{?[[]}{?[ ]}{?[<!ENTITY]}{?[ ]}{?[%]}{?[ ]}{?[incent]}{?[ ]}{?[SYSTEM]}{?[ ]}{?["inc.ent"]}{?[>]}{?[ ]}{?[%incent;]}{?[ ]}{?[]]}{?[>]}{?[ ]}{ROOT ID="elem1"}{CDATA[ ]}{CDATA[ Plain text.]}{CDATA[ ]}{CDATA[ ]}{ELEM1}{CDATA[ ]}{CDATA[ ]}{?[<!-- comment -->]}{CDATA[ ]}{CDATA[ ]}{ELEM2}{CDATA[ ]}{CDATA[ ]}{?[<![CDATA[]}{CDATA[CDATA block]}{?[]]>]}{CDATA[ ]}{CDATA[ ]}{ELEM3}{CDATA[ ]}{CDATA[ ]}{ENTREF[&included-entity;]}{CDATA[ ]}{CDATA[ ]}{ELEM4}{CDATA[ ]}{CDATA[ ]}{PI[test,processing instruction ]}{CDATA[ ]}{CDATA[ ]}{/ELEM4}{CDATA[ ]}{CDATA[ ]}{/ELEM3}{CDATA[ ]}{CDATA[ ]}{/ELEM2}{CDATA[ ]}{CDATA[ ]}{/ELEM1}{CDATA[ ]}{/ROOT}{?[ ]}parse complete ---- ACTUAL OUTPUT Warning: chdir() [/phpmanual/function.chdir.html]: SAFE MODE Restriction in effect. The script whose uid is 0 is not allowed to access /usr/src/php-4.3.0RC1/ext/xml/tests owned by uid 500 in /usr/src/php-4.3.0RC1/ext/xml/tests/xml002.php on line 2 could not open XML input ---- FAILED ================================================================================ 001- {?[<?xml version="1.0" encoding="ISO-8859-1"?>]}{?[ 001+ Warning: chdir() [/phpmanual/function.chdir.html]: SAFE MODE Restriction in effect. The script whose uid is 0 is not allowed to access /usr/src/php-4.3.0RC1/ext/xml/tests owned by uid 500 in /usr/src/php-4.3.0RC1/ext/xml/tests/xml002.php on line 2 002- ]}{?[<!DOCTYPE]}{?[ ]}{?[phptest]}{?[ ]}{?[SYSTEM]}{?[ ]}{?["notfound.dtd"]}{?[ ]}{?[[]}{?[ 002+ could not open XML input 003- ]}{?[<!ENTITY]}{?[ ]}{?[%]}{?[ ]}{?[incent]}{?[ ]}{?[SYSTEM]}{?[ ]}{?["inc.ent"]}{?[>]}{?[ 004- ]}{?[%incent;]}{?[ 005- ]}{?[]]}{?[>]}{?[ 006- ]}{ROOT ID="elem1"}{CDATA[ 007- ]}{CDATA[ Plain text.]}{CDATA[ 008- ]}{CDATA[ ]}{ELEM1}{CDATA[ 009- ]}{CDATA[ ]}{?[<!-- comment -->]}{CDATA[ 010- ]}{CDATA[ ]}{ELEM2}{CDATA[ 011- ]}{CDATA[ ]}{?[<![CDATA[]}{CDATA[CDATA block]}{?[]]>]}{CDATA[ 012- ]}{CDATA[ ]}{ELEM3}{CDATA[ 013- ]}{CDATA[ ]}{ENTREF[&included-entity;]}{CDATA[ 014- ]}{CDATA[ ]}{ELEM4}{CDATA[ 015- ]}{CDATA[ ]}{PI[test,processing instruction ]}{CDATA[ 016- ]}{CDATA[ ]}{/ELEM4}{CDATA[ 017- ]}{CDATA[ ]}{/ELEM3}{CDATA[ 018- ]}{CDATA[ ]}{/ELEM2}{CDATA[ 019- ]}{CDATA[ ]}{/ELEM1}{CDATA[ 020- ]}{/ROOT}{?[ 021- ]}parse complete ================================================================================ ================================================================================ /usr/src/php-4.3.0RC1/ext/xml/tests/xml003.phpt ================================================================================ ---- EXPECTED OUTPUT {?[<?xml version="1.0" encoding="ISO-8859-1"?>]}{?[ ]}{?[<!DOCTYPE]}{?[ ]}{?[phptest]}{?[ ]}{?[SYSTEM]}{?[ ]}{?["notfound.dtd"]}{?[ ]}{?[[]}{?[ ]}{?[<!ENTITY]}{?[ ]}{?[%]}{?[ ]}{?[incent]}{?[ ]}{?[SYSTEM]}{?[ ]}{?["inc.ent"]}{?[>]}{?[ ]}{?[%incent;]}{?[ ]}{?[]]}{?[>]}{?[ ]}{ROOT ID="elem1"}{CDATA[ ]}{CDATA[ Plain text.]}{CDATA[ ]}{CDATA[ ]}{ELEM1}{CDATA[ ]}{CDATA[ ]}{?[<!-- comment -->]}{CDATA[ ]}{CDATA[ ]}{ELEM2}{CDATA[ ]}{CDATA[ ]}{?[<![CDATA[]}{CDATA[CDATA block]}{?[]]>]}{CDATA[ ]}{CDATA[ ]}{ELEM3}{CDATA[ ]}{CDATA[ ]}{ENTREF[&included-entity;]}{CDATA[ ]}{CDATA[ ]}{ELEM4}{CDATA[ ]}{CDATA[ ]}{PI[test,processing instruction ]}{CDATA[ ]}{CDATA[ ]}{/ELEM4}{CDATA[ ]}{CDATA[ ]}{/ELEM3}{CDATA[ ]}{CDATA[ ]}{/ELEM2}{CDATA[ ]}{CDATA[ ]}{/ELEM1}{CDATA[ ]}{/ROOT}{?[ ]}parse complete ---- ACTUAL OUTPUT Warning: chdir() [/phpmanual/function.chdir.html]: SAFE MODE Restriction in effect. The script whose uid is 0 is not allowed to access /usr/src/php-4.3.0RC1/ext/xml/tests owned by uid 500 in /usr/src/php-4.3.0RC1/ext/xml/tests/xml003.php on line 2 could not open XML input ---- FAILED ================================================================================ 001- {?[<?xml version="1.0" encoding="ISO-8859-1"?>]}{?[ 001+ Warning: chdir() [/phpmanual/function.chdir.html]: SAFE MODE Restriction in effect. The script whose uid is 0 is not allowed to access /usr/src/php-4.3.0RC1/ext/xml/tests owned by uid 500 in /usr/src/php-4.3.0RC1/ext/xml/tests/xml003.php on line 2 002- ]}{?[<!DOCTYPE]}{?[ ]}{?[phptest]}{?[ ]}{?[SYSTEM]}{?[ ]}{?["notfound.dtd"]}{?[ ]}{?[[]}{?[ 002+ could not open XML input 003- ]}{?[<!ENTITY]}{?[ ]}{?[%]}{?[ ]}{?[incent]}{?[ ]}{?[SYSTEM]}{?[ ]}{?["inc.ent"]}{?[>]}{?[ 004- ]}{?[%incent;]}{?[ 005- ]}{?[]]}{?[>]}{?[ 006- ]}{ROOT ID="elem1"}{CDATA[ 007- ]}{CDATA[ Plain text.]}{CDATA[ 008- ]}{CDATA[ ]}{ELEM1}{CDATA[ 009- ]}{CDATA[ ]}{?[<!-- comment -->]}{CDATA[ 010- ]}{CDATA[ ]}{ELEM2}{CDATA[ 011- ]}{CDATA[ ]}{?[<![CDATA[]}{CDATA[CDATA block]}{?[]]>]}{CDATA[ 012- ]}{CDATA[ ]}{ELEM3}{CDATA[ 013- ]}{CDATA[ ]}{ENTREF[&included-entity;]}{CDATA[ 014- ]}{CDATA[ ]}{ELEM4}{CDATA[ 015- ]}{CDATA[ ]}{PI[test,processing instruction ]}{CDATA[ 016- ]}{CDATA[ ]}{/ELEM4}{CDATA[ 017- ]}{CDATA[ ]}{/ELEM3}{CDATA[ 018- ]}{CDATA[ ]}{/ELEM2}{CDATA[ 019- ]}{CDATA[ ]}{/ELEM1}{CDATA[ 020- ]}{/ROOT}{?[ 021- ]}parse complete ================================================================================ ================================================================================ /usr/src/php-4.3.0RC1/ext/xml/tests/xml004.phpt ================================================================================ ---- EXPECTED OUTPUT <root id="elem1"> <elem1> <elem2> <elem3> <elem4> </elem4> </elem3> </elem2> </elem1> </root> <ROOT ID="elem1"> <ELEM1> <ELEM2> <ELEM3> <ELEM4> </ELEM4> </ELEM3> </ELEM2> </ELEM1> </ROOT> ---- ACTUAL OUTPUT Warning: chdir() [/phpmanual/function.chdir.html]: SAFE MODE Restriction in effect. The script whose uid is 0 is not allowed to access /usr/src/php-4.3.0RC1/ext/xml/tests owned by uid 500 in /usr/src/php-4.3.0RC1/ext/xml/tests/xml004.php on line 2 Warning: fopen() [/phpmanual/function.fopen.html]: Unable to access xmltest.xml in /usr/src/php-4.3.0RC1/ext/xml/tests/xml004.php on line 7 Warning: fopen(xmltest.xml) [/phpmanual/function.fopen.html]: failed to create stream: No such file or directory in /usr/src/php-4.3.0RC1/ext/xml/tests/xml004.php on line 7 Warning: fread(): supplied argument is not a valid stream resource in /usr/src/php-4.3.0RC1/ext/xml/tests/xml004.php on line 8 Warning: fopen() [/phpmanual/function.fopen.html]: Unable to access xmltest.xml in /usr/src/php-4.3.0RC1/ext/xml/tests/xml004.php on line 15 Warning: fopen(xmltest.xml) [/phpmanual/function.fopen.html]: failed to create stream: No such file or directory in /usr/src/php-4.3.0RC1/ext/xml/tests/xml004.php on line 15 Warning: fread(): supplied argument is not a valid stream resource in /usr/src/php-4.3.0RC1/ext/xml/tests/xml004.php on line 16 ---- FAILED ================================================================================ 001- <root id="elem1"> 001+ Warning: chdir() [/phpmanual/function.chdir.html]: SAFE MODE Restriction in effect. The script whose uid is 0 is not allowed to access /usr/src/php-4.3.0RC1/ext/xml/tests owned by uid 500 in /usr/src/php-4.3.0RC1/ext/xml/tests/xml004.php on line 2 002- <elem1> 002+ 003- <elem2> 003+ Warning: fopen() [/phpmanual/function.fopen.html]: Unable to access xmltest.xml in /usr/src/php-4.3.0RC1/ext/xml/tests/xml004.php on line 7 004- <elem3> 004+ 005- <elem4> 005+ Warning: fopen(xmltest.xml) [/phpmanual/function.fopen.html]: failed to create stream: No such file or directory in /usr/src/php-4.3.0RC1/ext/xml/tests/xml004.php on line 7 006- </elem4> 006+ 007- </elem3> 007+ Warning: fread(): supplied argument is not a valid stream resource in /usr/src/php-4.3.0RC1/ext/xml/tests/xml004.php on line 8 008- </elem2> 008+ 009- </elem1> 009+ Warning: fopen() [/phpmanual/function.fopen.html]: Unable to access xmltest.xml in /usr/src/php-4.3.0RC1/ext/xml/tests/xml004.php on line 15 010- </root> 010+ 011- <ROOT ID="elem1"> 011+ Warning: fopen(xmltest.xml) [/phpmanual/function.fopen.html]: failed to create stream: No such file or directory in /usr/src/php-4.3.0RC1/ext/xml/tests/xml004.php on line 15 012- <ELEM1> 012+ 013- <ELEM2> 013+ Warning: fread(): supplied argument is not a valid stream resource in /usr/src/php-4.3.0RC1/ext/xml/tests/xml004.php on line 16 014- <ELEM3> 015- <ELEM4> 016- </ELEM4> 017- </ELEM3> 018- </ELEM2> 019- </ELEM1> 020- </ROOT> ================================================================================ ================================================================================ PHPINFO ================================================================================ phpinfo() PHP Version => 4.3.0RC1 System => Linux www 2.4.18 #12 Fri May 31 01:40:49 PDT 2002 i686 Build Date => Nov 21 2002 12:42:04 Configure Command => './configure' '--prefix=/usr/local' '--with-apxs=/usr/local/apache/bin/apxs' '--enable-exif' '--enable-track-vars' '--with-calendar=shared' '--enable-safe-mode' '--enable-magic-quotes' '--enable-trans-sid' '--enable-wddx' '--with-openssl' '--with-mysql' '--with-jpeg-dir=/usr/src/jpeg-6b/' '--with-gd' '--with-zlib' Server API => Command Line Interface Virtual Directory Support => disabled Configuration File (php.ini) Path => /usr/local/lib PHP API => 20020918 PHP Extension => 20020429 Zend Extension => 20021010 Debug Build => no Thread Safety => disabled Registered PHP Streams => php, http, ftp, https, ftps, compress.zlib This program makes use of the Zend Scripting Language Engine: Zend Engine v1.3.0, Copyright (c) 1998-2002 Zend Technologies _______________________________________________________________________ Configuration PHP Core Directive => Local Value => Master Value allow_call_time_pass_reference => On => On allow_url_fopen => On => On always_populate_raw_post_data => Off => Off arg_separator.input => &amp; => &amp; arg_separator.output => &amp; => &amp; asp_tags => Off => Off auto_append_file => no value => no value auto_prepend_file => no value => no value browscap => no value => no value default_charset => no value => no value default_mimetype => text/html => text/html define_syslog_variables => Off => Off disable_functions => no value => no value display_errors => On => On display_startup_errors => Off => Off doc_root => no value => no value docref_ext => no value => no value docref_root => http://www.php.net/ => http://www.php.net/ enable_dl => On => On error_append_string => no value => no value error_log => no value => no value error_prepend_string => no value => no value error_reporting => no value => no value expose_php => On => On extension_dir => /usr/local/lib/php/extensions/no-debug-non-zts-20020429 => /usr/local/lib/php/extensions/no-debug-non-zts-20020429 file_uploads => On => On gpc_order => GPC => GPC highlight.bg => #FFFFFF => #FFFFFF highlight.comment => #FF8000 => #FF8000 highlight.default => #0000BB => #0000BB highlight.html => #000000 => #000000 highlight.keyword => #007700 => #007700 highlight.string => #DD0000 => #DD0000 html_errors => Off => On ignore_repeated_errors => Off => Off ignore_repeated_source => Off => Off ignore_user_abort => Off => Off implicit_flush => On => Off include_path => .:/usr/local/lib/php => .:/usr/local/lib/php log_errors => Off => Off log_errors_max_len => 1024 => 1024 magic_quotes_gpc => On => On magic_quotes_runtime => Off => Off magic_quotes_sybase => Off => Off max_execution_time => 0 => 30 max_input_time => -1 => -1 open_basedir => no value => no value output_buffering => 0 => 0 output_handler => no value => no value post_max_size => 8M => 8M precision => 14 => 14 register_argc_argv => On => On register_globals => Off => Off report_memleaks => On => On safe_mode => On => On safe_mode_exec_dir => 1 => 1 safe_mode_gid => Off => Off safe_mode_include_dir => no value => no value sendmail_from => no value => no value sendmail_path => /usr/sbin/sendmail -t -i => /usr/sbin/sendmail -t -i short_open_tag => On => On SMTP => localhost => localhost smtp_port => 25 => 25 sql.safe_mode => Off => Off track_errors => Off => Off unserialize_callback_func => no value => no value upload_max_filesize => 2M => 2M upload_tmp_dir => no value => no value user_dir => no value => no value variables_order => no value => no value xmlrpc_error_number => 0 => 0 xmlrpc_errors => Off => Off y2k_compliance => On => On xml XML Support => active XML Namespace Support => active EXPAT Version => 1.95.2 wddx WDDX Support => enabled WDDX Session Serializer => enabled tokenizer Tokenizer Support => enabled standard Regex Library => Bundled library enabled Dynamic Library Support => enabled Path to sendmail => /usr/sbin/sendmail -t -i Directive => Local Value => Master Value assert.active => 1 => 1 assert.bail => 0 => 0 assert.callback => no value => no value assert.quiet_eval => 0 => 0 assert.warning => 1 => 1 auto_detect_line_endings => 0 => 0 default_socket_timeout => 60 => 60 safe_mode_allowed_env_vars => PHP_ => PHP_ safe_mode_protected_env_vars => LD_LIBRARY_PATH => LD_LIBRARY_PATH url_rewriter.tags => a=href,area=href,frame=src,form=,fieldset= => a=href,area=href,frame=src,form=,fieldset= user_agent => no value => no value session Session Support => enabled Registered save handlers => files user Directive => Local Value => Master Value session.auto_start => Off => Off session.bug_compat_42 => On => On session.bug_compat_warn => On => On session.cache_expire => 180 => 180 session.cache_limiter => nocache => nocache session.cookie_domain => no value => no value session.cookie_lifetime => 0 => 0 session.cookie_path => / => / session.cookie_secure => Off => Off session.entropy_file => no value => no value session.entropy_length => 0 => 0 session.gc_dividend => 100 => 100 session.gc_maxlifetime => 1440 => 1440 session.gc_probability => 1 => 1 session.name => PHPSESSID => PHPSESSID session.referer_check => no value => no value session.save_handler => files => files session.save_path => /tmp => /tmp session.serialize_handler => php => php session.use_cookies => On => On session.use_only_cookies => Off => Off session.use_trans_sid => Off => Off posix Revision => $Revision: 1.51 $ pcre PCRE (Perl Compatible Regular Expressions) Support => enabled PCRE Library Version => 3.92 11-Sep-2002 overload User-Space Object Overloading Support => enabled openssl OpenSSL support => enabled OpenSSL Version => OpenSSL 0.9.6d 9 May 2002 mysql MySQL Support => enabled Active Persistent Links => 0 Active Links => 0 Client API version => 3.23.49 MYSQL_MODULE_TYPE => builtin MYSQL_SOCKET => /tmp/mysql.sock MYSQL_INCLUDE => MYSQL_LIBS => Directive => Local Value => Master Value mysql.allow_persistent => On => On mysql.connect_timeout => -1 => -1 mysql.default_host => no value => no value mysql.default_password => no value => no value mysql.default_port => no value => no value mysql.default_socket => no value => no value mysql.default_user => no value => no value mysql.max_links => Unlimited => Unlimited mysql.max_persistent => Unlimited => Unlimited mysql.trace_mode => Off => Off gd GD Support => enabled GD Version => bundled (2.0 compatible) GIF Read Support => enabled JPG Support => enabled PNG Support => enabled WBMP Support => enabled exif EXIF Support => enabled EXIF Version => 1.4 $Id: exif.c,v 1.118 2002/11/08 01:08:01 iliaa Exp $ Supported EXIF Version => 0220 Supported filetypes => JPEG,TIFF ctype ctype functions => enabled zlib ZLib Support => enabled 'zlib:' fopen wrapper => enabled Compiled Version => 1.1.4 Linked Version => 1.1.4 Directive => Local Value => Master Value zlib.output_compression => Off => Off zlib.output_compression_level => -1 => -1 zlib.output_handler => no value => no value Additional Modules Module Name Environment Variable => Value PWD => /usr/src/php-4.3.0RC1 MAKEFLAGS => MFLAGS => HOSTNAME => www.loveink.com REDIRECT_STATUS => 1 TEST_PHP_EXECUTABLE => /usr/src/php-4.3.0RC1/sapi/cli/php LS_OPTIONS => --color=auto -F -b -T 0 QTDIR => /usr/lib/qt-3.0.4 MANPATH => /usr/local/man:/usr/man:/usr/X11R6/man:/usr/lib/qt-3.0.4/doc/man LESSOPEN => |lesspipe.sh %s CC => gcc T1LIB_CONFIG => /usr/share/t1lib/t1lib.config KDEDIR => /opt/kde LESS => -M LS_COLORS => no=00:fi=00:di=01;34:ln=01;36:pi=40;33:so=01;35:bd=40;33;01:cd=40;33;01:or=40;31;01:ex=01;32:*.cmd=01;32:*.exe=01;32:*.com=01;32:*.btm=01;32:*.bat=01;32:*.tar=01;31:*.tgz=01;31:*.arj=01;31:*.taz=01;31:*.lzh=01;31:*.zip=01;31:*.bz2=01;31:*.rpm=01;31:*.deb=01;31:*.z=01;31:*.Z=01;31:*.gz=01;31:*.jpg=01;35:*.gif=01;35:*.bmp=01;35:*.ppm=01;35:*.tga=01;35:*.xbm=01;35:*.xpm=01;35:*.tif=01;35:*.mpg=01;37:*.avi=01;37:*.mov=01;37: CPLUS_INCLUDE_PATH => /usr/lib/qt-3.0.4/include USER => root SCRIPT_FILENAME => /usr/src/php-4.3.0RC1/tests/strings/004.php LC_ALL => POSIX MAIL => /var/mail/root INPUTRC => /etc/inputrc PATH_TRANSLATED => /usr/src/php-4.3.0RC1/tests/strings/004.php QUERY_STRING => CONTENT_LENGTH => MAKELEVEL => 1 SSH_CLIENT => 24.114.67.143 1950 22 SHLVL => 3 LOGNAME => root MINICOM => -c on _ => /usr/src/php-4.3.0RC1/sapi/cli/php REQUEST_METHOD => GET SHELL => /bin/sh TEST_PHP_SRCDIR => /usr/src/php-4.3.0RC1 TERM => xterm HOME => /root PATH => /usr/local/sbin:/usr/sbin:/sbin:/usr/local/bin:/usr/bin:/bin:/usr/X11R6/bin:/usr/games:/opt/www/htdig/bin:/opt/kde/bin:/usr/lib/qt-3.0.4/bin SSH_TTY => /dev/pts/0 CONTENT_TYPE => mc => () { if [ "$USER" = "root" -a ! "id | cut -b1-5" = "uid=0" ]; then /usr/bin/mc "$@"; else if [ ! "$USER" = "root" -a "id | cut -b1-5" = "uid=0" ]; then /usr/bin/mc "$@"; else mkdir -p $HOME/.mc/tmp 2>/dev/null; chmod 700 $HOME/.mc/tmp; MC=$HOME/.mc/tmp/mc-$$; /usr/bin/mc -P "$@" >"$MC"; cd "cat $MC"; rm -f "$MC"; unset MC; fi; fi } PHP Variables Variable => Value _SERVER["PWD"] => /usr/src/php-4.3.0RC1 _SERVER["MAKEFLAGS"] => _SERVER["MFLAGS"] => _SERVER["HOSTNAME"] => www.loveink.com _SERVER["REDIRECT_STATUS"] => 1 _SERVER["TEST_PHP_EXECUTABLE"] => /usr/src/php-4.3.0RC1/sapi/cli/php _SERVER["LS_OPTIONS"] => --color=auto -F -b -T 0 _SERVER["QTDIR"] => /usr/lib/qt-3.0.4 _SERVER["MANPATH"] => /usr/local/man:/usr/man:/usr/X11R6/man:/usr/lib/qt-3.0.4/doc/man _SERVER["LESSOPEN"] => |lesspipe.sh %s _SERVER["CC"] => gcc _SERVER["T1LIB_CONFIG"] => /usr/share/t1lib/t1lib.config _SERVER["KDEDIR"] => /opt/kde _SERVER["LESS"] => -M _SERVER["LS_COLORS"] => no=00:fi=00:di=01;34:ln=01;36:pi=40;33:so=01;35:bd=40;33;01:cd=40;33;01:or=40;31;01:ex=01;32:*.cmd=01;32:*.exe=01;32:*.com=01;32:*.btm=01;32:*.bat=01;32:*.tar=01;31:*.tgz=01;31:*.arj=01;31:*.taz=01;31:*.lzh=01;31:*.zip=01;31:*.bz2=01;31:*.rpm=01;31:*.deb=01;31:*.z=01;31:*.Z=01;31:*.gz=01;31:*.jpg=01;35:*.gif=01;35:*.bmp=01;35:*.ppm=01;35:*.tga=01;35:*.xbm=01;35:*.xpm=01;35:*.tif=01;35:*.mpg=01;37:*.avi=01;37:*.mov=01;37: _SERVER["CPLUS_INCLUDE_PATH"] => /usr/lib/qt-3.0.4/include _SERVER["USER"] => root _SERVER["SCRIPT_FILENAME"] => _SERVER["LC_ALL"] => POSIX _SERVER["MAIL"] => /var/mail/root _SERVER["INPUTRC"] => /etc/inputrc _SERVER["PATH_TRANSLATED"] => _SERVER["QUERY_STRING"] => _SERVER["CONTENT_LENGTH"] => _SERVER["MAKELEVEL"] => 1 _SERVER["SSH_CLIENT"] => 24.114.67.143 1950 22 _SERVER["SHLVL"] => 3 _SERVER["LOGNAME"] => root _SERVER["MINICOM"] => -c on _SERVER["_"] => /usr/src/php-4.3.0RC1/sapi/cli/php _SERVER["REQUEST_METHOD"] => GET _SERVER["SHELL"] => /bin/sh _SERVER["TEST_PHP_SRCDIR"] => /usr/src/php-4.3.0RC1 _SERVER["TERM"] => xterm _SERVER["HOME"] => /root _SERVER["PATH"] => /usr/local/sbin:/usr/sbin:/sbin:/usr/local/bin:/usr/bin:/bin:/usr/X11R6/bin:/usr/games:/opt/www/htdig/bin:/opt/kde/bin:/usr/lib/qt-3.0.4/bin _SERVER["SSH_TTY"] => /dev/pts/0 _SERVER["CONTENT_TYPE"] => _SERVER["mc"] => () { if [ \"$USER\" = \"root\" -a ! \"id | cut -b1-5\" = \"uid=0\" ]; then /usr/bin/mc \"$@\"; else if [ ! \"$USER\" = \"root\" -a \"id | cut -b1-5\" = \"uid=0\" ]; then /usr/bin/mc \"$@\"; else mkdir -p $HOME/.mc/tmp 2>/dev/null; chmod 700 $HOME/.mc/tmp; MC=$HOME/.mc/tmp/mc-$$; /usr/bin/mc -P \"$@\" >\"$MC\"; cd \"cat $MC\"; rm -f \"$MC\"; unset MC; fi; fi } _SERVER["PHP_SELF"] => _SERVER["SCRIPT_NAME"] => _SERVER["DOCUMENT_ROOT"] => _SERVER["argv"] => Array ( ) _SERVER["argc"] => 0 _ENV["PWD"] => /usr/src/php-4.3.0RC1 _ENV["MAKEFLAGS"] => _ENV["MFLAGS"] => _ENV["HOSTNAME"] => www.loveink.com _ENV["REDIRECT_STATUS"] => 1 _ENV["TEST_PHP_EXECUTABLE"] => /usr/src/php-4.3.0RC1/sapi/cli/php _ENV["LS_OPTIONS"] => --color=auto -F -b -T 0 _ENV["QTDIR"] => /usr/lib/qt-3.0.4 _ENV["MANPATH"] => /usr/local/man:/usr/man:/usr/X11R6/man:/usr/lib/qt-3.0.4/doc/man _ENV["LESSOPEN"] => |lesspipe.sh %s _ENV["CC"] => gcc _ENV["T1LIB_CONFIG"] => /usr/share/t1lib/t1lib.config _ENV["KDEDIR"] => /opt/kde _ENV["LESS"] => -M _ENV["LS_COLORS"] => no=00:fi=00:di=01;34:ln=01;36:pi=40;33:so=01;35:bd=40;33;01:cd=40;33;01:or=40;31;01:ex=01;32:*.cmd=01;32:*.exe=01;32:*.com=01;32:*.btm=01;32:*.bat=01;32:*.tar=01;31:*.tgz=01;31:*.arj=01;31:*.taz=01;31:*.lzh=01;31:*.zip=01;31:*.bz2=01;31:*.rpm=01;31:*.deb=01;31:*.z=01;31:*.Z=01;31:*.gz=01;31:*.jpg=01;35:*.gif=01;35:*.bmp=01;35:*.ppm=01;35:*.tga=01;35:*.xbm=01;35:*.xpm=01;35:*.tif=01;35:*.mpg=01;37:*.avi=01;37:*.mov=01;37: _ENV["CPLUS_INCLUDE_PATH"] => /usr/lib/qt-3.0.4/include _ENV["USER"] => root _ENV["SCRIPT_FILENAME"] => /usr/src/php-4.3.0RC1/tests/strings/004.php _ENV["LC_ALL"] => POSIX _ENV["MAIL"] => /var/mail/root _ENV["INPUTRC"] => /etc/inputrc _ENV["PATH_TRANSLATED"] => /usr/src/php-4.3.0RC1/tests/strings/004.php _ENV["QUERY_STRING"] => _ENV["CONTENT_LENGTH"] => _ENV["MAKELEVEL"] => 1 _ENV["SSH_CLIENT"] => 24.114.67.143 1950 22 _ENV["SHLVL"] => 3 _ENV["LOGNAME"] => root _ENV["MINICOM"] => -c on _ENV["_"] => /usr/src/php-4.3.0RC1/sapi/cli/php _ENV["REQUEST_METHOD"] => GET _ENV["SHELL"] => /bin/sh _ENV["TEST_PHP_SRCDIR"] => /usr/src/php-4.3.0RC1 _ENV["TERM"] => xterm _ENV["HOME"] => /root _ENV["PATH"] => /usr/local/sbin:/usr/sbin:/sbin:/usr/local/bin:/usr/bin:/bin:/usr/X11R6/bin:/usr/games:/opt/www/htdig/bin:/opt/kde/bin:/usr/lib/qt-3.0.4/bin _ENV["SSH_TTY"] => /dev/pts/0 _ENV["CONTENT_TYPE"] => _ENV["mc"] => () { if [ \"$USER\" = \"root\" -a ! \"id | cut -b1-5\" = \"uid=0\" ]; then /usr/bin/mc \"$@\"; else if [ ! \"$USER\" = \"root\" -a \"id | cut -b1-5\" = \"uid=0\" ]; then /usr/bin/mc \"$@\"; else mkdir -p $HOME/.mc/tmp 2>/dev/null; chmod 700 $HOME/.mc/tmp; MC=$HOME/.mc/tmp/mc-$$; /usr/bin/mc -P \"$@\" >\"$MC\"; cd \"cat $MC\"; rm -f \"$MC\"; unset MC; fi; fi } PHP License This program is free software; you can redistribute it and/or modify it under the terms of the PHP License as published by the PHP Group and included in the distribution in the file: LICENSE This program is distributed in the hope that it will be useful, but WITHOUT ANY WARRANTY; without even the implied warranty of MERCHANTABILITY or FITNESS FOR A PARTICULAR PURPOSE. If you did not receive a copy of the PHP license, or have any questions about PHP licensing, please contact license@php.net.

« previous php.qa (#6939) next »