Test results

From: Date: Thu, 21 Nov 2002 21:39:57 +0000
Subject: Test results
Groups: php.qa 
Request: Send a blank email to php-qa+get-6942@lists.php.net to get a copy of this message
OS: Linux Automake: automake (GNU automake) 1.7 Written by Tom Tromey <tromey@redhat.com>. Copyright 2002 Free Software Foundation, Inc. This is free software; see the source for copying conditions. There is NO warranty; not even for MERCHANTABILITY or FITNESS FOR A PARTICULAR PURPOSE. Autoconf: autoconf (GNU Autoconf) 2.54 Written by David J. MacKenzie and Akim Demaille. Copyright 2002 Free Software Foundation, Inc. This is free software; see the source for copying conditions. There is NO warranty; not even for MERCHANTABILITY or FITNESS FOR A PARTICULAR PURPOSE. Libtool: ltmain.sh (GNU libtool) 1.4.1 (1.922.2.34 2001/09/03 01:22:13) Compiler: Reading specs from /usr/lib/gcc-lib/i386-slackware-linux/3.2/specs Configured with: ../gcc-3.2/configure --prefix=/usr --enable-shared --enable-threads=posix --enable-__cxa_atexit --disable-checking --with-gnu-ld --verbose --target=i386-slackware-linux --host=i386-slackware-linux Thread model: posix gcc version 3.2 Bison: GNU Bison version 1.28 ===================================================================== FAILED TEST SUMMARY --------------------------------------------------------------------- mb_ereg() compat test 1 [ext/mbstring/tests/mb_ereg-compat-01.phpt] mb_ereg() compat test 2 [ext/mbstring/tests/mb_ereg-compat-02.phpt] mb_ereg() [ext/mbstring/tests/mb_ereg.phpt] mb_ereg_replace() compat test 1 [ext/mbstring/tests/mb_ereg_replace-compat-01.phpt] mb_ereg_replace() compat test 2 [ext/mbstring/tests/mb_ereg_replace-compat-02.phpt] mb_ereg_replace() compat test 3 [ext/mbstring/tests/mb_ereg_replace-compat-03.phpt] mb_ereg_replace() compat test 4 [ext/mbstring/tests/mb_ereg_replace-compat-04.phpt] mb_ereg_replace() compat test 5 [ext/mbstring/tests/mb_ereg_replace-compat-05.phpt] mb_ereg_replace() compat test 6 [ext/mbstring/tests/mb_ereg_replace-compat-06.phpt] mb_ereg_replace() compat test 7 [ext/mbstring/tests/mb_ereg_replace-compat-07.phpt] mb_ereg_replace() compat test 8 [ext/mbstring/tests/mb_ereg_replace-compat-08.phpt] mb_ereg_replace() compat test 9 [ext/mbstring/tests/mb_ereg_replace-compat-09.phpt] mb_ereg_replace() compat test 10 [ext/mbstring/tests/mb_ereg_replace-compat-10.phpt] mb_ereg_replace() compat test 11 [ext/mbstring/tests/mb_ereg_replace-compat-11.phpt] mb_ereg_replace() compat test 12 [ext/mbstring/tests/mb_ereg_replace-compat-12.phpt] mb_ereg_replace() compat test 13 [ext/mbstring/tests/mb_ereg_replace-compat-13.phpt] mb_ereg_replace() [ext/mbstring/tests/mb_ereg_replace.phpt] mb_ereg_search() stuff [ext/mbstring/tests/mb_ereg_search_xxx.phpt] mb_regex_set_options() [ext/mbstring/tests/mb_regex_set_options.phpt] mb_split() compat test 1 [ext/mbstring/tests/mb_split-compat-01.phpt] mb_split() [ext/mbstring/tests/mb_split.phpt] Function overloading test (said to be harmful) [ext/mbstring/tests/overload.phpt] php-users@php.gr.jp #10830 [ext/mbstring/tests/php_gr_jp_10830.phpt] is_*() and file_exists() return values are boolean. [ext/standard/tests/file/003.phpt] Bug #20169 [ext/standard/tests/strings/bug20169.phpt] microtime() function [ext/standard/tests/time/001.phpt] strtotime() function [ext/standard/tests/time/002.phpt] Check for mktime with out-of-range parameters [ext/standard/tests/time/003.phpt] ===================================================================== ================================================================================ /usr/local/src/php-4.3.0RC1/ext/mbstring/tests/mb_ereg-compat-01.phpt ================================================================================ ---- EXPECTED OUTPUT ok ok ---- ACTUAL OUTPUT Fatal error: Call to undefined function: mb_ereg() in /usr/local/src/php-4.3.0RC1/ext/mbstring/tests/mb_ereg-compat-01.php on line 4 /usr/local/src/php-4.3.0RC1/ext/mbstring/tests/mb_ereg-compat-01.php(4) : Fatal error - Call to undefined function: mb_ereg() ---- FAILED ================================================================================ 001- ok 001+ Fatal error: Call to undefined function: mb_ereg() in /usr/local/src/php-4.3.0RC1/ext/mbstring/tests/mb_ereg-compat-01.php on line 4 002- ok 002+ /usr/local/src/php-4.3.0RC1/ext/mbstring/tests/mb_ereg-compat-01.php(4) : Fatal error - Call to undefined function: mb_ereg() ================================================================================ ================================================================================ /usr/local/src/php-4.3.0RC1/ext/mbstring/tests/mb_ereg-compat-02.phpt ================================================================================ ---- EXPECTED OUTPUT 32 This is a nice and simple string is is ---- ACTUAL OUTPUT Fatal error: Call to undefined function: mb_ereg() in /usr/local/src/php-4.3.0RC1/ext/mbstring/tests/mb_ereg-compat-02.php on line 4 /usr/local/src/php-4.3.0RC1/ext/mbstring/tests/mb_ereg-compat-02.php(4) : Fatal error - Call to undefined function: mb_ereg() ---- FAILED ================================================================================ 001- 32 001+ Fatal error: Call to undefined function: mb_ereg() in /usr/local/src/php-4.3.0RC1/ext/mbstring/tests/mb_ereg-compat-02.php on line 4 002- This is a nice and simple string 002+ /usr/local/src/php-4.3.0RC1/ext/mbstring/tests/mb_ereg-compat-02.php(4) : Fatal error - Call to undefined function: mb_ereg() 003- is 004- is ================================================================================ ================================================================================ /usr/local/src/php-4.3.0RC1/ext/mbstring/tests/mb_ereg.phpt ================================================================================ ---- EXPECTED OUTPUT (15)abc def ghi jkl def ghi jkl (27)£á£â£ã ¤¢¤ª¤¤ ¤«¤³¤Ê ¤ï¤ñ¤ó £á£â£ã ¤¢¤ª¤¤ ¤« ¤³¤Ê ¤ï¤ñ¤ó (27)£í£ú£ø£æ£ð ¤¦¤ª¤« ¤­¤« ¤ò¤ð £í£ú£ø£æ£ð ¤¦¤ª¤« ¤­¤« ¤ò¤ð (15)abc def ghi jkl def ghi jkl (27)£á£â£ã ¤¢¤ª¤¤ ¤«¤³¤Ê ¤ï¤ñ¤ó £á£â£ã ¤¢¤ª¤¤ ¤« ¤³¤Ê ¤ï¤ñ¤ó (27)£í£ú£ø£æ£ð ¤¦¤ª¤« ¤­¤« ¤ò¤ð £í£ú£ø£æ£ð ¤¦¤ª¤« ¤­¤« ¤ò¤ð (15)abc def ghi jkl def ghi jkl (27)£á£â£ã ¤¢¤ª¤¤ ¤«¤³¤Ê ¤ï¤ñ¤ó £á£â£ã ¤¢¤ª¤¤ ¤« ¤³¤Ê ¤ï¤ñ¤ó (27)£í£ú£ø£æ£ð ¤¦¤ª¤« ¤­¤« ¤ò¤ð £í£ú£ø£æ£ð ¤¦¤ª¤« ¤­¤« ¤ò¤ð (15)abc def ghi jkl def ghi jkl (39)£á£â£ã ¤¢¤ª¤¤ ¤«¤³¤Ê ¤ï¤ñ¤ó £á£â£ã ¤¢¤ª¤¤ ¤« ¤³¤Ê ¤ï¤ñ¤ó (39)£í£ú£ø£æ£ð ¤¦¤ª¤« ¤­¤« ¤ò¤ð £í£ú£ø£æ£ð ¤¦¤ª¤« ¤­¤« ¤ò¤ð ---- ACTUAL OUTPUT Fatal error: Call to undefined function: mb_regex_set_options() in /usr/local/src/php-4.3.0RC1/ext/mbstring/tests/mb_ereg.php on line 2 /usr/local/src/php-4.3.0RC1/ext/mbstring/tests/mb_ereg.php(2) : Fatal error - Call to undefined function: mb_regex_set_options() ---- FAILED ================================================================================ 001- (15)abc def ghi jkl def ghi jkl 001+ Fatal error: Call to undefined function: mb_regex_set_options() in /usr/local/src/php-4.3.0RC1/ext/mbstring/tests/mb_ereg.php on line 2 002- (27)£á£â£ã ¤¢¤ª¤¤ ¤«¤³¤Ê ¤ï¤ñ¤ó £á£â£ã ¤¢¤ª¤¤ ¤« ¤³¤Ê ¤ï¤ñ¤ó 002+ /usr/local/src/php-4.3.0RC1/ext/mbstring/tests/mb_ereg.php(2) : Fatal error - Call to undefined function: mb_regex_set_options() 003- (27)£í£ú£ø£æ£ð ¤¦¤ª¤« ¤­¤« ¤ò¤ð £í£ú£ø£æ£ð ¤¦¤ª¤« ¤­¤« ¤ò¤ð 004- (15)abc def ghi jkl def ghi jkl 005- (27)£á£â£ã ¤¢¤ª¤¤ ¤«¤³¤Ê ¤ï¤ñ¤ó £á£â£ã ¤¢¤ª¤¤ ¤« ¤³¤Ê ¤ï¤ñ¤ó 006- (27)£í£ú£ø£æ£ð ¤¦¤ª¤« ¤­¤« ¤ò¤ð £í£ú£ø£æ£ð ¤¦¤ª¤« ¤­¤« ¤ò¤ð 007- (15)abc def ghi jkl def ghi jkl 008- (27)£á£â£ã ¤¢¤ª¤¤ ¤«¤³¤Ê ¤ï¤ñ¤ó £á£â£ã ¤¢¤ª¤¤ ¤« ¤³¤Ê ¤ï¤ñ¤ó 009- (27)£í£ú£ø£æ£ð ¤¦¤ª¤« ¤­¤« ¤ò¤ð £í£ú£ø£æ£ð ¤¦¤ª¤« ¤­¤« ¤ò¤ð 010- (15)abc def ghi jkl def ghi jkl 011- (39)£á£â£ã ¤¢¤ª¤¤ ¤«¤³¤Ê ¤ï¤ñ¤ó £á£â£ã ¤¢¤ª¤¤ ¤« ¤³¤Ê ¤ï¤ñ¤ó 012- (39)£í£ú£ø£æ£ð ¤¦¤ª¤« ¤­¤« ¤ò¤ð £í£ú£ø£æ£ð ¤¦¤ª¤« ¤­¤« ¤ò¤ð ================================================================================ ================================================================================ /usr/local/src/php-4.3.0RC1/ext/mbstring/tests/mb_ereg_replace-compat-01.phpt ================================================================================ ---- EXPECTED OUTPUT abcdef ---- ACTUAL OUTPUT Fatal error: Call to undefined function: mb_ereg_replace() in /usr/local/src/php-4.3.0RC1/ext/mbstring/tests/mb_ereg_replace-compat-01.php on line 4 /usr/local/src/php-4.3.0RC1/ext/mbstring/tests/mb_ereg_replace-compat-01.php(4) : Fatal error - Call to undefined function: mb_ereg_replace() ---- FAILED ================================================================================ 001- abcdef 001+ Fatal error: Call to undefined function: mb_ereg_replace() in /usr/local/src/php-4.3.0RC1/ext/mbstring/tests/mb_ereg_replace-compat-01.php on line 4 002+ /usr/local/src/php-4.3.0RC1/ext/mbstring/tests/mb_ereg_replace-compat-01.php(4) : Fatal error - Call to undefined function: mb_ereg_replace() ================================================================================ ================================================================================ /usr/local/src/php-4.3.0RC1/ext/mbstring/tests/mb_ereg_replace-compat-02.phpt ================================================================================ ---- EXPECTED OUTPUT abc ---- ACTUAL OUTPUT Fatal error: Call to undefined function: mb_ereg_replace() in /usr/local/src/php-4.3.0RC1/ext/mbstring/tests/mb_ereg_replace-compat-02.php on line 4 /usr/local/src/php-4.3.0RC1/ext/mbstring/tests/mb_ereg_replace-compat-02.php(4) : Fatal error - Call to undefined function: mb_ereg_replace() ---- FAILED ================================================================================ 001- abc 001+ Fatal error: Call to undefined function: mb_ereg_replace() in /usr/local/src/php-4.3.0RC1/ext/mbstring/tests/mb_ereg_replace-compat-02.php on line 4 002+ /usr/local/src/php-4.3.0RC1/ext/mbstring/tests/mb_ereg_replace-compat-02.php(4) : Fatal error - Call to undefined function: mb_ereg_replace() ================================================================================ ================================================================================ /usr/local/src/php-4.3.0RC1/ext/mbstring/tests/mb_ereg_replace-compat-03.phpt ================================================================================ ---- EXPECTED OUTPUT 'test ---- ACTUAL OUTPUT Fatal error: Call to undefined function: mb_ereg_replace() in /usr/local/src/php-4.3.0RC1/ext/mbstring/tests/mb_ereg_replace-compat-03.php on line 4 /usr/local/src/php-4.3.0RC1/ext/mbstring/tests/mb_ereg_replace-compat-03.php(4) : Fatal error - Call to undefined function: mb_ereg_replace() ---- FAILED ================================================================================ 001- 'test 001+ Fatal error: Call to undefined function: mb_ereg_replace() in /usr/local/src/php-4.3.0RC1/ext/mbstring/tests/mb_ereg_replace-compat-03.php on line 4 002+ /usr/local/src/php-4.3.0RC1/ext/mbstring/tests/mb_ereg_replace-compat-03.php(4) : Fatal error - Call to undefined function: mb_ereg_replace() ================================================================================ ================================================================================ /usr/local/src/php-4.3.0RC1/ext/mbstring/tests/mb_ereg_replace-compat-04.phpt ================================================================================ ---- EXPECTED OUTPUT That is a nice and simple string ---- ACTUAL OUTPUT Fatal error: Call to undefined function: mb_ereg_replace() in /usr/local/src/php-4.3.0RC1/ext/mbstring/tests/mb_ereg_replace-compat-04.php on line 4 /usr/local/src/php-4.3.0RC1/ext/mbstring/tests/mb_ereg_replace-compat-04.php(4) : Fatal error - Call to undefined function: mb_ereg_replace() ---- FAILED ================================================================================ 001- That is a nice and simple string 001+ Fatal error: Call to undefined function: mb_ereg_replace() in /usr/local/src/php-4.3.0RC1/ext/mbstring/tests/mb_ereg_replace-compat-04.php on line 4 002+ /usr/local/src/php-4.3.0RC1/ext/mbstring/tests/mb_ereg_replace-compat-04.php(4) : Fatal error - Call to undefined function: mb_ereg_replace() ================================================================================ ================================================================================ /usr/local/src/php-4.3.0RC1/ext/mbstring/tests/mb_ereg_replace-compat-05.phpt ================================================================================ ---- EXPECTED OUTPUT strlen($b)=0 ---- ACTUAL OUTPUT Fatal error: Call to undefined function: mb_ereg_replace() in /usr/local/src/php-4.3.0RC1/ext/mbstring/tests/mb_ereg_replace-compat-05.php on line 4 /usr/local/src/php-4.3.0RC1/ext/mbstring/tests/mb_ereg_replace-compat-05.php(4) : Fatal error - Call to undefined function: mb_ereg_replace() ---- FAILED ================================================================================ 001- strlen($b)=0 001+ Fatal error: Call to undefined function: mb_ereg_replace() in /usr/local/src/php-4.3.0RC1/ext/mbstring/tests/mb_ereg_replace-compat-05.php on line 4 002+ /usr/local/src/php-4.3.0RC1/ext/mbstring/tests/mb_ereg_replace-compat-05.php(4) : Fatal error - Call to undefined function: mb_ereg_replace() ================================================================================ ================================================================================ /usr/local/src/php-4.3.0RC1/ext/mbstring/tests/mb_ereg_replace-compat-06.phpt ================================================================================ ---- EXPECTED OUTPUT 123 abc +-|= ---- ACTUAL OUTPUT Fatal error: Call to undefined function: mb_ereg_replace() in /usr/local/src/php-4.3.0RC1/ext/mbstring/tests/mb_ereg_replace-compat-06.php on line 3 /usr/local/src/php-4.3.0RC1/ext/mbstring/tests/mb_ereg_replace-compat-06.php(3) : Fatal error - Call to undefined function: mb_ereg_replace() ---- FAILED ================================================================================ 001- 123 abc +-|= 001+ Fatal error: Call to undefined function: mb_ereg_replace() in /usr/local/src/php-4.3.0RC1/ext/mbstring/tests/mb_ereg_replace-compat-06.php on line 3 002+ /usr/local/src/php-4.3.0RC1/ext/mbstring/tests/mb_ereg_replace-compat-06.php(3) : Fatal error - Call to undefined function: mb_ereg_replace() ================================================================================ ================================================================================ /usr/local/src/php-4.3.0RC1/ext/mbstring/tests/mb_ereg_replace-compat-07.phpt ================================================================================ ---- EXPECTED OUTPUT abc2222222222def2222222222 ---- ACTUAL OUTPUT Fatal error: Call to undefined function: mb_ereg_replace() in /usr/local/src/php-4.3.0RC1/ext/mbstring/tests/mb_ereg_replace-compat-07.php on line 4 /usr/local/src/php-4.3.0RC1/ext/mbstring/tests/mb_ereg_replace-compat-07.php(4) : Fatal error - Call to undefined function: mb_ereg_replace() ---- FAILED ================================================================================ 001- abc2222222222def2222222222 001+ Fatal error: Call to undefined function: mb_ereg_replace() in /usr/local/src/php-4.3.0RC1/ext/mbstring/tests/mb_ereg_replace-compat-07.php on line 4 002+ /usr/local/src/php-4.3.0RC1/ext/mbstring/tests/mb_ereg_replace-compat-07.php(4) : Fatal error - Call to undefined function: mb_ereg_replace() ================================================================================ ================================================================================ /usr/local/src/php-4.3.0RC1/ext/mbstring/tests/mb_ereg_replace-compat-08.phpt ================================================================================ ---- EXPECTED OUTPUT abcdef123ghi ---- ACTUAL OUTPUT Fatal error: Call to undefined function: mb_ereg_replace() in /usr/local/src/php-4.3.0RC1/ext/mbstring/tests/mb_ereg_replace-compat-08.php on line 4 /usr/local/src/php-4.3.0RC1/ext/mbstring/tests/mb_ereg_replace-compat-08.php(4) : Fatal error - Call to undefined function: mb_ereg_replace() ---- FAILED ================================================================================ 001- abcdef123ghi 001+ Fatal error: Call to undefined function: mb_ereg_replace() in /usr/local/src/php-4.3.0RC1/ext/mbstring/tests/mb_ereg_replace-compat-08.php on line 4 002+ /usr/local/src/php-4.3.0RC1/ext/mbstring/tests/mb_ereg_replace-compat-08.php(4) : Fatal error - Call to undefined function: mb_ereg_replace() ================================================================================ ================================================================================ /usr/local/src/php-4.3.0RC1/ext/mbstring/tests/mb_ereg_replace-compat-09.phpt ================================================================================ ---- EXPECTED OUTPUT abcdef\1ghi ---- ACTUAL OUTPUT Fatal error: Call to undefined function: mb_ereg_replace() in /usr/local/src/php-4.3.0RC1/ext/mbstring/tests/mb_ereg_replace-compat-09.php on line 4 /usr/local/src/php-4.3.0RC1/ext/mbstring/tests/mb_ereg_replace-compat-09.php(4) : Fatal error - Call to undefined function: mb_ereg_replace() ---- FAILED ================================================================================ 001- abcdef\1ghi 001+ Fatal error: Call to undefined function: mb_ereg_replace() in /usr/local/src/php-4.3.0RC1/ext/mbstring/tests/mb_ereg_replace-compat-09.php on line 4 002+ /usr/local/src/php-4.3.0RC1/ext/mbstring/tests/mb_ereg_replace-compat-09.php(4) : Fatal error - Call to undefined function: mb_ereg_replace() ================================================================================ ================================================================================ /usr/local/src/php-4.3.0RC1/ext/mbstring/tests/mb_ereg_replace-compat-10.phpt ================================================================================ ---- EXPECTED OUTPUT abcdef\g\\hi\ ---- ACTUAL OUTPUT Fatal error: Call to undefined function: mb_ereg_replace() in /usr/local/src/php-4.3.0RC1/ext/mbstring/tests/mb_ereg_replace-compat-10.php on line 4 /usr/local/src/php-4.3.0RC1/ext/mbstring/tests/mb_ereg_replace-compat-10.php(4) : Fatal error - Call to undefined function: mb_ereg_replace() ---- FAILED ================================================================================ 001- abcdef\g\\hi\ 001+ Fatal error: Call to undefined function: mb_ereg_replace() in /usr/local/src/php-4.3.0RC1/ext/mbstring/tests/mb_ereg_replace-compat-10.php on line 4 002+ /usr/local/src/php-4.3.0RC1/ext/mbstring/tests/mb_ereg_replace-compat-10.php(4) : Fatal error - Call to undefined function: mb_ereg_replace() ================================================================================ ================================================================================ /usr/local/src/php-4.3.0RC1/ext/mbstring/tests/mb_ereg_replace-compat-11.phpt ================================================================================ ---- EXPECTED OUTPUT \2 ---- ACTUAL OUTPUT Fatal error: Call to undefined function: mb_ereg_replace() in /usr/local/src/php-4.3.0RC1/ext/mbstring/tests/mb_ereg_replace-compat-11.php on line 4 /usr/local/src/php-4.3.0RC1/ext/mbstring/tests/mb_ereg_replace-compat-11.php(4) : Fatal error - Call to undefined function: mb_ereg_replace() ---- FAILED ================================================================================ 001- \2 001+ Fatal error: Call to undefined function: mb_ereg_replace() in /usr/local/src/php-4.3.0RC1/ext/mbstring/tests/mb_ereg_replace-compat-11.php on line 4 002+ /usr/local/src/php-4.3.0RC1/ext/mbstring/tests/mb_ereg_replace-compat-11.php(4) : Fatal error - Call to undefined function: mb_ereg_replace() ================================================================================ ================================================================================ /usr/local/src/php-4.3.0RC1/ext/mbstring/tests/mb_ereg_replace-compat-12.phpt ================================================================================ ---- EXPECTED OUTPUT zabc123 ---- ACTUAL OUTPUT Fatal error: Call to undefined function: mb_ereg_replace() in /usr/local/src/php-4.3.0RC1/ext/mbstring/tests/mb_ereg_replace-compat-12.php on line 3 /usr/local/src/php-4.3.0RC1/ext/mbstring/tests/mb_ereg_replace-compat-12.php(3) : Fatal error - Call to undefined function: mb_ereg_replace() ---- FAILED ================================================================================ 001- zabc123 001+ Fatal error: Call to undefined function: mb_ereg_replace() in /usr/local/src/php-4.3.0RC1/ext/mbstring/tests/mb_ereg_replace-compat-12.php on line 3 002+ /usr/local/src/php-4.3.0RC1/ext/mbstring/tests/mb_ereg_replace-compat-12.php(3) : Fatal error - Call to undefined function: mb_ereg_replace() ================================================================================ ================================================================================ /usr/local/src/php-4.3.0RC1/ext/mbstring/tests/mb_ereg_replace-compat-13.phpt ================================================================================ ---- EXPECTED OUTPUT abc123abc ---- ACTUAL OUTPUT Fatal error: Call to undefined function: mb_ereg_replace() in /usr/local/src/php-4.3.0RC1/ext/mbstring/tests/mb_ereg_replace-compat-13.php on line 3 /usr/local/src/php-4.3.0RC1/ext/mbstring/tests/mb_ereg_replace-compat-13.php(3) : Fatal error - Call to undefined function: mb_ereg_replace() ---- FAILED ================================================================================ 001- abc123abc 001+ Fatal error: Call to undefined function: mb_ereg_replace() in /usr/local/src/php-4.3.0RC1/ext/mbstring/tests/mb_ereg_replace-compat-13.php on line 3 002+ /usr/local/src/php-4.3.0RC1/ext/mbstring/tests/mb_ereg_replace-compat-13.php(3) : Fatal error - Call to undefined function: mb_ereg_replace() ================================================================================ ================================================================================ /usr/local/src/php-4.3.0RC1/ext/mbstring/tests/mb_ereg_replace.phpt ================================================================================ ---- EXPECTED OUTPUT a-b-c-d-e [abc] [def] [ghi] ---- ACTUAL OUTPUT Fatal error: Call to undefined function: mb_regex_set_options() in /usr/local/src/php-4.3.0RC1/ext/mbstring/tests/mb_ereg_replace.php on line 2 /usr/local/src/php-4.3.0RC1/ext/mbstring/tests/mb_ereg_replace.php(2) : Fatal error - Call to undefined function: mb_regex_set_options() ---- FAILED ================================================================================ 001- a-b-c-d-e 001+ Fatal error: Call to undefined function: mb_regex_set_options() in /usr/local/src/php-4.3.0RC1/ext/mbstring/tests/mb_ereg_replace.php on line 2 002- [abc] [def] [ghi] 002+ /usr/local/src/php-4.3.0RC1/ext/mbstring/tests/mb_ereg_replace.php(2) : Fatal error - Call to undefined function: mb_regex_set_options() ================================================================================ ================================================================================ /usr/local/src/php-4.3.0RC1/ext/mbstring/tests/mb_ereg_search_xxx.phpt ================================================================================ ---- EXPECTED OUTPUT (EUC-JP) (10) ¡¦¢Ï (EUC-JP) (5) abcde (EUC-JP) (14) abdeabcf (EUC-JP) (22) abc (EUC-JP) (31) abcd (EUC-JP) (5) ¢Ï¡¦ (EUC-JP) (10) ¡¦¢Ï (EUC-JP) (5) abcde (EUC-JP) (14) abdeabcf (EUC-JP) (22) abc (EUC-JP) (31) abcd (Shift_JIS) (10) ¡¦¢Ï (Shift_JIS) (5) abcde (Shift_JIS) (14) abdeabcf (Shift_JIS) (22) abc (Shift_JIS) (31) abcd (Shift_JIS) (5) ¢Ï¡¦ (Shift_JIS) (10) ¡¦¢Ï (Shift_JIS) (5) abcde (Shift_JIS) (14) abdeabcf (Shift_JIS) (22) abc (Shift_JIS) (31) abcd (SJIS) (10) ¡¦¢Ï (SJIS) (5) abcde (SJIS) (14) abdeabcf (SJIS) (22) abc (SJIS) (31) abcd (SJIS) (5) ¢Ï¡¦ (SJIS) (10) ¡¦¢Ï (SJIS) (5) abcde (SJIS) (14) abdeabcf (SJIS) (22) abc (SJIS) (31) abcd (UTF-8) (14) ¡¦¢Ï (UTF-8) (5) abcde (UTF-8) (14) abdeabcf (UTF-8) (22) abc (UTF-8) (31) abcd (UTF-8) (7) ¢Ï¡¦ (UTF-8) (14) ¡¦¢Ï (UTF-8) (5) abcde (UTF-8) (14) abdeabcf (UTF-8) (22) abc (UTF-8) (31) abcd ---- ACTUAL OUTPUT Fatal error: Call to undefined function: mb_regex_set_options() in /usr/local/src/php-4.3.0RC1/ext/mbstring/tests/mb_ereg_search_xxx.php on line 2 /usr/local/src/php-4.3.0RC1/ext/mbstring/tests/mb_ereg_search_xxx.php(2) : Fatal error - Call to undefined function: mb_regex_set_options() ---- FAILED ================================================================================ 001- (EUC-JP) (10) ¡¦¢Ï 001+ Fatal error: Call to undefined function: mb_regex_set_options() in /usr/local/src/php-4.3.0RC1/ext/mbstring/tests/mb_ereg_search_xxx.php on line 2 002- (EUC-JP) (5) abcde 002+ /usr/local/src/php-4.3.0RC1/ext/mbstring/tests/mb_ereg_search_xxx.php(2) : Fatal error - Call to undefined function: mb_regex_set_options() 003- (EUC-JP) (14) abdeabcf 004- (EUC-JP) (22) abc 005- (EUC-JP) (31) abcd 006- (EUC-JP) (5) ¢Ï¡¦ 007- (EUC-JP) (10) ¡¦¢Ï 008- (EUC-JP) (5) abcde 009- (EUC-JP) (14) abdeabcf 010- (EUC-JP) (22) abc 011- (EUC-JP) (31) abcd 012- (Shift_JIS) (10) ¡¦¢Ï 013- (Shift_JIS) (5) abcde 014- (Shift_JIS) (14) abdeabcf 015- (Shift_JIS) (22) abc 016- (Shift_JIS) (31) abcd 017- (Shift_JIS) (5) ¢Ï¡¦ 018- (Shift_JIS) (10) ¡¦¢Ï 019- (Shift_JIS) (5) abcde 020- (Shift_JIS) (14) abdeabcf 021- (Shift_JIS) (22) abc 022- (Shift_JIS) (31) abcd 023- (SJIS) (10) ¡¦¢Ï 024- (SJIS) (5) abcde 025- (SJIS) (14) abdeabcf 026- (SJIS) (22) abc 027- (SJIS) (31) abcd 028- (SJIS) (5) ¢Ï¡¦ 029- (SJIS) (10) ¡¦¢Ï 030- (SJIS) (5) abcde 031- (SJIS) (14) abdeabcf 032- (SJIS) (22) abc 033- (SJIS) (31) abcd 034- (UTF-8) (14) ¡¦¢Ï 035- (UTF-8) (5) abcde 036- (UTF-8) (14) abdeabcf 037- (UTF-8) (22) abc 038- (UTF-8) (31) abcd 039- (UTF-8) (7) ¢Ï¡¦ 040- (UTF-8) (14) ¡¦¢Ï 041- (UTF-8) (5) abcde 042- (UTF-8) (14) abdeabcf 043- (UTF-8) (22) abc 044- (UTF-8) (31) abcd ================================================================================ ================================================================================ /usr/local/src/php-4.3.0RC1/ext/mbstring/tests/mb_regex_set_options.phpt ================================================================================ ---- EXPECTED OUTPUT + + + + +-++++ ---- ACTUAL OUTPUT Fatal error: Call to undefined function: mb_regex_set_options() in /usr/local/src/php-4.3.0RC1/ext/mbstring/tests/mb_regex_set_options.php on line 2 /usr/local/src/php-4.3.0RC1/ext/mbstring/tests/mb_regex_set_options.php(2) : Fatal error - Call to undefined function: mb_regex_set_options() ---- FAILED ================================================================================ 001- + + + + +-++++ 001+ Fatal error: Call to undefined function: mb_regex_set_options() in /usr/local/src/php-4.3.0RC1/ext/mbstring/tests/mb_regex_set_options.php on line 2 002+ /usr/local/src/php-4.3.0RC1/ext/mbstring/tests/mb_regex_set_options.php(2) : Fatal error - Call to undefined function: mb_regex_set_options() ================================================================================ ================================================================================ /usr/local/src/php-4.3.0RC1/ext/mbstring/tests/mb_split-compat-01.phpt ================================================================================ ---- EXPECTED OUTPUT 4 this is a test ---- ACTUAL OUTPUT Fatal error: Call to undefined function: mb_split() in /usr/local/src/php-4.3.0RC1/ext/mbstring/tests/mb_split-compat-01.php on line 3 /usr/local/src/php-4.3.0RC1/ext/mbstring/tests/mb_split-compat-01.php(3) : Fatal error - Call to undefined function: mb_split() ---- FAILED ================================================================================ 001- 4 001+ Fatal error: Call to undefined function: mb_split() in /usr/local/src/php-4.3.0RC1/ext/mbstring/tests/mb_split-compat-01.php on line 3 002- this 002+ /usr/local/src/php-4.3.0RC1/ext/mbstring/tests/mb_split-compat-01.php(3) : Fatal error - Call to undefined function: mb_split() 003- is 004- a 005- test ================================================================================ ================================================================================ /usr/local/src/php-4.3.0RC1/ext/mbstring/tests/mb_split.phpt ================================================================================ ---- EXPECTED OUTPUT bool(true) ok ok ok ok ok ok 2-2 3-3 4-4 ---- ACTUAL OUTPUT Fatal error: Call to undefined function: mb_regex_set_options() in /usr/local/src/php-4.3.0RC1/ext/mbstring/tests/mb_split.php on line 2 /usr/local/src/php-4.3.0RC1/ext/mbstring/tests/mb_split.php(2) : Fatal error - Call to undefined function: mb_regex_set_options() ---- FAILED ================================================================================ 001- bool(true) 001+ Fatal error: Call to undefined function: mb_regex_set_options() in /usr/local/src/php-4.3.0RC1/ext/mbstring/tests/mb_split.php on line 2 002- ok 002+ /usr/local/src/php-4.3.0RC1/ext/mbstring/tests/mb_split.php(2) : Fatal error - Call to undefined function: mb_regex_set_options() 003- ok 004- ok 005- ok 006- ok 007- ok 008- 2-2 009- 3-3 010- 4-4 ================================================================================ ================================================================================ /usr/local/src/php-4.3.0RC1/ext/mbstring/tests/overload.phpt ================================================================================ ---- EXPECTED OUTPUT EUC-JP int(33) int(33) int(10) int(8) int(3) int(29) ---- ACTUAL OUTPUT EUC-JP int(33) int(33) Fatal error: Call to undefined function: mb_regex_encoding() in /usr/local/src/php-4.3.0RC1/ext/mbstring/tests/overload.php on line 10 /usr/local/src/php-4.3.0RC1/ext/mbstring/tests/overload.php(10) : Fatal error - Call to undefined function: mb_regex_encoding() ---- FAILED ================================================================================ 004- int(10) 004+ 005- int(8) 005+ Fatal error: Call to undefined function: mb_regex_encoding() in /usr/local/src/php-4.3.0RC1/ext/mbstring/tests/overload.php on line 10 006- int(3) 006+ /usr/local/src/php-4.3.0RC1/ext/mbstring/tests/overload.php(10) : Fatal error - Call to undefined function: mb_regex_encoding() 007- int(29) ================================================================================ ================================================================================ /usr/local/src/php-4.3.0RC1/ext/mbstring/tests/php_gr_jp_10830.phpt ================================================================================ ---- EXPECTED OUTPUT bool(false) bool(false) ---- ACTUAL OUTPUT Fatal error: Call to undefined function: mb_ereg() in /usr/local/src/php-4.3.0RC1/ext/mbstring/tests/php_gr_jp_10830.php on line 4 /usr/local/src/php-4.3.0RC1/ext/mbstring/tests/php_gr_jp_10830.php(4) : Fatal error - Call to undefined function: mb_ereg() ---- FAILED ================================================================================ 001- bool(false) 001+ Fatal error: Call to undefined function: mb_ereg() in /usr/local/src/php-4.3.0RC1/ext/mbstring/tests/php_gr_jp_10830.php on line 4 002- bool(false) 002+ /usr/local/src/php-4.3.0RC1/ext/mbstring/tests/php_gr_jp_10830.php(4) : Fatal error - Call to undefined function: mb_ereg() ================================================================================ ================================================================================ /usr/local/src/php-4.3.0RC1/ext/standard/tests/file/003.phpt ================================================================================ ---- EXPECTED OUTPUT boolean boolean boolean boolean boolean boolean boolean boolean boolean boolean ---- ACTUAL OUTPUT Warning: is_writable() [/phpmanual/function.is-writable.html]: Unable to access in /usr/local/src/php-4.3.0RC1/ext/standard/tests/file/003.php on line 14 /usr/local/src/php-4.3.0RC1/ext/standard/tests/file/003.php(14) : Warning - is_writable() [/phpmanual/function.is-writable.html]: Unable to access boolean Warning: is_readable() [/phpmanual/function.is-readable.html]: Unable to access in /usr/local/src/php-4.3.0RC1/ext/standard/tests/file/003.php on line 14 /usr/local/src/php-4.3.0RC1/ext/standard/tests/file/003.php(14) : Warning - is_readable() [/phpmanual/function.is-readable.html]: Unable to access boolean Warning: is_executable() [/phpmanual/function.is-executable.html]: Unable to access in /usr/local/src/php-4.3.0RC1/ext/standard/tests/file/003.php on line 14 /usr/local/src/php-4.3.0RC1/ext/standard/tests/file/003.php(14) : Warning - is_executable() [/phpmanual/function.is-executable.html]: Unable to access boolean Warning: is_file() [/phpmanual/function.is-file.html]: Unable to access in /usr/local/src/php-4.3.0RC1/ext/standard/tests/file/003.php on line 14 /usr/local/src/php-4.3.0RC1/ext/standard/tests/file/003.php(14) : Warning - is_file() [/phpmanual/function.is-file.html]: Unable to access boolean Warning: file_exists() [/phpmanual/function.file-exists.html]: Unable to access in /usr/local/src/php-4.3.0RC1/ext/standard/tests/file/003.php on line 14 /usr/local/src/php-4.3.0RC1/ext/standard/tests/file/003.php(14) : Warning - file_exists() [/phpmanual/function.file-exists.html]: Unable to access boolean boolean boolean boolean boolean boolean ---- FAILED ================================================================================ 001- boolean 001+ Warning: is_writable() [/phpmanual/function.is-writable.html]: Unable to access in /usr/local/src/php-4.3.0RC1/ext/standard/tests/file/003.php on line 14 002- boolean 002+ /usr/local/src/php-4.3.0RC1/ext/standard/tests/file/003.php(14) : Warning - is_writable() [/phpmanual/function.is-writable.html]: Unable to access 004- boolean 004+ 005- boolean 005+ Warning: is_readable() [/phpmanual/function.is-readable.html]: Unable to access in /usr/local/src/php-4.3.0RC1/ext/standard/tests/file/003.php on line 14 006- boolean 006+ /usr/local/src/php-4.3.0RC1/ext/standard/tests/file/003.php(14) : Warning - is_readable() [/phpmanual/function.is-readable.html]: Unable to access 008- boolean 008+ 009- boolean 009+ Warning: is_executable() [/phpmanual/function.is-executable.html]: Unable to access in /usr/local/src/php-4.3.0RC1/ext/standard/tests/file/003.php on line 14 010- boolean 010+ /usr/local/src/php-4.3.0RC1/ext/standard/tests/file/003.php(14) : Warning - is_executable() [/phpmanual/function.is-executable.html]: Unable to access 011+ boolean 012+ 013+ Warning: is_file() [/phpmanual/function.is-file.html]: Unable to access in /usr/local/src/php-4.3.0RC1/ext/standard/tests/file/003.php on line 14 014+ /usr/local/src/php-4.3.0RC1/ext/standard/tests/file/003.php(14) : Warning - is_file() [/phpmanual/function.is-file.html]: Unable to access 015+ boolean 016+ 017+ Warning: file_exists() [/phpmanual/function.file-exists.html]: Unable to access in /usr/local/src/php-4.3.0RC1/ext/standard/tests/file/003.php on line 14 018+ /usr/local/src/php-4.3.0RC1/ext/standard/tests/file/003.php(14) : Warning - file_exists() [/phpmanual/function.file-exists.html]: Unable to access 019+ boolean 020+ boolean 021+ boolean 022+ boolean 023+ boolean 024+ boolean ================================================================================ ================================================================================ /usr/local/src/php-4.3.0RC1/ext/standard/tests/strings/bug20169.phpt ================================================================================ ---- EXPECTED OUTPUT delimiter: | delimiter: | ---- ACTUAL OUTPUT Warning: Cannot set time limit in safe mode in /usr/local/src/php-4.3.0RC1/ext/standard/tests/strings/bug20169.php on line 2 /usr/local/src/php-4.3.0RC1/ext/standard/tests/strings/bug20169.php(2) : Warning - Cannot set time limit in safe mode delimiter: | delimiter: | ---- FAILED ================================================================================ 001- delimiter: | 001+ Warning: Cannot set time limit in safe mode in /usr/local/src/php-4.3.0RC1/ext/standard/tests/strings/bug20169.php on line 2 002- delimiter: | 002+ /usr/local/src/php-4.3.0RC1/ext/standard/tests/strings/bug20169.php(2) : Warning - Cannot set time limit in safe mode 003+ delimiter: | 004+ delimiter: | ================================================================================ ================================================================================ /usr/local/src/php-4.3.0RC1/ext/standard/tests/time/001.phpt ================================================================================ ---- EXPECTED OUTPUT Passed: 100000 Failed: 0 ---- ACTUAL OUTPUT Warning: Cannot set time limit in safe mode in /usr/local/src/php-4.3.0RC1/ext/standard/tests/time/001.php on line 8 /usr/local/src/php-4.3.0RC1/ext/standard/tests/time/001.php(8) : Warning - Cannot set time limit in safe mode Passed: 100000 Failed: 0 ---- FAILED ================================================================================ 001- Passed: 100000 001+ Warning: Cannot set time limit in safe mode in /usr/local/src/php-4.3.0RC1/ext/standard/tests/time/001.php on line 8 002- Failed: 0 002+ /usr/local/src/php-4.3.0RC1/ext/standard/tests/time/001.php(8) : Warning - Cannot set time limit in safe mode 003+ Passed: 100000 004+ Failed: 0 ================================================================================ ================================================================================ /usr/local/src/php-4.3.0RC1/ext/standard/tests/time/002.phpt ================================================================================ ---- EXPECTED OUTPUT 1999-10-13 00:00:00 1999-10-13 00:00:00 2000-01-19 00:00:00 2000-01-19 00:00:00 2001-12-21 00:00:00 2001-12-21 00:00:00 2001-12-21 12:16:00 2001-12-21 12:16:00 1969-12-31 23:59:59 2001-10-22 21:19:58 2001-10-22 23:19:58 2001-10-22 23:32:58 2001-10-22 19:19:58 2001-10-22 19:06:58 1999-10-13 00:00:00 1999-10-13 00:00:00 2000-01-19 00:00:00 2000-01-19 00:00:00 2001-12-21 00:00:00 2001-12-21 00:00:00 2001-12-21 12:16:00 2001-12-21 12:16:00 1970-01-01 00:59:59 2001-10-22 21:19:58 2001-10-23 01:19:58 2001-10-23 01:32:58 2001-10-22 21:19:58 2001-10-22 21:06:58 ---- ACTUAL OUTPUT Warning: putenv() [/phpmanual/function.putenv.html]: Safe Mode warning: Cannot set environment variable 'TZ' - it's not in the allowed list in /usr/local/src/php-4.3.0RC1/ext/standard/tests/time/002.php on line 19 /usr/local/src/php-4.3.0RC1/ext/standard/tests/time/002.php(19) : Warning - putenv() [/phpmanual/function.putenv.html]: Safe Mode warning: Cannot set environment variable 'TZ' - it's not in the allowed list 1999-10-13 00:00:00 1999-10-13 00:00:00 2000-01-19 00:00:00 2000-01-19 00:00:00 2001-12-21 00:00:00 2001-12-21 00:00:00 2001-12-21 12:16:00 2001-12-21 12:16:00 1969-12-31 17:59:59 2001-10-22 21:19:58 2001-10-22 18:19:58 2001-10-22 18:32:58 2001-10-22 14:19:58 2001-10-22 14:06:58 Warning: putenv() [/phpmanual/function.putenv.html]: Safe Mode warning: Cannot set environment variable 'TZ' - it's not in the allowed list in /usr/local/src/php-4.3.0RC1/ext/standard/tests/time/002.php on line 24 /usr/local/src/php-4.3.0RC1/ext/standard/tests/time/002.php(24) : Warning - putenv() [/phpmanual/function.putenv.html]: Safe Mode warning: Cannot set environment variable 'TZ' - it's not in the allowed list 1999-10-13 00:00:00 1999-10-13 00:00:00 2000-01-19 00:00:00 2000-01-19 00:00:00 2001-12-21 00:00:00 2001-12-21 00:00:00 2001-12-21 12:16:00 2001-12-21 12:16:00 1969-12-31 17:59:59 2001-10-22 21:19:58 2001-10-22 18:19:58 2001-10-22 18:32:58 2001-10-22 14:19:58 2001-10-22 14:06:58 ---- FAILED ================================================================================ 001- 1999-10-13 00:00:00 001+ Warning: putenv() [/phpmanual/function.putenv.html]: Safe Mode warning: Cannot set environment variable 'TZ' - it's not in the allowed list in /usr/local/src/php-4.3.0RC1/ext/standard/tests/time/002.php on line 19 002- 1999-10-13 00:00:00 002+ /usr/local/src/php-4.3.0RC1/ext/standard/tests/time/002.php(19) : Warning - putenv() [/phpmanual/function.putenv.html]: Safe Mode warning: Cannot set environment variable 'TZ' - it's not in the allowed list 003- 2000-01-19 00:00:00 003+ 1999-10-13 00:00:00 004- 2000-01-19 00:00:00 004+ 1999-10-13 00:00:00 005- 2001-12-21 00:00:00 005+ 2000-01-19 00:00:00 006- 2001-12-21 00:00:00 006+ 2000-01-19 00:00:00 007- 2001-12-21 12:16:00 007+ 2001-12-21 00:00:00 008- 2001-12-21 12:16:00 008+ 2001-12-21 00:00:00 009- 1969-12-31 23:59:59 009+ 2001-12-21 12:16:00 010- 2001-10-22 21:19:58 010+ 2001-12-21 12:16:00 011- 2001-10-22 23:19:58 011+ 1969-12-31 17:59:59 012- 2001-10-22 23:32:58 012+ 2001-10-22 21:19:58 013- 2001-10-22 19:19:58 013+ 2001-10-22 18:19:58 014- 2001-10-22 19:06:58 014+ 2001-10-22 18:32:58 015- 1999-10-13 00:00:00 015+ 2001-10-22 14:19:58 016- 1999-10-13 00:00:00 016+ 2001-10-22 14:06:58 017- 2000-01-19 00:00:00 017+ 018- 2000-01-19 00:00:00 018+ Warning: putenv() [/phpmanual/function.putenv.html]: Safe Mode warning: Cannot set environment variable 'TZ' - it's not in the allowed list in /usr/local/src/php-4.3.0RC1/ext/standard/tests/time/002.php on line 24 019- 2001-12-21 00:00:00 019+ /usr/local/src/php-4.3.0RC1/ext/standard/tests/time/002.php(24) : Warning - putenv() [/phpmanual/function.putenv.html]: Safe Mode warning: Cannot set environment variable 'TZ' - it's not in the allowed list 020- 2001-12-21 00:00:00 020+ 1999-10-13 00:00:00 021- 2001-12-21 12:16:00 021+ 1999-10-13 00:00:00 022- 2001-12-21 12:16:00 022+ 2000-01-19 00:00:00 023- 1970-01-01 00:59:59 023+ 2000-01-19 00:00:00 024- 2001-10-22 21:19:58 024+ 2001-12-21 00:00:00 025- 2001-10-23 01:19:58 025+ 2001-12-21 00:00:00 026- 2001-10-23 01:32:58 026+ 2001-12-21 12:16:00 027- 2001-10-22 21:19:58 027+ 2001-12-21 12:16:00 028- 2001-10-22 21:06:58 028+ 1969-12-31 17:59:59 029+ 2001-10-22 21:19:58 030+ 2001-10-22 18:19:58 031+ 2001-10-22 18:32:58 032+ 2001-10-22 14:19:58 033+ 2001-10-22 14:06:58 ================================================================================ ================================================================================ /usr/local/src/php-4.3.0RC1/ext/standard/tests/time/003.phpt ================================================================================ ---- EXPECTED OUTPUT 2000-02-29 2000-02-28 2000-02-29 2001-02-28 2001-03-01 1999-11-30 2000-05-29 12:00:00 2000-05-29 13:00:00 2000-05-29 12:00:00 2000-01-31 12:00:00 2000-01-31 12:00:00 2000-01-31 11:00:00 2000-04-29 12:00:00 2000-04-29 13:00:00 2000-04-29 12:00:00 ---- ACTUAL OUTPUT 2000-02-29 2000-02-28 2000-02-29 2001-02-28 2001-03-01 1999-11-30 Warning: putenv() [/phpmanual/function.putenv.html]: Safe Mode warning: Cannot set environment variable 'TZ' - it's not in the allowed list in /usr/local/src/php-4.3.0RC1/ext/standard/tests/time/003.php on line 12 /usr/local/src/php-4.3.0RC1/ext/standard/tests/time/003.php(12) : Warning - putenv() [/phpmanual/function.putenv.html]: Safe Mode warning: Cannot set environment variable 'TZ' - it's not in the allowed list 2000-05-29 12:00:00 2000-05-29 13:00:00 2000-05-29 12:00:00 2000-01-31 12:00:00 2000-01-31 12:00:00 2000-01-31 11:00:00 2000-04-29 12:00:00 2000-04-29 13:00:00 2000-04-29 12:00:00 ---- FAILED ================================================================================ 007- 2000-05-29 12:00:00 007+ 008- 2000-05-29 13:00:00 008+ Warning: putenv() [/phpmanual/function.putenv.html]: Safe Mode warning: Cannot set environment variable 'TZ' - it's not in the allowed list in /usr/local/src/php-4.3.0RC1/ext/standard/tests/time/003.php on line 12 009- 2000-05-29 12:00:00 009+ /usr/local/src/php-4.3.0RC1/ext/standard/tests/time/003.php(12) : Warning - putenv() [/phpmanual/function.putenv.html]: Safe Mode warning: Cannot set environment variable 'TZ' - it's not in the allowed list 010- 2000-01-31 12:00:00 010+ 2000-05-29 12:00:00 011- 2000-01-31 12:00:00 011+ 2000-05-29 13:00:00 012- 2000-01-31 11:00:00 012+ 2000-05-29 12:00:00 013- 2000-04-29 12:00:00 013+ 2000-01-31 12:00:00 014- 2000-04-29 13:00:00 014+ 2000-01-31 12:00:00 015- 2000-04-29 12:00:00 015+ 2000-01-31 11:00:00 016+ 2000-04-29 12:00:00 017+ 2000-04-29 13:00:00 018+ 2000-04-29 12:00:00 ================================================================================ ================================================================================ PHPINFO ================================================================================ phpinfo() PHP Version => 4.3.0RC1 System => Linux frankenstein 2.4.19 #9 Fri Nov 15 14:27:29 CST 2002 i586 Build Date => Nov 21 2002 14:42:24 Configure Command => './configure' '--with-mysql=/usr/local/mysql' '--with-apxs=/usr/local/apache/bin/apxs' '--with-mod_charset' '--enable-track-vars' '--enable-debug' '--with-openssl' '--enable-bcmath' '--with-bz2' '--enable-calendar' '--with-curl' '--enable-ftp' '--enable-ctype' '--with-snmp' '--enable-sockets' '--enable-trans-sid' '--with-xml' '--enable-versioning' '--enable-inline-optimization' '--enable-memory-limit' '--enable-shared' '--enable-yp' '--enable-shmop' '--with-zlib=shared,/usr' '--with-jpeg-dir=/usr' '--with-gd' '--with-gettext=/usr' '--with-png-dir=/usr' '--with-freetype-dir=/usr' '--enable-gd-native-ttf' '--enable-gd-imgstrttf' '--with-ttf' '--with-gdbm' '--with-ndbm' '--with-db' '--enable-exif' '--with-hyperwave' '--enable-mailparse' '--enable-mbstring' '--with-ncurses' '--with-imap-ssl=/usr/local/lib/imap/' Server API => Command Line Interface Virtual Directory Support => disabled Configuration File (php.ini) Path => /usr/local/lib/php.ini PHP API => 20020918 PHP Extension => 20020429 Zend Extension => 20021010 Debug Build => yes Thread Safety => disabled Registered PHP Streams => php, http, ftp, https, ftps, compress.bzip2, compress.zlib This program makes use of the Zend Scripting Language Engine: Zend Engine v1.3.0, Copyright (c) 1998-2002 Zend Technologies _______________________________________________________________________ Configuration PHP Core Directive => Local Value => Master Value allow_call_time_pass_reference => On => On allow_url_fopen => On => On always_populate_raw_post_data => Off => Off arg_separator.input => &amp; => &amp; arg_separator.output => &amp; => &amp; asp_tags => Off => Off auto_append_file => no value => no value auto_prepend_file => no value => no value browscap => no value => no value default_charset => no value => no value default_mimetype => text/html => text/html define_syslog_variables => Off => Off disable_functions => no value => no value display_errors => On => On display_startup_errors => Off => Off doc_root => no value => no value docref_ext => no value => no value docref_root => http://www.php.net/ => http://www.php.net/ enable_dl => On => On error_append_string => no value => no value error_log => no value => no value error_prepend_string => no value => no value error_reporting => 2039 => 2039 expose_php => On => On extension_dir => ./ => ./ file_uploads => On => On gpc_order => GPC => GPC highlight.bg => #FFFFFF => #FFFFFF highlight.comment => #FF9900 => #FF9900 highlight.default => #0000CC => #0000CC highlight.html => #000000 => #000000 highlight.keyword => #006600 => #006600 highlight.string => #CC0000 => #CC0000 html_errors => Off => On ignore_repeated_errors => Off => Off ignore_repeated_source => Off => Off ignore_user_abort => Off => Off implicit_flush => On => Off include_path => .:/usr/local/lib/php => .:/usr/local/lib/php log_errors => Off => Off log_errors_max_len => 1024 => 1024 magic_quotes_gpc => On => On magic_quotes_runtime => Off => Off magic_quotes_sybase => Off => Off max_execution_time => 0 => 30 max_input_time => -1 => -1 memory_limit => 8M => 8M open_basedir => no value => no value output_buffering => no value => no value output_handler => no value => no value post_max_size => 8M => 8M precision => 14 => 14 register_argc_argv => On => On register_globals => On => On report_memleaks => On => On safe_mode => On => On safe_mode_exec_dir => no value => no value safe_mode_gid => Off => Off safe_mode_include_dir => no value => no value sendmail_from => me@localhost.com => me@localhost.com sendmail_path => /usr/bin/sendmail -t -i => /usr/bin/sendmail -t -i short_open_tag => On => On SMTP => localhost => localhost smtp_port => 25 => 25 sql.safe_mode => Off => Off track_errors => Off => Off unserialize_callback_func => no value => no value upload_max_filesize => 2M => 2M upload_tmp_dir => no value => no value user_dir => no value => no value variables_order => EGPCS => EGPCS xmlrpc_error_number => 0 => 0 xmlrpc_errors => Off => Off y2k_compliance => Off => Off yp YP Support => enabled xml XML Support => active XML Namespace Support => active EXPAT Version => 1.95.2 tokenizer Tokenizer Support => enabled standard Regex Library => Bundled library enabled Dynamic Library Support => enabled Path to sendmail => /usr/bin/sendmail -t -i Directive => Local Value => Master Value assert.active => 1 => 1 assert.bail => 0 => 0 assert.callback => no value => no value assert.quiet_eval => 0 => 0 assert.warning => 1 => 1 auto_detect_line_endings => 0 => 0 default_socket_timeout => 60 => 60 safe_mode_allowed_env_vars => PHP_ => PHP_ safe_mode_protected_env_vars => LD_LIBRARY_PATH => LD_LIBRARY_PATH url_rewriter.tags => a=href,area=href,frame=src,input=src,form=fakeentry => a=href,area=href,frame=src,input=src,form=fakeentry user_agent => no value => no value sockets Sockets Support => enabled snmp NET-SNMP Support => enabled NET-SNMP Version => 5.0.6 shmop shmop support => enabled session Session Support => enabled Registered save handlers => files user Directive => Local Value => Master Value session.auto_start => Off => Off session.bug_compat_42 => On => On session.bug_compat_warn => On => On session.cache_expire => 180 => 180 session.cache_limiter => nocache => nocache session.cookie_domain => no value => no value session.cookie_lifetime => 0 => 0 session.cookie_path => / => / session.cookie_secure => Off => Off session.entropy_file => no value => no value session.entropy_length => 0 => 0 session.gc_dividend => 100 => 100 session.gc_maxlifetime => 1440 => 1440 session.gc_probability => 1 => 1 session.name => PHPSESSID => PHPSESSID session.referer_check => no value => no value session.save_handler => files => files session.save_path => /tmp => /tmp session.serialize_handler => php => php session.use_cookies => On => On session.use_only_cookies => Off => Off session.use_trans_sid => On => On posix Revision => $Revision: 1.51 $ pcre PCRE (Perl Compatible Regular Expressions) Support => enabled PCRE Library Version => 3.92 11-Sep-2002 overload User-Space Object Overloading Support => enabled openssl OpenSSL support => enabled OpenSSL Version => OpenSSL 0.9.6e 30 Jul 2002 ncurses ncurses support => enabled ncurses library version => 5.2 color support => yes mysql MySQL Support => enabled Active Persistent Links => 0 Active Links => 0 Client API version => 3.23.53 MYSQL_MODULE_TYPE => external MYSQL_SOCKET => /tmp/mysql.sock MYSQL_INCLUDE => -I/usr/local/mysql/include/mysql MYSQL_LIBS => -L/usr/local/mysql/lib/mysql -lmysqlclient Directive => Local Value => Master Value mysql.allow_persistent => Off => Off mysql.connect_timeout => -1 => -1 mysql.default_host => no value => no value mysql.default_password => no value => no value mysql.default_port => no value => no value mysql.default_socket => no value => no value mysql.default_user => no value => no value mysql.max_links => 100 => 100 mysql.max_persistent => Unlimited => Unlimited mysql.trace_mode => Off => Off mbstring Multibyte Support => enabled Japanese support => enabled Directive => Local Value => Master Value mbstring.detect_order => no value => no value mbstring.encoding_translation => Off => Off mbstring.func_overload => 0 => 0 mbstring.http_input => pass => pass mbstring.http_output => pass => pass mbstring.internal_encoding => none => none mbstring.language => neutral => neutral mbstring.substitute_character => no value => no value hyperwave Hyperwave Support => enabled HG-CSP Version => 7.17 Directive => Local Value => Master Value hyerwave.allow_persistent => 0 => 0 hyperwave.default_port => 418 => 418 gettext GetText Support => enabled gd GD Support => enabled GD Version => bundled (2.0 compatible) FreeType Support => enabled FreeType Linkage => with freetype GIF Read Support => enabled JPG Support => enabled PNG Support => enabled WBMP Support => enabled ftp FTP support => enabled exif EXIF Support => enabled EXIF Version => 1.4 $Id: exif.c,v 1.118 2002/11/08 01:08:01 iliaa Exp $ Supported EXIF Version => 0220 Supported filetypes => JPEG,TIFF dba DBA support => enabled Supported handlers => gdbm ndbm db This is GDBM version 1.8.0, as of May 19, 1999. curl CURL support => enabled CURL Information => libcurl/7.10.2 OpenSSL/0.9.6e zlib/1.1.4 ctype ctype functions => enabled calendar Calendar support => enabled bz2 BZip2 Support => Enabled BZip2 Version => 1.0.1, 23-June-2000 bcmath BCMath support => enabled zlib ZLib Support => enabled 'zlib:' fopen wrapper => enabled Compiled Version => 1.1.4 Linked Version => 1.1.4 Directive => Local Value => Master Value zlib.output_compression => Off => Off zlib.output_compression_level => -1 => -1 zlib.output_handler => no value => no value Additional Modules Module Name Environment Variable => Value PWD => /usr/local/src/php-4.3.0RC1 MAKEFLAGS => SCRIPT_FILENAME => /usr/local/src/php-4.3.0RC1/tests/strings/004.php PAGER => less MFLAGS => HOSTNAME => frankenstein.intrakan.net MOZILLA_HOME => /usr/lib/netscape ignoreeof => LS_OPTIONS => --color=auto -F -b -T 0 LESSOPEN => |lesspipe.sh %s MANPATH => /usr/man:/usr/contrib/man:/usr/share/man:/usr/X11/man:/usr/local/man CC => gcc BLOCKSIZE => 1k SSH_CONNECTION => 192.168.0.130 3456 192.168.0.200 22 LESS => -M REQUEST_METHOD => GET LS_COLORS => USER => jmg MACHTYPE => i386-slackware-linux-gnu TEST_PHP_SRCDIR => /usr/local/src/php-4.3.0RC1 LC_ALL => POSIX MAIL => /var/mail/jmg PATH_TRANSLATED => /usr/local/src/php-4.3.0RC1/tests/strings/004.php EDITOR => pico QUERY_STRING => CONTENT_LENGTH => MAKELEVEL => 1 LOGNAME => jmg SHLVL => 3 MINICOM => -c on REDIRECT_STATUS => 1 _ => /usr/local/src/php-4.3.0RC1/sapi/cli/php WWW_HOME => http://www.interkan.net/ TEST_PHP_EXECUTABLE => /usr/local/src/php-4.3.0RC1/sapi/cli/php SHELL => /bin/sh HOSTTYPE => i386 OSTYPE => linux-gnu HOME => /admin/jmg TERM => vt320 PATH => /usr/local/bin:/sbin:/usr/local/sbin:/usr/local/vadmin:/bin:/usr/bin:/usr/X11/bin:/usr/contrib/bin:/usr/games:/usr/sbin:/admin/jmg/bin:/.html:.:/usr/local/jsdk/bin SSH_TTY => /dev/pts/0 EXINIT => set autoindent CONTENT_TYPE => PHP Variables Variable => Value PHP_SELF => _SERVER["PWD"] => /usr/local/src/php-4.3.0RC1 _SERVER["MAKEFLAGS"] => _SERVER["SCRIPT_FILENAME"] => _SERVER["PAGER"] => less _SERVER["MFLAGS"] => _SERVER["HOSTNAME"] => frankenstein.intrakan.net _SERVER["MOZILLA_HOME"] => /usr/lib/netscape _SERVER["ignoreeof"] => _SERVER["LS_OPTIONS"] => --color=auto -F -b -T 0 _SERVER["LESSOPEN"] => |lesspipe.sh %s _SERVER["MANPATH"] => /usr/man:/usr/contrib/man:/usr/share/man:/usr/X11/man:/usr/local/man _SERVER["CC"] => gcc _SERVER["BLOCKSIZE"] => 1k _SERVER["SSH_CONNECTION"] => 192.168.0.130 3456 192.168.0.200 22 _SERVER["LESS"] => -M _SERVER["REQUEST_METHOD"] => GET _SERVER["LS_COLORS"] => _SERVER["USER"] => jmg _SERVER["MACHTYPE"] => i386-slackware-linux-gnu _SERVER["TEST_PHP_SRCDIR"] => /usr/local/src/php-4.3.0RC1 _SERVER["LC_ALL"] => POSIX _SERVER["MAIL"] => /var/mail/jmg _SERVER["PATH_TRANSLATED"] => _SERVER["EDITOR"] => pico _SERVER["QUERY_STRING"] => _SERVER["CONTENT_LENGTH"] => _SERVER["MAKELEVEL"] => 1 _SERVER["LOGNAME"] => jmg _SERVER["SHLVL"] => 3 _SERVER["MINICOM"] => -c on _SERVER["REDIRECT_STATUS"] => 1 _SERVER["_"] => /usr/local/src/php-4.3.0RC1/sapi/cli/php _SERVER["WWW_HOME"] => http://www.interkan.net/ _SERVER["TEST_PHP_EXECUTABLE"] => /usr/local/src/php-4.3.0RC1/sapi/cli/php _SERVER["SHELL"] => /bin/sh _SERVER["HOSTTYPE"] => i386 _SERVER["OSTYPE"] => linux-gnu _SERVER["HOME"] => /admin/jmg _SERVER["TERM"] => vt320 _SERVER["PATH"] => /usr/local/bin:/sbin:/usr/local/sbin:/usr/local/vadmin:/bin:/usr/bin:/usr/X11/bin:/usr/contrib/bin:/usr/games:/usr/sbin:/admin/jmg/bin:/.html:.:/usr/local/jsdk/bin _SERVER["SSH_TTY"] => /dev/pts/0 _SERVER["EXINIT"] => set autoindent _SERVER["CONTENT_TYPE"] => _SERVER["PHP_SELF"] => _SERVER["SCRIPT_NAME"] => _SERVER["DOCUMENT_ROOT"] => _SERVER["argv"] => Array ( ) _SERVER["argc"] => 0 _ENV["PWD"] => /usr/local/src/php-4.3.0RC1 _ENV["MAKEFLAGS"] => _ENV["SCRIPT_FILENAME"] => /usr/local/src/php-4.3.0RC1/tests/strings/004.php _ENV["PAGER"] => less _ENV["MFLAGS"] => _ENV["HOSTNAME"] => frankenstein.intrakan.net _ENV["MOZILLA_HOME"] => /usr/lib/netscape _ENV["ignoreeof"] => _ENV["LS_OPTIONS"] => --color=auto -F -b -T 0 _ENV["LESSOPEN"] => |lesspipe.sh %s _ENV["MANPATH"] => /usr/man:/usr/contrib/man:/usr/share/man:/usr/X11/man:/usr/local/man _ENV["CC"] => gcc _ENV["BLOCKSIZE"] => 1k _ENV["SSH_CONNECTION"] => 192.168.0.130 3456 192.168.0.200 22 _ENV["LESS"] => -M _ENV["REQUEST_METHOD"] => GET _ENV["LS_COLORS"] => _ENV["USER"] => jmg _ENV["MACHTYPE"] => i386-slackware-linux-gnu _ENV["TEST_PHP_SRCDIR"] => /usr/local/src/php-4.3.0RC1 _ENV["LC_ALL"] => POSIX _ENV["MAIL"] => /var/mail/jmg _ENV["PATH_TRANSLATED"] => /usr/local/src/php-4.3.0RC1/tests/strings/004.php _ENV["EDITOR"] => pico _ENV["QUERY_STRING"] => _ENV["CONTENT_LENGTH"] => _ENV["MAKELEVEL"] => 1 _ENV["LOGNAME"] => jmg _ENV["SHLVL"] => 3 _ENV["MINICOM"] => -c on _ENV["REDIRECT_STATUS"] => 1 _ENV["_"] => /usr/local/src/php-4.3.0RC1/sapi/cli/php _ENV["WWW_HOME"] => http://www.interkan.net/ _ENV["TEST_PHP_EXECUTABLE"] => /usr/local/src/php-4.3.0RC1/sapi/cli/php _ENV["SHELL"] => /bin/sh _ENV["HOSTTYPE"] => i386 _ENV["OSTYPE"] => linux-gnu _ENV["HOME"] => /admin/jmg _ENV["TERM"] => vt320 _ENV["PATH"] => /usr/local/bin:/sbin:/usr/local/sbin:/usr/local/vadmin:/bin:/usr/bin:/usr/X11/bin:/usr/contrib/bin:/usr/games:/usr/sbin:/admin/jmg/bin:/.html:.:/usr/local/jsdk/bin _ENV["SSH_TTY"] => /dev/pts/0 _ENV["EXINIT"] => set autoindent _ENV["CONTENT_TYPE"] => PHP License This program is free software; you can redistribute it and/or modify it under the terms of the PHP License as published by the PHP Group and included in the distribution in the file: LICENSE This program is distributed in the hope that it will be useful, but WITHOUT ANY WARRANTY; without even the implied warranty of MERCHANTABILITY or FITNESS FOR A PARTICULAR PURPOSE. If you did not receive a copy of the PHP license, or have any questions about PHP licensing, please contact license@php.net.

« previous php.qa (#6942) next »