Test results

From: Date: Fri, 22 Nov 2002 21:01:36 +0000
Subject: Test results
Groups: php.qa 
Request: Send a blank email to php-qa+get-6959@lists.php.net to get a copy of this message
OS: Linux Automake: automake (GNU automake) 1.4 Copyright (C) 1999 Free Software Foundation, Inc. This is free software; see the source for copying conditions. There is NO warranty; not even for MERCHANTABILITY or FITNESS FOR A PARTICULAR PURPOSE. Written by Tom Tromey <tromey@cygnus.com> Autoconf: Autoconf version 2.13 Libtool: ltmain.sh (GNU libtool) 1.3.5 (1.385.2.206 2000/05/27 11:12:27) Compiler: Reading specs from /usr/lib/gcc-lib/i486-suse-linux/2.95.3/specs gcc version 2.95.3 20010315 (SuSE) Bison: GNU Bison version 1.28 ===================================================================== FAILED TEST SUMMARY --------------------------------------------------------------------- Check for exif_read_data, Unicode user comment [ext/exif/tests/exif003.phpt] is_*() and file_exists() return values are boolean. [ext/standard/tests/file/003.phpt] Bug #20169 [ext/standard/tests/strings/bug20169.phpt] htmlentities() test 2 (setlocale / fr_FR.ISO-8859-15) [ext/standard/tests/strings/htmlentities02.phpt] microtime() function [ext/standard/tests/time/001.phpt] strtotime() function [ext/standard/tests/time/002.phpt] Check for mktime with out-of-range parameters [ext/standard/tests/time/003.phpt] ===================================================================== ================================================================================ /home/u18675976/php-4.3.0RC1/ext/exif/tests/exif003.phpt ================================================================================ ---- EXPECTED OUTPUT array(5) { ["FILE"]=> array(6) { ["FileName"]=> string(9) "test3.jpg" ["FileDateTime"]=> int(%s) ["FileSize"]=> int(1240) ["FileType"]=> int(2) ["MimeType"]=> string(10) "image/jpeg" ["SectionsFound"]=> string(33) "ANY_TAG, IFD0, THUMBNAIL, COMMENT" } ["COMPUTED"]=> array(12) { ["html"]=> string(20) "width="1" height="1"" ["Height"]=> int(1) ["Width"]=> int(1) ["IsColor"]=> int(1) ["ByteOrderMotorola"]=> int(1) ["UserComment"]=> string(7) "ÄÖÜßäöü" ["UserCommentEncoding"]=> string(7) "UNICODE" ["Copyright"]=> string(41) "Photo (c) M.Boerger, Edited by M.Boerger." ["Copyright.Photographer"]=> string(19) "Photo (c) M.Boerger" ["Copyright.Editor"]=> string(20) "Edited by M.Boerger." ["Thumbnail.FileType"]=> int(2) ["Thumbnail.MimeType"]=> string(10) "image/jpeg" } ["IFD0"]=> array(2) { ["Copyright"]=> string(19) "Photo (c) M.Boerger" ["UserComment"]=> string(7) "UNICODE" } ["THUMBNAIL"]=> array(2) { ["JPEGInterchangeFormat"]=> int(134) ["JPEGInterchangeFormatLength"]=> int(523) } ["COMMENT"]=> array(3) { [0]=> string(11) "Comment #1." [1]=> string(11) "Comment #2." [2]=> string(13) "Comment #3end" } } ---- ACTUAL OUTPUT array(5) { ["FILE"]=> array(6) { ["FileName"]=> string(9) "test3.jpg" ["FileDateTime"]=> int(1024957362) ["FileSize"]=> int(1240) ["FileType"]=> int(2) ["MimeType"]=> string(10) "image/jpeg" ["SectionsFound"]=> string(33) "ANY_TAG, IFD0, THUMBNAIL, COMMENT" } ["COMPUTED"]=> array(12) { ["html"]=> string(20) "width="1" height="1"" ["Height"]=> int(1) ["Width"]=> int(1) ["IsColor"]=> int(1) ["ByteOrderMotorola"]=> int(1) ["UserComment"]=> string(15) "[0x0]Ä[0x0]Ö[0x0]Ü[0x0]ß[0x0]ä[0x0]ö[0x0]ü[0x0]" ["UserCommentEncoding"]=> string(7) "UNICODE" ["Copyright"]=> string(41) "Photo (c) M.Boerger, Edited by M.Boerger." ["Copyright.Photographer"]=> string(19) "Photo (c) M.Boerger" ["Copyright.Editor"]=> string(20) "Edited by M.Boerger." ["Thumbnail.FileType"]=> int(2) ["Thumbnail.MimeType"]=> string(10) "image/jpeg" } ["IFD0"]=> array(2) { ["Copyright"]=> string(19) "Photo (c) M.Boerger" ["UserComment"]=> string(7) "UNICODE" } ["THUMBNAIL"]=> array(2) { ["JPEGInterchangeFormat"]=> int(134) ["JPEGInterchangeFormatLength"]=> int(523) } ["COMMENT"]=> array(3) { [0]=> string(11) "Comment #1." [1]=> string(11) "Comment #2." [2]=> string(13) "Comment #3end" } } ---- FAILED ================================================================================ 007- int(%s) 007+ int(1024957362) 030- string(7) "ÄÖÜßäöü" 030+ string(15) "[0x0]Ä[0x0]Ö[0x0]Ü[0x0]ß[0x0]ä[0x0]ö[0x0]ü[0x0]" ================================================================================ ================================================================================ /home/u18675976/php-4.3.0RC1/ext/standard/tests/file/003.phpt ================================================================================ ---- EXPECTED OUTPUT boolean boolean boolean boolean boolean boolean boolean boolean boolean boolean ---- ACTUAL OUTPUT Warning: is_writable() [/phpmanual/function.is-writable.html]: Unable to access in /home/u18675976/php-4.3.0RC1/ext/standard/tests/file/003.php on line 14 /home/u18675976/php-4.3.0RC1/ext/standard/tests/file/003.php(14) : Warning - is_writable() [/phpmanual/function.is-writable.html]: Unable to access boolean Warning: is_readable() [/phpmanual/function.is-readable.html]: Unable to access in /home/u18675976/php-4.3.0RC1/ext/standard/tests/file/003.php on line 14 /home/u18675976/php-4.3.0RC1/ext/standard/tests/file/003.php(14) : Warning - is_readable() [/phpmanual/function.is-readable.html]: Unable to access boolean Warning: is_executable() [/phpmanual/function.is-executable.html]: Unable to access in /home/u18675976/php-4.3.0RC1/ext/standard/tests/file/003.php on line 14 /home/u18675976/php-4.3.0RC1/ext/standard/tests/file/003.php(14) : Warning - is_executable() [/phpmanual/function.is-executable.html]: Unable to access boolean Warning: is_file() [/phpmanual/function.is-file.html]: Unable to access in /home/u18675976/php-4.3.0RC1/ext/standard/tests/file/003.php on line 14 /home/u18675976/php-4.3.0RC1/ext/standard/tests/file/003.php(14) : Warning - is_file() [/phpmanual/function.is-file.html]: Unable to access boolean Warning: file_exists() [/phpmanual/function.file-exists.html]: Unable to access in /home/u18675976/php-4.3.0RC1/ext/standard/tests/file/003.php on line 14 /home/u18675976/php-4.3.0RC1/ext/standard/tests/file/003.php(14) : Warning - file_exists() [/phpmanual/function.file-exists.html]: Unable to access boolean boolean boolean boolean boolean boolean ---- FAILED ================================================================================ 001- boolean 001+ Warning: is_writable() [/phpmanual/function.is-writable.html]: Unable to access in /home/u18675976/php-4.3.0RC1/ext/standard/tests/file/003.php on line 14 002- boolean 002+ /home/u18675976/php-4.3.0RC1/ext/standard/tests/file/003.php(14) : Warning - is_writable() [/phpmanual/function.is-writable.html]: Unable to access 004- boolean 004+ 005- boolean 005+ Warning: is_readable() [/phpmanual/function.is-readable.html]: Unable to access in /home/u18675976/php-4.3.0RC1/ext/standard/tests/file/003.php on line 14 006- boolean 006+ /home/u18675976/php-4.3.0RC1/ext/standard/tests/file/003.php(14) : Warning - is_readable() [/phpmanual/function.is-readable.html]: Unable to access 008- boolean 008+ 009- boolean 009+ Warning: is_executable() [/phpmanual/function.is-executable.html]: Unable to access in /home/u18675976/php-4.3.0RC1/ext/standard/tests/file/003.php on line 14 010- boolean 010+ /home/u18675976/php-4.3.0RC1/ext/standard/tests/file/003.php(14) : Warning - is_executable() [/phpmanual/function.is-executable.html]: Unable to access 011+ boolean 012+ 013+ Warning: is_file() [/phpmanual/function.is-file.html]: Unable to access in /home/u18675976/php-4.3.0RC1/ext/standard/tests/file/003.php on line 14 014+ /home/u18675976/php-4.3.0RC1/ext/standard/tests/file/003.php(14) : Warning - is_file() [/phpmanual/function.is-file.html]: Unable to access 015+ boolean 016+ 017+ Warning: file_exists() [/phpmanual/function.file-exists.html]: Unable to access in /home/u18675976/php-4.3.0RC1/ext/standard/tests/file/003.php on line 14 018+ /home/u18675976/php-4.3.0RC1/ext/standard/tests/file/003.php(14) : Warning - file_exists() [/phpmanual/function.file-exists.html]: Unable to access 019+ boolean 020+ boolean 021+ boolean 022+ boolean 023+ boolean 024+ boolean ================================================================================ ================================================================================ /home/u18675976/php-4.3.0RC1/ext/standard/tests/strings/bug20169.phpt ================================================================================ ---- EXPECTED OUTPUT delimiter: | delimiter: | ---- ACTUAL OUTPUT Warning: Cannot set time limit in safe mode in /home/u18675976/php-4.3.0RC1/ext/standard/tests/strings/bug20169.php on line 2 /home/u18675976/php-4.3.0RC1/ext/standard/tests/strings/bug20169.php(2) : Warning - Cannot set time limit in safe mode delimiter: | delimiter: | ---- FAILED ================================================================================ 001- delimiter: | 001+ Warning: Cannot set time limit in safe mode in /home/u18675976/php-4.3.0RC1/ext/standard/tests/strings/bug20169.php on line 2 002- delimiter: | 002+ /home/u18675976/php-4.3.0RC1/ext/standard/tests/strings/bug20169.php(2) : Warning - Cannot set time limit in safe mode 003+ delimiter: | 004+ delimiter: | ================================================================================ ================================================================================ /home/u18675976/php-4.3.0RC1/ext/standard/tests/strings/htmlentities02.phpt ================================================================================ ---- EXPECTED OUTPUT string(20) "&OElig;&oelig;&Yuml;" ---- ACTUAL OUTPUT string(24) "&frac14;&frac12;&frac34;" ---- FAILED ================================================================================ 001- string(20) "&OElig;&oelig;&Yuml;" 001+ string(24) "&frac14;&frac12;&frac34;" ================================================================================ ================================================================================ /home/u18675976/php-4.3.0RC1/ext/standard/tests/time/001.phpt ================================================================================ ---- EXPECTED OUTPUT Passed: 100000 Failed: 0 ---- ACTUAL OUTPUT Warning: Cannot set time limit in safe mode in /home/u18675976/php-4.3.0RC1/ext/standard/tests/time/001.php on line 8 /home/u18675976/php-4.3.0RC1/ext/standard/tests/time/001.php(8) : Warning - Cannot set time limit in safe mode Passed: 100000 Failed: 0 ---- FAILED ================================================================================ 001- Passed: 100000 001+ Warning: Cannot set time limit in safe mode in /home/u18675976/php-4.3.0RC1/ext/standard/tests/time/001.php on line 8 002- Failed: 0 002+ /home/u18675976/php-4.3.0RC1/ext/standard/tests/time/001.php(8) : Warning - Cannot set time limit in safe mode 003+ Passed: 100000 004+ Failed: 0 ================================================================================ ================================================================================ /home/u18675976/php-4.3.0RC1/ext/standard/tests/time/002.phpt ================================================================================ ---- EXPECTED OUTPUT 1999-10-13 00:00:00 1999-10-13 00:00:00 2000-01-19 00:00:00 2000-01-19 00:00:00 2001-12-21 00:00:00 2001-12-21 00:00:00 2001-12-21 12:16:00 2001-12-21 12:16:00 1969-12-31 23:59:59 2001-10-22 21:19:58 2001-10-22 23:19:58 2001-10-22 23:32:58 2001-10-22 19:19:58 2001-10-22 19:06:58 1999-10-13 00:00:00 1999-10-13 00:00:00 2000-01-19 00:00:00 2000-01-19 00:00:00 2001-12-21 00:00:00 2001-12-21 00:00:00 2001-12-21 12:16:00 2001-12-21 12:16:00 1970-01-01 00:59:59 2001-10-22 21:19:58 2001-10-23 01:19:58 2001-10-23 01:32:58 2001-10-22 21:19:58 2001-10-22 21:06:58 ---- ACTUAL OUTPUT Warning: putenv() [/phpmanual/function.putenv.html]: Safe Mode warning: Cannot set environment variable 'TZ' - it's not in the allowed list in /home/u18675976/php-4.3.0RC1/ext/standard/tests/time/002.php on line 19 /home/u18675976/php-4.3.0RC1/ext/standard/tests/time/002.php(19) : Warning - putenv() [/phpmanual/function.putenv.html]: Safe Mode warning: Cannot set environment variable 'TZ' - it's not in the allowed list 1999-10-13 00:00:00 1999-10-13 00:00:00 2000-01-19 00:00:00 2000-01-19 00:00:00 2001-12-21 00:00:00 2001-12-21 00:00:00 2001-12-21 12:16:00 2001-12-21 12:16:00 1970-01-01 00:59:59 2001-10-22 21:19:58 2001-10-23 01:19:58 2001-10-23 01:32:58 2001-10-22 21:19:58 2001-10-22 21:06:58 Warning: putenv() [/phpmanual/function.putenv.html]: Safe Mode warning: Cannot set environment variable 'TZ' - it's not in the allowed list in /home/u18675976/php-4.3.0RC1/ext/standard/tests/time/002.php on line 24 /home/u18675976/php-4.3.0RC1/ext/standard/tests/time/002.php(24) : Warning - putenv() [/phpmanual/function.putenv.html]: Safe Mode warning: Cannot set environment variable 'TZ' - it's not in the allowed list 1999-10-13 00:00:00 1999-10-13 00:00:00 2000-01-19 00:00:00 2000-01-19 00:00:00 2001-12-21 00:00:00 2001-12-21 00:00:00 2001-12-21 12:16:00 2001-12-21 12:16:00 1970-01-01 00:59:59 2001-10-22 21:19:58 2001-10-23 01:19:58 2001-10-23 01:32:58 2001-10-22 21:19:58 2001-10-22 21:06:58 ---- FAILED ================================================================================ 001- 1999-10-13 00:00:00 001+ Warning: putenv() [/phpmanual/function.putenv.html]: Safe Mode warning: Cannot set environment variable 'TZ' - it's not in the allowed list in /home/u18675976/php-4.3.0RC1/ext/standard/tests/time/002.php on line 19 002- 1999-10-13 00:00:00 002+ /home/u18675976/php-4.3.0RC1/ext/standard/tests/time/002.php(19) : Warning - putenv() [/phpmanual/function.putenv.html]: Safe Mode warning: Cannot set environment variable 'TZ' - it's not in the allowed list 003- 2000-01-19 00:00:00 003+ 1999-10-13 00:00:00 004- 2000-01-19 00:00:00 004+ 1999-10-13 00:00:00 005- 2001-12-21 00:00:00 005+ 2000-01-19 00:00:00 006- 2001-12-21 00:00:00 006+ 2000-01-19 00:00:00 007- 2001-12-21 12:16:00 007+ 2001-12-21 00:00:00 008- 2001-12-21 12:16:00 008+ 2001-12-21 00:00:00 009- 1969-12-31 23:59:59 009+ 2001-12-21 12:16:00 010- 2001-10-22 21:19:58 010+ 2001-12-21 12:16:00 011- 2001-10-22 23:19:58 011+ 1970-01-01 00:59:59 012- 2001-10-22 23:32:58 012+ 2001-10-22 21:19:58 013- 2001-10-22 19:19:58 013+ 2001-10-23 01:19:58 014- 2001-10-22 19:06:58 014+ 2001-10-23 01:32:58 015- 1999-10-13 00:00:00 015+ 2001-10-22 21:19:58 016- 1999-10-13 00:00:00 016+ 2001-10-22 21:06:58 017- 2000-01-19 00:00:00 017+ 018- 2000-01-19 00:00:00 018+ Warning: putenv() [/phpmanual/function.putenv.html]: Safe Mode warning: Cannot set environment variable 'TZ' - it's not in the allowed list in /home/u18675976/php-4.3.0RC1/ext/standard/tests/time/002.php on line 24 019- 2001-12-21 00:00:00 019+ /home/u18675976/php-4.3.0RC1/ext/standard/tests/time/002.php(24) : Warning - putenv() [/phpmanual/function.putenv.html]: Safe Mode warning: Cannot set environment variable 'TZ' - it's not in the allowed list 020- 2001-12-21 00:00:00 020+ 1999-10-13 00:00:00 021- 2001-12-21 12:16:00 021+ 1999-10-13 00:00:00 022- 2001-12-21 12:16:00 022+ 2000-01-19 00:00:00 023- 1970-01-01 00:59:59 023+ 2000-01-19 00:00:00 024- 2001-10-22 21:19:58 024+ 2001-12-21 00:00:00 025- 2001-10-23 01:19:58 025+ 2001-12-21 00:00:00 026- 2001-10-23 01:32:58 026+ 2001-12-21 12:16:00 027- 2001-10-22 21:19:58 027+ 2001-12-21 12:16:00 028- 2001-10-22 21:06:58 028+ 1970-01-01 00:59:59 029+ 2001-10-22 21:19:58 030+ 2001-10-23 01:19:58 031+ 2001-10-23 01:32:58 032+ 2001-10-22 21:19:58 033+ 2001-10-22 21:06:58 ================================================================================ ================================================================================ /home/u18675976/php-4.3.0RC1/ext/standard/tests/time/003.phpt ================================================================================ ---- EXPECTED OUTPUT 2000-02-29 2000-02-28 2000-02-29 2001-02-28 2001-03-01 1999-11-30 2000-05-29 12:00:00 2000-05-29 13:00:00 2000-05-29 12:00:00 2000-01-31 12:00:00 2000-01-31 12:00:00 2000-01-31 11:00:00 2000-04-29 12:00:00 2000-04-29 13:00:00 2000-04-29 12:00:00 ---- ACTUAL OUTPUT 2000-02-29 2000-02-28 2000-02-29 2001-02-28 2001-03-01 1999-11-30 Warning: putenv() [/phpmanual/function.putenv.html]: Safe Mode warning: Cannot set environment variable 'TZ' - it's not in the allowed list in /home/u18675976/php-4.3.0RC1/ext/standard/tests/time/003.php on line 12 /home/u18675976/php-4.3.0RC1/ext/standard/tests/time/003.php(12) : Warning - putenv() [/phpmanual/function.putenv.html]: Safe Mode warning: Cannot set environment variable 'TZ' - it's not in the allowed list 2000-05-29 12:00:00 2000-05-29 13:00:00 2000-05-29 12:00:00 2000-01-31 12:00:00 2000-01-31 12:00:00 2000-01-31 11:00:00 2000-04-29 12:00:00 2000-04-29 13:00:00 2000-04-29 12:00:00 ---- FAILED ================================================================================ 007- 2000-05-29 12:00:00 007+ 008- 2000-05-29 13:00:00 008+ Warning: putenv() [/phpmanual/function.putenv.html]: Safe Mode warning: Cannot set environment variable 'TZ' - it's not in the allowed list in /home/u18675976/php-4.3.0RC1/ext/standard/tests/time/003.php on line 12 009- 2000-05-29 12:00:00 009+ /home/u18675976/php-4.3.0RC1/ext/standard/tests/time/003.php(12) : Warning - putenv() [/phpmanual/function.putenv.html]: Safe Mode warning: Cannot set environment variable 'TZ' - it's not in the allowed list 010- 2000-01-31 12:00:00 010+ 2000-05-29 12:00:00 011- 2000-01-31 12:00:00 011+ 2000-05-29 13:00:00 012- 2000-01-31 11:00:00 012+ 2000-05-29 12:00:00 013- 2000-04-29 12:00:00 013+ 2000-01-31 12:00:00 014- 2000-04-29 13:00:00 014+ 2000-01-31 12:00:00 015- 2000-04-29 12:00:00 015+ 2000-01-31 11:00:00 016+ 2000-04-29 12:00:00 017+ 2000-04-29 13:00:00 018+ 2000-04-29 12:00:00 ================================================================================ ================================================================================ PHPINFO ================================================================================ phpinfo() PHP Version => 4.3.0RC1 System => Linux www 2.4.13 #1 Wed Oct 24 15:03:46 CEST 2001 i686 Build Date => Nov 22 2002 21:59:00 Configure Command => './configure' '--prefix=/usr' '--bindir=/usr/bin' '--libdir=/usr/lib' '--with-config-file-path=/etc' '--with-exec-dir=%{libdir}/php/bin' '--with-mysql' '--with-gd=yes' '--with-tiff-dir=/usr' '--with-jpeg-dir=/usr' '--with-png-dir=/usr' '--with-zlib=yes' '--with-bz2' '--with-xml' '--with-mcal=/usr' '--with-sablot' '--with-ftp' '--with-ndbm' '--with-gdbm' '--with-gettext' '--with-qtdom=/usr/lib/qt-2.2.1/' '--enable-versioning' '--enable-yp' '--enable-bcmath' '--enable-trans-sid' '--enable-inline-optimization' '--enable-track-vars' '--enable-magic-quotes' '--enable-sockets' '--enable-sysvsem' '--enable-sysvshm' '--enable-shmop' '--enable-calendar' '--enable-exif' '--enable-ftp' '--enable-memory-limit' '--enable-wddx' '--enable-filepro' '--enable-dbase' '--enable-ctype' '--enable-debug' '--enable-force-cgi-redirect' '--enable-discard-path' '--enable-sigchild' '--enable-gd-imgstrttf' '--with-openssl' '--with-apxs=/usr/sbin/apxs' 'i386-suse-linux-gnu' Server API => Command Line Interface Virtual Directory Support => disabled Configuration File (php.ini) Path => /etc/php.ini PHP API => 20020918 PHP Extension => 20020429 Zend Extension => 20021010 Debug Build => yes Thread Safety => disabled Registered PHP Streams => php, http, ftp, https, ftps, compress.bzip2, compress.zlib This program makes use of the Zend Scripting Language Engine: Zend Engine v1.3.0, Copyright (c) 1998-2002 Zend Technologies _______________________________________________________________________ Configuration PHP Core Directive => Local Value => Master Value allow_call_time_pass_reference => On => On allow_url_fopen => On => On always_populate_raw_post_data => Off => Off arg_separator.input => &amp; => &amp; arg_separator.output => &amp; => &amp; asp_tags => Off => Off auto_append_file => no value => no value auto_prepend_file => no value => no value browscap => no value => no value default_charset => no value => no value default_mimetype => text/html => text/html define_syslog_variables => Off => Off disable_functions => no value => no value display_errors => On => On display_startup_errors => Off => Off doc_root => no value => no value docref_ext => no value => no value docref_root => http://www.php.net/ => http://www.php.net/ enable_dl => On => On error_append_string => no value => no value error_log => no value => no value error_prepend_string => no value => no value error_reporting => 2039 => 2039 expose_php => On => On extension_dir => ./ => ./ file_uploads => On => On gpc_order => GPC => GPC highlight.bg => #FFFFFF => #FFFFFF highlight.comment => #FF9900 => #FF9900 highlight.default => #0000CC => #0000CC highlight.html => #000000 => #000000 highlight.keyword => #006600 => #006600 highlight.string => #CC0000 => #CC0000 html_errors => Off => On ignore_repeated_errors => Off => Off ignore_repeated_source => Off => Off ignore_user_abort => Off => Off implicit_flush => On => Off include_path => .:/usr/lib/php => .:/usr/lib/php log_errors => Off => Off log_errors_max_len => 1024 => 1024 magic_quotes_gpc => On => On magic_quotes_runtime => Off => Off magic_quotes_sybase => Off => Off max_execution_time => 0 => 30 max_input_time => -1 => -1 memory_limit => 8M => 8M open_basedir => no value => no value output_buffering => no value => no value output_handler => no value => no value post_max_size => 8M => 8M precision => 14 => 14 register_argc_argv => On => On register_globals => On => On report_memleaks => On => On safe_mode => On => On safe_mode_exec_dir => no value => no value safe_mode_gid => Off => Off safe_mode_include_dir => no value => no value sendmail_from => me@localhost.com => me@localhost.com sendmail_path => /usr/sbin/sendmail -t -i => /usr/sbin/sendmail -t -i short_open_tag => On => On SMTP => localhost => localhost smtp_port => 25 => 25 sql.safe_mode => Off => Off track_errors => Off => Off unserialize_callback_func => no value => no value upload_max_filesize => 2M => 2M upload_tmp_dir => no value => no value user_dir => no value => no value variables_order => EGPCS => EGPCS xmlrpc_error_number => 0 => 0 xmlrpc_errors => Off => Off y2k_compliance => Off => Off yp YP Support => enabled xml XML Support => active XML Namespace Support => active EXPAT Version => 1.95.2 wddx WDDX Support => enabled WDDX Session Serializer => enabled tokenizer Tokenizer Support => enabled standard Regex Library => Bundled library enabled Dynamic Library Support => enabled Path to sendmail => /usr/sbin/sendmail -t -i Directive => Local Value => Master Value assert.active => 1 => 1 assert.bail => 0 => 0 assert.callback => no value => no value assert.quiet_eval => 0 => 0 assert.warning => 1 => 1 auto_detect_line_endings => 0 => 0 default_socket_timeout => 60 => 60 safe_mode_allowed_env_vars => PHP_ => PHP_ safe_mode_protected_env_vars => LD_LIBRARY_PATH => LD_LIBRARY_PATH url_rewriter.tags => a=href,area=href,frame=src,input=src,form=fakeentry => a=href,area=href,frame=src,input=src,form=fakeentry user_agent => no value => no value sockets Sockets Support => enabled shmop shmop support => enabled session Session Support => enabled Registered save handlers => files user Directive => Local Value => Master Value session.auto_start => Off => Off session.bug_compat_42 => On => On session.bug_compat_warn => On => On session.cache_expire => 180 => 180 session.cache_limiter => nocache => nocache session.cookie_domain => no value => no value session.cookie_lifetime => 0 => 0 session.cookie_path => / => / session.cookie_secure => Off => Off session.entropy_file => no value => no value session.entropy_length => 0 => 0 session.gc_dividend => 100 => 100 session.gc_maxlifetime => 1440 => 1440 session.gc_probability => 1 => 1 session.name => PHPSESSID => PHPSESSID session.referer_check => no value => no value session.save_handler => files => files session.save_path => /tmp => /tmp session.serialize_handler => php => php session.use_cookies => On => On session.use_only_cookies => Off => Off session.use_trans_sid => On => On posix Revision => $Revision: 1.51 $ pcre PCRE (Perl Compatible Regular Expressions) Support => enabled PCRE Library Version => 3.92 11-Sep-2002 overload User-Space Object Overloading Support => enabled openssl OpenSSL support => enabled OpenSSL Version => OpenSSL 0.9.6a 5 Apr 2001 mysql MySQL Support => enabled Active Persistent Links => 0 Active Links => 0 Client API version => 3.23.49 MYSQL_MODULE_TYPE => builtin MYSQL_SOCKET => /var/lib/mysql/mysql.sock MYSQL_INCLUDE => MYSQL_LIBS => Directive => Local Value => Master Value mysql.allow_persistent => On => On mysql.connect_timeout => -1 => -1 mysql.default_host => no value => no value mysql.default_password => no value => no value mysql.default_port => no value => no value mysql.default_socket => no value => no value mysql.default_user => no value => no value mysql.max_links => Unlimited => Unlimited mysql.max_persistent => Unlimited => Unlimited mysql.trace_mode => Off => Off mcal MCAL Support => enabled MCAL Version => 0.6 - 20000121 gettext GetText Support => enabled gd GD Support => enabled GD Version => bundled (2.0 compatible) GIF Read Support => enabled JPG Support => enabled PNG Support => enabled WBMP Support => enabled ftp FTP support => enabled exif EXIF Support => enabled EXIF Version => 1.4 $Id: exif.c,v 1.118 2002/11/08 01:08:01 iliaa Exp $ Supported EXIF Version => 0220 Supported filetypes => JPEG,TIFF dba DBA support => enabled Supported handlers => gdbm ndbm ctype ctype functions => enabled calendar Calendar support => enabled bz2 BZip2 Support => Enabled BZip2 Version => 1.0.1, 23-June-2000 bcmath BCMath support => enabled zlib ZLib Support => enabled 'zlib:' fopen wrapper => enabled Compiled Version => 1.1.3 Linked Version => 1.1.3 Directive => Local Value => Master Value zlib.output_compression => Off => Off zlib.output_compression_level => -1 => -1 zlib.output_handler => no value => no value Additional Modules Module Name sysvshm sysvsem filepro dbase Environment Variable => Value PWD => /home/u18675976/php-4.3.0RC1 MAKEFLAGS => SCRIPT_FILENAME => /home/u18675976/php-4.3.0RC1/tests/strings/004.php PAGER => less MFLAGS => HOSTNAME => www LESSCLOSE => lessclose.sh %s %s LS_OPTIONS => -N --color=tty -T 0 ignoreeof => 0 SUSE_DOC_HOST => localhost LESSKEY => /etc/lesskey.bin MANPATH => /usr/local/man:/usr/share/man:/usr/X11R6/man:/usr/man:/usr/openwin/man LESSOPEN => lessopen.sh %s CC => gcc NNTPSERVER => news KDEDIR => /opt/kde LESS => -M -S -I REQUEST_METHOD => GET HISTCONTROL => ignoredups LS_COLORS => no=00:fi=00:di=01;34:ln=01:pi=40;33:so=01;35:bd=40;33;01:cd=40;33;01:ex=01;31:*.cmd=01;32:*.exe=01;32:*.com=01;32:*.btm=01;32:*.bat=01;32:*.tar=00;31:*.tbz=00;31:*.tgz=00;31:*.rpm=00;31:*.arj=00;31:*.taz=00;31:*.lzh=00;31:*.zip=00;31:*.z=00;31:*.Z=00;31:*.gz=00;31:*.bz2=00;31:*.jpg=01;35:*.gif=01;35:*.bmp=01;35:*.xbm=01;35:*.xpm=01;35:*.tif=01;35:*.png=01;35: USER => u18675976 XKEYSYMDB => /usr/X11R6/lib/X11/XKeysymDB MACHTYPE => i386-suse-linux TEST_PHP_SRCDIR => /home/u18675976/php-4.3.0RC1 MAIL => /var/mail/u18675976 PATH_TRANSLATED => /home/u18675976/php-4.3.0RC1/tests/strings/004.php LANG => de_DE@euro QUERY_STRING => CONTENT_LENGTH => MAKELEVEL => 1 COLORTERM => 1 INFOPATH => /usr/local/info:/usr/share/info:/usr/info SHLVL => 3 LOGNAME => u18675976 TEXINPUTS => :~/.TeX:/usr/share/doc/.TeX:/usr/doc/.TeX MINICOM => -c on INFODIR => /usr/local/info:/usr/share/info:/usr/info REDIRECT_STATUS => 1 _ => /home/u18675976/php-4.3.0RC1/sapi/cli/php TEST_PHP_EXECUTABLE => /home/u18675976/php-4.3.0RC1/sapi/cli/php SHELL => /bin/sh PRINTER => lp HOSTTYPE => i386 WINDOWMANAGER => /usr/X11R6/bin/kde OSTYPE => linux no_proxy => localhost TERM => xterm HOME => /home/u18675976 XNLSPATH => /usr/X11R6/lib/X11/nls PATH => /usr/local/bin:/usr/bin:/usr/X11R6/bin:/bin:/usr/games/bin:/usr/games:/opt/gnome/bin:/opt/kde2/bin:. FROM_HEADER => schlueetrs.de LC_COLLATE => POSIX SSH_TTY => /dev/pts/0 CONTENT_TYPE => PHP Variables Variable => Value PHP_SELF => _SERVER["PWD"] => /home/u18675976/php-4.3.0RC1 _SERVER["MAKEFLAGS"] => _SERVER["SCRIPT_FILENAME"] => _SERVER["PAGER"] => less _SERVER["MFLAGS"] => _SERVER["HOSTNAME"] => www _SERVER["LESSCLOSE"] => lessclose.sh %s %s _SERVER["LS_OPTIONS"] => -N --color=tty -T 0 _SERVER["ignoreeof"] => 0 _SERVER["SUSE_DOC_HOST"] => localhost _SERVER["LESSKEY"] => /etc/lesskey.bin _SERVER["MANPATH"] => /usr/local/man:/usr/share/man:/usr/X11R6/man:/usr/man:/usr/openwin/man _SERVER["LESSOPEN"] => lessopen.sh %s _SERVER["CC"] => gcc _SERVER["NNTPSERVER"] => news _SERVER["KDEDIR"] => /opt/kde _SERVER["LESS"] => -M -S -I _SERVER["REQUEST_METHOD"] => GET _SERVER["HISTCONTROL"] => ignoredups _SERVER["LS_COLORS"] => no=00:fi=00:di=01;34:ln=01:pi=40;33:so=01;35:bd=40;33;01:cd=40;33;01:ex=01;31:*.cmd=01;32:*.exe=01;32:*.com=01;32:*.btm=01;32:*.bat=01;32:*.tar=00;31:*.tbz=00;31:*.tgz=00;31:*.rpm=00;31:*.arj=00;31:*.taz=00;31:*.lzh=00;31:*.zip=00;31:*.z=00;31:*.Z=00;31:*.gz=00;31:*.bz2=00;31:*.jpg=01;35:*.gif=01;35:*.bmp=01;35:*.xbm=01;35:*.xpm=01;35:*.tif=01;35:*.png=01;35: _SERVER["USER"] => u18675976 _SERVER["XKEYSYMDB"] => /usr/X11R6/lib/X11/XKeysymDB _SERVER["MACHTYPE"] => i386-suse-linux _SERVER["TEST_PHP_SRCDIR"] => /home/u18675976/php-4.3.0RC1 _SERVER["MAIL"] => /var/mail/u18675976 _SERVER["PATH_TRANSLATED"] => _SERVER["LANG"] => de_DE@euro _SERVER["QUERY_STRING"] => _SERVER["CONTENT_LENGTH"] => _SERVER["MAKELEVEL"] => 1 _SERVER["COLORTERM"] => 1 _SERVER["INFOPATH"] => /usr/local/info:/usr/share/info:/usr/info _SERVER["SHLVL"] => 3 _SERVER["LOGNAME"] => u18675976 _SERVER["TEXINPUTS"] => :~/.TeX:/usr/share/doc/.TeX:/usr/doc/.TeX _SERVER["MINICOM"] => -c on _SERVER["INFODIR"] => /usr/local/info:/usr/share/info:/usr/info _SERVER["REDIRECT_STATUS"] => 1 _SERVER["_"] => /home/u18675976/php-4.3.0RC1/sapi/cli/php _SERVER["TEST_PHP_EXECUTABLE"] => /home/u18675976/php-4.3.0RC1/sapi/cli/php _SERVER["SHELL"] => /bin/sh _SERVER["PRINTER"] => lp _SERVER["HOSTTYPE"] => i386 _SERVER["WINDOWMANAGER"] => /usr/X11R6/bin/kde _SERVER["OSTYPE"] => linux _SERVER["no_proxy"] => localhost _SERVER["TERM"] => xterm _SERVER["HOME"] => /home/u18675976 _SERVER["XNLSPATH"] => /usr/X11R6/lib/X11/nls _SERVER["PATH"] => /usr/local/bin:/usr/bin:/usr/X11R6/bin:/bin:/usr/games/bin:/usr/games:/opt/gnome/bin:/opt/kde2/bin:. _SERVER["FROM_HEADER"] => schlueetrs.de _SERVER["LC_COLLATE"] => POSIX _SERVER["SSH_TTY"] => /dev/pts/0 _SERVER["CONTENT_TYPE"] => _SERVER["PHP_SELF"] => _SERVER["SCRIPT_NAME"] => _SERVER["DOCUMENT_ROOT"] => _SERVER["argv"] => Array ( ) _SERVER["argc"] => 0 _ENV["PWD"] => /home/u18675976/php-4.3.0RC1 _ENV["MAKEFLAGS"] => _ENV["SCRIPT_FILENAME"] => /home/u18675976/php-4.3.0RC1/tests/strings/004.php _ENV["PAGER"] => less _ENV["MFLAGS"] => _ENV["HOSTNAME"] => www _ENV["LESSCLOSE"] => lessclose.sh %s %s _ENV["LS_OPTIONS"] => -N --color=tty -T 0 _ENV["ignoreeof"] => 0 _ENV["SUSE_DOC_HOST"] => localhost _ENV["LESSKEY"] => /etc/lesskey.bin _ENV["MANPATH"] => /usr/local/man:/usr/share/man:/usr/X11R6/man:/usr/man:/usr/openwin/man _ENV["LESSOPEN"] => lessopen.sh %s _ENV["CC"] => gcc _ENV["NNTPSERVER"] => news _ENV["KDEDIR"] => /opt/kde _ENV["LESS"] => -M -S -I _ENV["REQUEST_METHOD"] => GET _ENV["HISTCONTROL"] => ignoredups _ENV["LS_COLORS"] => no=00:fi=00:di=01;34:ln=01:pi=40;33:so=01;35:bd=40;33;01:cd=40;33;01:ex=01;31:*.cmd=01;32:*.exe=01;32:*.com=01;32:*.btm=01;32:*.bat=01;32:*.tar=00;31:*.tbz=00;31:*.tgz=00;31:*.rpm=00;31:*.arj=00;31:*.taz=00;31:*.lzh=00;31:*.zip=00;31:*.z=00;31:*.Z=00;31:*.gz=00;31:*.bz2=00;31:*.jpg=01;35:*.gif=01;35:*.bmp=01;35:*.xbm=01;35:*.xpm=01;35:*.tif=01;35:*.png=01;35: _ENV["USER"] => u18675976 _ENV["XKEYSYMDB"] => /usr/X11R6/lib/X11/XKeysymDB _ENV["MACHTYPE"] => i386-suse-linux _ENV["TEST_PHP_SRCDIR"] => /home/u18675976/php-4.3.0RC1 _ENV["MAIL"] => /var/mail/u18675976 _ENV["PATH_TRANSLATED"] => /home/u18675976/php-4.3.0RC1/tests/strings/004.php _ENV["LANG"] => de_DE@euro _ENV["QUERY_STRING"] => _ENV["CONTENT_LENGTH"] => _ENV["MAKELEVEL"] => 1 _ENV["COLORTERM"] => 1 _ENV["INFOPATH"] => /usr/local/info:/usr/share/info:/usr/info _ENV["SHLVL"] => 3 _ENV["LOGNAME"] => u18675976 _ENV["TEXINPUTS"] => :~/.TeX:/usr/share/doc/.TeX:/usr/doc/.TeX _ENV["MINICOM"] => -c on _ENV["INFODIR"] => /usr/local/info:/usr/share/info:/usr/info _ENV["REDIRECT_STATUS"] => 1 _ENV["_"] => /home/u18675976/php-4.3.0RC1/sapi/cli/php _ENV["TEST_PHP_EXECUTABLE"] => /home/u18675976/php-4.3.0RC1/sapi/cli/php _ENV["SHELL"] => /bin/sh _ENV["PRINTER"] => lp _ENV["HOSTTYPE"] => i386 _ENV["WINDOWMANAGER"] => /usr/X11R6/bin/kde _ENV["OSTYPE"] => linux _ENV["no_proxy"] => localhost _ENV["TERM"] => xterm _ENV["HOME"] => /home/u18675976 _ENV["XNLSPATH"] => /usr/X11R6/lib/X11/nls _ENV["PATH"] => /usr/local/bin:/usr/bin:/usr/X11R6/bin:/bin:/usr/games/bin:/usr/games:/opt/gnome/bin:/opt/kde2/bin:. _ENV["FROM_HEADER"] => schlueetrs.de _ENV["LC_COLLATE"] => POSIX _ENV["SSH_TTY"] => /dev/pts/0 _ENV["CONTENT_TYPE"] => PHP License This program is free software; you can redistribute it and/or modify it under the terms of the PHP License as published by the PHP Group and included in the distribution in the file: LICENSE This program is distributed in the hope that it will be useful, but WITHOUT ANY WARRANTY; without even the implied warranty of MERCHANTABILITY or FITNESS FOR A PARTICULAR PURPOSE. If you did not receive a copy of the PHP license, or have any questions about PHP licensing, please contact license@php.net.

« previous php.qa (#6959) next »