Test results

From: Date: Sat, 23 Nov 2002 21:32:38 +0000
Subject: Test results
Groups: php.qa 
Request: Send a blank email to php-qa+get-6973@lists.php.net to get a copy of this message
===================================================================== FAILED TEST SUMMARY --------------------------------------------------------------------- Static variables in functions [tests/func/002.phpt] General function test [tests/func/003.phpt] General function test [tests/func/004.phpt] Alternative syntaxes test [tests/lang/033.phpt] Bug #20175 (Static vars can't store ref to new instance) [tests/lang/bug20175.phpt] session object deserialization [ext/session/tests/003.phpt] session_set_save_handler test [ext/session/tests/004.phpt] custom save handler, multiple session_start()s, complex data structure test. [ext/session/tests/005.phpt] User-space streams [ext/standard/tests/file/userstreams.phpt] ===================================================================== ================================================================================ /dat/dev/php/php-4.4.0dev-zend2/tests/func/002.phpt ================================================================================ ---- EXPECTED OUTPUT hey=0, 0 hey=1, -1 hey=2, -2 ---- ACTUAL OUTPUT Parse error: parse error in /dat/dev/php/php-4.4.0dev-zend2/tests/func/002.php on line 2 ---- FAILED ================================================================================ 001- hey=0, 0 001+ Parse error: parse error in /dat/dev/php/php-4.4.0dev-zend2/tests/func/002.php on line 2 002- hey=1, -1 003- hey=2, -2 ================================================================================ ================================================================================ /dat/dev/php/php-4.4.0dev-zend2/tests/func/003.phpt ================================================================================ ---- EXPECTED OUTPUT hey blah hey blah Counting from 7 to 14 7 8 9 10 11 12 13 14 hey factorial(0) = 1 factorial(1) = 1 factorial(2) = 2 factorial(3) = 6 factorial(4) = 24 factorial(5) = 120 factorial(6) = 720 factorial(7) = 5040 factorial(8) = 40320 factorial(9) = 362880 factorial(10) = 3628800 factorial(0) = 1 factorial(1) = 1 factorial(2) = 2 factorial(3) = 6 factorial(4) = 24 factorial(5) = 120 factorial(6) = 720 factorial(7) = 5040 factorial(8) = 40320 factorial(9) = 362880 factorial(10) = 3628800 factorial(0) = 1 factorial(1) = 1 factorial(2) = 2 factorial(3) = 6 factorial(4) = 24 factorial(5) = 120 factorial(6) = 720 factorial(7) = 5040 factorial(8) = 40320 factorial(9) = 362880 factorial(10) = 3628800 factorial(0) = 1 factorial(1) = 1 factorial(2) = 2 factorial(3) = 6 factorial(4) = 24 factorial(5) = 120 factorial(6) = 720 factorial(7) = 5040 factorial(8) = 40320 factorial(9) = 362880 factorial(10) = 3628800 factorial(0) = 1 factorial(1) = 1 factorial(2) = 2 factorial(3) = 6 factorial(4) = 24 factorial(5) = 120 factorial(6) = 720 factorial(7) = 5040 factorial(8) = 40320 factorial(9) = 362880 factorial(10) = 3628800 factorial(0) = 1 factorial(1) = 1 factorial(2) = 2 factorial(3) = 6 factorial(4) = 24 factorial(5) = 120 factorial(6) = 720 factorial(7) = 5040 factorial(8) = 40320 factorial(9) = 362880 factorial(10) = 3628800 factorial(0) = 1 factorial(1) = 1 factorial(2) = 2 factorial(3) = 6 factorial(4) = 24 factorial(5) = 120 factorial(6) = 720 factorial(7) = 5040 factorial(8) = 40320 factorial(9) = 362880 factorial(10) = 3628800 factorial(0) = 1 factorial(1) = 1 factorial(2) = 2 factorial(3) = 6 factorial(4) = 24 factorial(5) = 120 factorial(6) = 720 factorial(7) = 5040 factorial(8) = 40320 factorial(9) = 362880 factorial(10) = 3628800 factorial(0) = 1 factorial(1) = 1 factorial(2) = 2 factorial(3) = 6 factorial(4) = 24 factorial(5) = 120 factorial(6) = 720 factorial(7) = 5040 factorial(8) = 40320 factorial(9) = 362880 factorial(10) = 3628800 factorial(0) = 1 factorial(1) = 1 factorial(2) = 2 factorial(3) = 6 factorial(4) = 24 factorial(5) = 120 factorial(6) = 720 factorial(7) = 5040 factorial(8) = 40320 factorial(9) = 362880 factorial(10) = 3628800 and now, from a function... (it should break at 5...) factorial(0) = 1 factorial(1) = 1 factorial(2) = 2 factorial(3) = 6 factorial(4) = 24 (it should break at 5...) factorial(0) = 1 factorial(1) = 1 factorial(2) = 2 factorial(3) = 6 factorial(4) = 24 (it should break at 5...) factorial(0) = 1 factorial(1) = 1 factorial(2) = 2 factorial(3) = 6 factorial(4) = 24 (it should break at 5...) factorial(0) = 1 factorial(1) = 1 factorial(2) = 2 factorial(3) = 6 factorial(4) = 24 (it should break at 5...) factorial(0) = 1 factorial(1) = 1 factorial(2) = 2 factorial(3) = 6 factorial(4) = 24 (it should break at 5...) factorial(0) = 1 factorial(1) = 1 factorial(2) = 2 factorial(3) = 6 factorial(4) = 24 (it should break at 5...) factorial(0) = 1 factorial(1) = 1 factorial(2) = 2 factorial(3) = 6 factorial(4) = 24 (it should break at 5...) factorial(0) = 1 factorial(1) = 1 factorial(2) = 2 factorial(3) = 6 factorial(4) = 24 (it should break at 5...) factorial(0) = 1 factorial(1) = 1 factorial(2) = 2 factorial(3) = 6 factorial(4) = 24 (it should break at 5...) factorial(0) = 1 factorial(1) = 1 factorial(2) = 2 factorial(3) = 6 factorial(4) = 24 ------ 720 840 3 4 5 ---- ACTUAL OUTPUT Parse error: parse error in /dat/dev/php/php-4.4.0dev-zend2/tests/func/003.php on line 3 ---- FAILED ================================================================================ 001- hey 001+ Parse error: parse error in /dat/dev/php/php-4.4.0dev-zend2/tests/func/003.php on line 3 002- blah 003- hey 004- blah 005- Counting from 7 to 14 006- 7 007- 8 008- 9 009- 10 010- 11 011- 12 012- 13 013- 14 014- hey 015- factorial(0) = 1 016- factorial(1) = 1 017- factorial(2) = 2 018- factorial(3) = 6 019- factorial(4) = 24 020- factorial(5) = 120 021- factorial(6) = 720 022- factorial(7) = 5040 023- factorial(8) = 40320 024- factorial(9) = 362880 025- factorial(10) = 3628800 026- factorial(0) = 1 027- factorial(1) = 1 028- factorial(2) = 2 029- factorial(3) = 6 030- factorial(4) = 24 031- factorial(5) = 120 032- factorial(6) = 720 033- factorial(7) = 5040 034- factorial(8) = 40320 035- factorial(9) = 362880 036- factorial(10) = 3628800 037- factorial(0) = 1 038- factorial(1) = 1 039- factorial(2) = 2 040- factorial(3) = 6 041- factorial(4) = 24 042- factorial(5) = 120 043- factorial(6) = 720 044- factorial(7) = 5040 045- factorial(8) = 40320 046- factorial(9) = 362880 047- factorial(10) = 3628800 048- factorial(0) = 1 049- factorial(1) = 1 050- factorial(2) = 2 051- factorial(3) = 6 052- factorial(4) = 24 053- factorial(5) = 120 054- factorial(6) = 720 055- factorial(7) = 5040 056- factorial(8) = 40320 057- factorial(9) = 362880 058- factorial(10) = 3628800 059- factorial(0) = 1 060- factorial(1) = 1 061- factorial(2) = 2 062- factorial(3) = 6 063- factorial(4) = 24 064- factorial(5) = 120 065- factorial(6) = 720 066- factorial(7) = 5040 067- factorial(8) = 40320 068- factorial(9) = 362880 069- factorial(10) = 3628800 070- factorial(0) = 1 071- factorial(1) = 1 072- factorial(2) = 2 073- factorial(3) = 6 074- factorial(4) = 24 075- factorial(5) = 120 076- factorial(6) = 720 077- factorial(7) = 5040 078- factorial(8) = 40320 079- factorial(9) = 362880 080- factorial(10) = 3628800 081- factorial(0) = 1 082- factorial(1) = 1 083- factorial(2) = 2 084- factorial(3) = 6 085- factorial(4) = 24 086- factorial(5) = 120 087- factorial(6) = 720 088- factorial(7) = 5040 089- factorial(8) = 40320 090- factorial(9) = 362880 091- factorial(10) = 3628800 092- factorial(0) = 1 093- factorial(1) = 1 094- factorial(2) = 2 095- factorial(3) = 6 096- factorial(4) = 24 097- factorial(5) = 120 098- factorial(6) = 720 099- factorial(7) = 5040 100- factorial(8) = 40320 101- factorial(9) = 362880 102- factorial(10) = 3628800 103- factorial(0) = 1 104- factorial(1) = 1 105- factorial(2) = 2 106- factorial(3) = 6 107- factorial(4) = 24 108- factorial(5) = 120 109- factorial(6) = 720 110- factorial(7) = 5040 111- factorial(8) = 40320 112- factorial(9) = 362880 113- factorial(10) = 3628800 114- factorial(0) = 1 115- factorial(1) = 1 116- factorial(2) = 2 117- factorial(3) = 6 118- factorial(4) = 24 119- factorial(5) = 120 120- factorial(6) = 720 121- factorial(7) = 5040 122- factorial(8) = 40320 123- factorial(9) = 362880 124- factorial(10) = 3628800 125- and now, from a function... 126- (it should break at 5...) 127- factorial(0) = 1 128- factorial(1) = 1 129- factorial(2) = 2 130- factorial(3) = 6 131- factorial(4) = 24 132- (it should break at 5...) 133- factorial(0) = 1 134- factorial(1) = 1 135- factorial(2) = 2 136- factorial(3) = 6 137- factorial(4) = 24 138- (it should break at 5...) 139- factorial(0) = 1 140- factorial(1) = 1 141- factorial(2) = 2 142- factorial(3) = 6 143- factorial(4) = 24 144- (it should break at 5...) 145- factorial(0) = 1 146- factorial(1) = 1 147- factorial(2) = 2 148- factorial(3) = 6 149- factorial(4) = 24 150- (it should break at 5...) 151- factorial(0) = 1 152- factorial(1) = 1 153- factorial(2) = 2 154- factorial(3) = 6 155- factorial(4) = 24 156- (it should break at 5...) 157- factorial(0) = 1 158- factorial(1) = 1 159- factorial(2) = 2 160- factorial(3) = 6 161- factorial(4) = 24 162- (it should break at 5...) 163- factorial(0) = 1 164- factorial(1) = 1 165- factorial(2) = 2 166- factorial(3) = 6 167- factorial(4) = 24 168- (it should break at 5...) 169- factorial(0) = 1 170- factorial(1) = 1 171- factorial(2) = 2 172- factorial(3) = 6 173- factorial(4) = 24 174- (it should break at 5...) 175- factorial(0) = 1 176- factorial(1) = 1 177- factorial(2) = 2 178- factorial(3) = 6 179- factorial(4) = 24 180- (it should break at 5...) 181- factorial(0) = 1 182- factorial(1) = 1 183- factorial(2) = 2 184- factorial(3) = 6 185- factorial(4) = 24 186- ------ 187- 720 188- 840 189- 3 190- 4 191- 5 ================================================================================ ================================================================================ /dat/dev/php/php-4.4.0dev-zend2/tests/func/004.phpt ================================================================================ ---- EXPECTED OUTPUT Before function declaration... After function declaration... Calling function for the first time... ---- In function, printing the string "This works!" 10 times 0) This works! 1) This works! 2) This works! 3) This works! 4) This works! 5) This works! 6) This works! 7) This works! 8) This works! 9) This works! Done with function... ----- Returned from function call... Calling the function for the second time... ---- In function, printing the string "This like, really works and stuff..." 3 times 0) This like, really works and stuff... 1) This like, really works and stuff... 2) This like, really works and stuff... Done with function... ----- Returned from function call... This is some other function, to ensure more than just one function works fine... ---- ACTUAL OUTPUT Parse error: parse error in /dat/dev/php/php-4.4.0dev-zend2/tests/func/004.php on line 5 ---- FAILED ================================================================================ 001- Before function declaration... 001+ Parse error: parse error in /dat/dev/php/php-4.4.0dev-zend2/tests/func/004.php on line 5 002- After function declaration... 003- Calling function for the first time... 004- ---- 005- In function, printing the string "This works!" 10 times 006- 0) This works! 007- 1) This works! 008- 2) This works! 009- 3) This works! 010- 4) This works! 011- 5) This works! 012- 6) This works! 013- 7) This works! 014- 8) This works! 015- 9) This works! 016- Done with function... 017- ----- 018- Returned from function call... 019- Calling the function for the second time... 020- ---- 021- In function, printing the string "This like, really works and stuff..." 3 times 022- 0) This like, really works and stuff... 023- 1) This like, really works and stuff... 024- 2) This like, really works and stuff... 025- Done with function... 026- ----- 027- Returned from function call... 028- This is some other function, to ensure more than just one function works fine... ================================================================================ ================================================================================ /dat/dev/php/php-4.4.0dev-zend2/tests/lang/033.phpt ================================================================================ ---- EXPECTED OUTPUT If: 11 While: 12346789 For: 0123401234 Switch: 1 old_function: foo(1, 2); ---- ACTUAL OUTPUT Parse error: parse error in /dat/dev/php/php-4.4.0dev-zend2/tests/lang/033.php on line 38 ---- FAILED ================================================================================ 001- If: 11 001+ Parse error: parse error in /dat/dev/php/php-4.4.0dev-zend2/tests/lang/033.php on line 38 002- While: 12346789 003- For: 0123401234 004- Switch: 1 005- old_function: foo(1, 2); ================================================================================ ================================================================================ /dat/dev/php/php-4.4.0dev-zend2/tests/lang/bug20175.phpt ================================================================================ ---- EXPECTED OUTPUT %s foo_static() foo_global() foo:1 foo_static() foo:1 bar_static() bar_global() bar:1 bar_static() bar_global() bar:2 wow_static() wow_global() wow:1 wow_static() wow:1 oop_test() oop_static() oop_class() oop:1 oop_static() oop:1 oop_test() oop_static() oop:1 ---- ACTUAL OUTPUT Parse error: parse error, expecting `'('' in /dat/dev/php/php-4.4.0dev-zend2/tests/lang/bug20175.php on line 109 ---- FAILED ================================================================================ 001- %s 001+ Parse error: parse error, expecting `'('' in /dat/dev/php/php-4.4.0dev-zend2/tests/lang/bug20175.php on line 109 002- foo_static() 003- foo_global() 004- foo:1 005- foo_static() 006- foo:1 007- bar_static() 008- bar_global() 009- bar:1 010- bar_static() 011- bar_global() 012- bar:2 013- wow_static() 014- wow_global() 015- wow:1 016- wow_static() 017- wow:1 018- oop_test() 019- oop_static() 020- oop_class() 021- oop:1 022- oop_static() 023- oop:1 024- oop_test() 025- oop_static() 026- oop:1 ================================================================================ ================================================================================ /dat/dev/php/php-4.4.0dev-zend2/ext/session/tests/003.phpt ================================================================================ ---- EXPECTED OUTPUT object(foo)(2) { ["bar"]=> string(2) "ok" ["yes"]=> int(2) } array(1) { [3]=> &object(foo)(2) { ["bar"]=> string(2) "ok" ["yes"]=> int(2) } } ---- ACTUAL OUTPUT object(foo)(2) { ["bar"]=> string(2) "ok" ["yes"]=> int(2) } array(1) { [3]=> object(foo)(2) { ["bar"]=> string(2) "ok" ["yes"]=> int(2) } } ---- FAILED ================================================================================ 009- &object(foo)(2) { 009+ object(foo)(2) { ================================================================================ ================================================================================ /dat/dev/php/php-4.4.0dev-zend2/ext/session/tests/004.phpt ================================================================================ ---- EXPECTED OUTPUT OPEN: PHPSESSID READ: abtest object(foo)(2) { ["bar"]=> string(2) "ok" ["yes"]=> int(2) } array(1) { [3]=> &object(foo)(2) { ["bar"]=> string(2) "ok" ["yes"]=> int(2) } } WRITE: abtest, baz|O:3:"foo":2:{s:3:"bar";s:2:"ok";s:3:"yes";i:2;}arr|a:1:{i:3;O:3:"foo":2:{s:3:"bar";s:2:"ok";s:3:"yes";i:2;}} OPEN: PHPSESSID READ: abtest object(foo)(2) { ["bar"]=> string(2) "ok" ["yes"]=> int(2) } array(1) { [3]=> object(foo)(2) { ["bar"]=> string(2) "ok" ["yes"]=> int(2) } } DESTROY: abtest ---- ACTUAL OUTPUT OPEN: PHPSESSID READ: abtest object(foo)(2) { ["bar"]=> string(2) "ok" ["yes"]=> int(2) } array(1) { [3]=> object(foo)(2) { ["bar"]=> string(2) "ok" ["yes"]=> int(2) } } WRITE: abtest, baz|O:3:"foo":2:{s:3:"bar";s:2:"ok";s:3:"yes";i:2;}arr|a:1:{i:3;O:3:"foo":2:{s:3:"bar";s:2:"ok";s:3:"yes";i:2;}} OPEN: PHPSESSID READ: abtest object(foo)(2) { ["bar"]=> string(2) "ok" ["yes"]=> int(2) } array(1) { [3]=> object(foo)(2) { ["bar"]=> string(2) "ok" ["yes"]=> int(2) } } DESTROY: abtest ---- FAILED ================================================================================ 011- &object(foo)(2) { 011+ object(foo)(2) { ================================================================================ ================================================================================ /dat/dev/php/php-4.4.0dev-zend2/ext/session/tests/005.phpt ================================================================================ ---- EXPECTED OUTPUT OPEN: PHPSESSID READ: abtest object(foo)(2) { ["bar"]=> string(2) "ok" ["yes"]=> int(2) } array(1) { [3]=> &object(foo)(2) { ["bar"]=> string(2) "ok" ["yes"]=> int(2) } } WRITE: abtest, baz|O:3:"foo":2:{s:3:"bar";s:2:"ok";s:3:"yes";i:2;}arr|a:1:{i:3;O:3:"foo":2:{s:3:"bar";s:2:"ok";s:3:"yes";i:2;}} CLOSE OPEN: PHPSESSID READ: abtest object(foo)(2) { ["bar"]=> string(2) "ok" ["yes"]=> int(3) } array(1) { [3]=> &object(foo)(2) { ["bar"]=> string(2) "ok" ["yes"]=> int(3) } } int(123) WRITE: abtest, baz|O:3:"foo":2:{s:3:"bar";s:2:"ok";s:3:"yes";i:3;}arr|a:1:{i:3;O:3:"foo":2:{s:3:"bar";s:2:"ok";s:3:"yes";i:3;}}c|i:123; CLOSE OPEN: PHPSESSID READ: abtest object(foo)(2) { ["bar"]=> string(2) "ok" ["yes"]=> int(3) } array(1) { [3]=> object(foo)(2) { ["bar"]=> string(2) "ok" ["yes"]=> int(3) } } int(123) DESTROY: abtest CLOSE ---- ACTUAL OUTPUT OPEN: PHPSESSID READ: abtest object(foo)(2) { ["bar"]=> string(2) "ok" ["yes"]=> int(2) } array(1) { [3]=> object(foo)(2) { ["bar"]=> string(2) "ok" ["yes"]=> int(2) } } WRITE: abtest, baz|O:3:"foo":2:{s:3:"bar";s:2:"ok";s:3:"yes";i:2;}arr|a:1:{i:3;O:3:"foo":2:{s:3:"bar";s:2:"ok";s:3:"yes";i:2;}} CLOSE OPEN: PHPSESSID READ: abtest object(foo)(2) { ["bar"]=> string(2) "ok" ["yes"]=> int(3) } array(1) { [3]=> object(foo)(2) { ["bar"]=> string(2) "ok" ["yes"]=> int(3) } } int(123) WRITE: abtest, baz|O:3:"foo":2:{s:3:"bar";s:2:"ok";s:3:"yes";i:3;}arr|a:1:{i:3;O:3:"foo":2:{s:3:"bar";s:2:"ok";s:3:"yes";i:3;}}c|i:123; CLOSE OPEN: PHPSESSID READ: abtest object(foo)(2) { ["bar"]=> string(2) "ok" ["yes"]=> int(3) } array(1) { [3]=> object(foo)(2) { ["bar"]=> string(2) "ok" ["yes"]=> int(3) } } int(123) DESTROY: abtest CLOSE ---- FAILED ================================================================================ 011- &object(foo)(2) { 011+ object(foo)(2) { 030- &object(foo)(2) { 030+ object(foo)(2) { ================================================================================ ================================================================================ /dat/dev/php/php-4.4.0dev-zend2/ext/standard/tests/file/userstreams.phpt ================================================================================ ---- EXPECTED OUTPUT Not Registered Registered Registered SEEK: OK FGETS: OK ---- ACTUAL OUTPUT Not Registered Registered Registered SEEK: OK FGETS: OK Fatal error: Trying to access invalid object in Unknown on line 0 ---- FAILED ================================================================================ 006+ 007+ Fatal error: Trying to access invalid object in Unknown on line 0 ================================================================================ ================================================================================ BUILD ENVIRONMENT ================================================================================ OS: Linux Automake: automake (GNU automake) 1.5 Written by Tom Tromey <tromey@cygnus.com>. Copyright 1994, 1995, 1996, 1997, 1998, 1999, 2000, 2001 Free Software Foundation, Inc. This is free software; see the source for copying conditions. There is NO warranty; not even for MERCHANTABILITY or FITNESS FOR A PARTICULAR PURPOSE. Autoconf: Autoconf version 2.13 Libtool: ltmain.sh (GNU libtool) 1.4.2 (1.922.2.54 2001/09/11 03:33:37) Compiler: Reading specs from /usr/lib/gcc-lib/i386-redhat-linux/2.96/specs gcc version 2.96 20000731 (Red Hat Linux 7.1 2.96-85) Bison: GNU Bison version 1.28 ================================================================================ PHPINFO ================================================================================ phpinfo() PHP Version => 4.4.0-dev System => Linux kossu.office.jdimedia.nl 2.4.18 #15 Fri Jun 14 13:27:20 CEST 2002 i686 Build Date => Nov 23 2002 22:27:41 Configure Command => './configure' Server API => Command Line Interface Virtual Directory Support => disabled Configuration File (php.ini) Path => /usr/local/lib PHP API => 20020918 PHP Extension => 20020429 Zend Extension => 90021012 Debug Build => no Thread Safety => disabled Registered PHP Streams => php, http, ftp This program makes use of the Zend Scripting Language Engine: Zend Engine v2.0.0-alpha3, Copyright (c) 1998-2002 Zend Technologies _______________________________________________________________________ Configuration PHP Core Directive => Local Value => Master Value allow_call_time_pass_reference => On => On allow_url_fopen => On => On always_populate_raw_post_data => Off => Off arg_separator.input => &amp; => &amp; arg_separator.output => &amp; => &amp; asp_tags => Off => Off auto_append_file => no value => no value auto_prepend_file => no value => no value browscap => no value => no value default_charset => no value => no value default_mimetype => text/html => text/html define_syslog_variables => Off => Off disable_functions => no value => no value display_errors => On => On display_startup_errors => Off => Off doc_root => no value => no value docref_ext => no value => no value docref_root => http://www.php.net/ => http://www.php.net/ enable_dl => On => On error_append_string => no value => no value error_log => no value => no value error_prepend_string => no value => no value error_reporting => no value => no value expose_php => On => On extension_dir => /usr/local/lib/php/extensions/no-debug-non-zts-20020429 => /usr/local/lib/php/extensions/no-debug-non-zts-20020429 file_uploads => On => On gpc_order => GPC => GPC highlight.bg => #FFFFFF => #FFFFFF highlight.comment => #FF8000 => #FF8000 highlight.default => #0000BB => #0000BB highlight.html => #000000 => #000000 highlight.keyword => #007700 => #007700 highlight.string => #DD0000 => #DD0000 html_errors => Off => On ignore_repeated_errors => Off => Off ignore_repeated_source => Off => Off ignore_user_abort => Off => Off implicit_flush => On => Off include_path => .:/usr/local/lib/php => .:/usr/local/lib/php log_errors => Off => Off log_errors_max_len => 1024 => 1024 magic_quotes_gpc => On => On magic_quotes_runtime => Off => Off magic_quotes_sybase => Off => Off max_execution_time => 0 => 30 max_input_time => -1 => -1 open_basedir => no value => no value output_buffering => 0 => 0 output_handler => no value => no value post_max_size => 8M => 8M precision => 14 => 14 register_argc_argv => On => On register_globals => Off => Off report_memleaks => On => On report_zend_debug => On => On safe_mode => Off => Off safe_mode_exec_dir => 1 => 1 safe_mode_gid => Off => Off safe_mode_include_dir => no value => no value sendmail_from => no value => no value sendmail_path => /usr/sbin/sendmail -t -i => /usr/sbin/sendmail -t -i short_open_tag => On => On SMTP => localhost => localhost smtp_port => 25 => 25 sql.safe_mode => Off => Off track_errors => Off => Off unserialize_callback_func => no value => no value upload_max_filesize => 2M => 2M upload_tmp_dir => no value => no value user_dir => no value => no value variables_order => no value => no value xmlrpc_error_number => 0 => 0 xmlrpc_errors => Off => Off y2k_compliance => On => On ctype ctype functions => enabled mysql MySQL Support => enabled Active Persistent Links => 0 Active Links => 0 Client API version => 3.23.49 MYSQL_MODULE_TYPE => builtin MYSQL_SOCKET => /var/lib/mysql/mysql.sock MYSQL_INCLUDE => MYSQL_LIBS => Directive => Local Value => Master Value mysql.allow_persistent => On => On mysql.connect_timeout => -1 => -1 mysql.default_host => no value => no value mysql.default_password => no value => no value mysql.default_port => no value => no value mysql.default_socket => no value => no value mysql.default_user => no value => no value mysql.max_links => Unlimited => Unlimited mysql.max_persistent => Unlimited => Unlimited mysql.trace_mode => Off => Off pcre PCRE (Perl Compatible Regular Expressions) Support => enabled PCRE Library Version => 3.92 11-Sep-2002 posix Revision => $Revision: 1.51 $ session Session Support => enabled Registered save handlers => files user Directive => Local Value => Master Value session.auto_start => Off => Off session.bug_compat_42 => On => On session.bug_compat_warn => On => On session.cache_expire => 180 => 180 session.cache_limiter => nocache => nocache session.cookie_domain => no value => no value session.cookie_lifetime => 0 => 0 session.cookie_path => / => / session.cookie_secure => Off => Off session.entropy_file => no value => no value session.entropy_length => 0 => 0 session.gc_dividend => 100 => 100 session.gc_maxlifetime => 1440 => 1440 session.gc_probability => 1 => 1 session.name => PHPSESSID => PHPSESSID session.referer_check => no value => no value session.save_handler => files => files session.save_path => /tmp => /tmp session.serialize_handler => php => php session.use_cookies => On => On session.use_only_cookies => Off => Off session.use_trans_sid => Off => Off standard Regex Library => Bundled library enabled Dynamic Library Support => enabled Path to sendmail => /usr/sbin/sendmail -t -i Directive => Local Value => Master Value assert.active => 1 => 1 assert.bail => 0 => 0 assert.callback => no value => no value assert.quiet_eval => 0 => 0 assert.warning => 1 => 1 auto_detect_line_endings => 0 => 0 default_socket_timeout => 60 => 60 safe_mode_allowed_env_vars => PHP_ => PHP_ safe_mode_protected_env_vars => LD_LIBRARY_PATH => LD_LIBRARY_PATH url_rewriter.tags => a=href,area=href,frame=src,form=,fieldset= => a=href,area=href,frame=src,form=,fieldset= user_agent => no value => no value tokenizer Tokenizer Support => enabled xml XML Support => active XML Namespace Support => active EXPAT Version => 1.95.5 Additional Modules Module Name Environment Variable => Value PWD => /dat/dev/php/php-4.4.0dev-zend2 MAKEFLAGS => SCRIPT_FILENAME => MFLAGS => HOSTNAME => kossu.office.jdimedia.nl QTDIR => /usr/lib/qt-2.3.0 LESSOPEN => |/usr/bin/lesspipe.sh %s CC => gcc REQUEST_METHOD => LS_COLORS => no=00:fi=00:di=01;34:ln=01;36:pi=40;33:so=01;35:bd=40;33;01:cd=40;33;01:or=01;05;37;41:mi=01;05;37;41:ex=01;32:*.cmd=01;32:*.exe=01;32:*.com=01;32:*.btm=01;32:*.bat=01;32:*.sh=01;32:*.csh=01;32:*.tar=01;31:*.tgz=01;31:*.arj=01;31:*.taz=01;31:*.lzh=01;31:*.zip=01;31:*.z=01;31:*.Z=01;31:*.gz=01;31:*.bz2=01;31:*.bz=01;31:*.tz=01;31:*.rpm=01;31:*.cpio=01;31:*.jpg=01;35:*.gif=01;35:*.bmp=01;35:*.xbm=01;35:*.xpm=01;35:*.png=01;35:*.tif=01;35: USER => root MACHTYPE => i386-redhat-linux-gnu TEST_PHP_SRCDIR => /dat/dev/php/php-4.4.0dev-zend2 MAIL => /var/spool/mail/root INPUTRC => /etc/inputrc BASH_ENV => /root/.bashrc PATH_TRANSLATED => LANG => en_US QUERY_STRING => CONTENT_LENGTH => MAKELEVEL => 1 DISPLAY => :0 SHLVL => 3 LOGNAME => root REDIRECT_STATUS => _ => /dat/dev/php/php-4.4.0dev-zend2/sapi/cli/php TEST_PHP_EXECUTABLE => /dat/dev/php/php-4.4.0dev-zend2/sapi/cli/php SHELL => /bin/sh USERNAME => root HOSTTYPE => i386 HISTSIZE => 1000 OSTYPE => linux-gnu TERM => xterm HOME => /root SSH_ASKPASS => /usr/libexec/openssh/gnome-ssh-askpass PATH => /usr/local/sbin:/usr/sbin:/sbin:/bin:/sbin:/usr/bin:/usr/sbin:/usr/local/bin:/usr/local/sbin:/usr/bin/X11:/usr/X11R6/bin:/root/bin CONTENT_TYPE => PHP Variables Variable => Value _SERVER["PWD"] => /dat/dev/php/php-4.4.0dev-zend2 _SERVER["MAKEFLAGS"] => _SERVER["SCRIPT_FILENAME"] => _SERVER["MFLAGS"] => _SERVER["HOSTNAME"] => kossu.office.jdimedia.nl _SERVER["QTDIR"] => /usr/lib/qt-2.3.0 _SERVER["LESSOPEN"] => |/usr/bin/lesspipe.sh %s _SERVER["CC"] => gcc _SERVER["REQUEST_METHOD"] => _SERVER["LS_COLORS"] => no=00:fi=00:di=01;34:ln=01;36:pi=40;33:so=01;35:bd=40;33;01:cd=40;33;01:or=01;05;37;41:mi=01;05;37;41:ex=01;32:*.cmd=01;32:*.exe=01;32:*.com=01;32:*.btm=01;32:*.bat=01;32:*.sh=01;32:*.csh=01;32:*.tar=01;31:*.tgz=01;31:*.arj=01;31:*.taz=01;31:*.lzh=01;31:*.zip=01;31:*.z=01;31:*.Z=01;31:*.gz=01;31:*.bz2=01;31:*.bz=01;31:*.tz=01;31:*.rpm=01;31:*.cpio=01;31:*.jpg=01;35:*.gif=01;35:*.bmp=01;35:*.xbm=01;35:*.xpm=01;35:*.png=01;35:*.tif=01;35: _SERVER["USER"] => root _SERVER["MACHTYPE"] => i386-redhat-linux-gnu _SERVER["TEST_PHP_SRCDIR"] => /dat/dev/php/php-4.4.0dev-zend2 _SERVER["MAIL"] => /var/spool/mail/root _SERVER["INPUTRC"] => /etc/inputrc _SERVER["BASH_ENV"] => /root/.bashrc _SERVER["PATH_TRANSLATED"] => _SERVER["LANG"] => en_US _SERVER["QUERY_STRING"] => _SERVER["CONTENT_LENGTH"] => _SERVER["MAKELEVEL"] => 1 _SERVER["DISPLAY"] => :0 _SERVER["SHLVL"] => 3 _SERVER["LOGNAME"] => root _SERVER["REDIRECT_STATUS"] => _SERVER["_"] => /dat/dev/php/php-4.4.0dev-zend2/sapi/cli/php _SERVER["TEST_PHP_EXECUTABLE"] => /dat/dev/php/php-4.4.0dev-zend2/sapi/cli/php _SERVER["SHELL"] => /bin/sh _SERVER["USERNAME"] => root _SERVER["HOSTTYPE"] => i386 _SERVER["HISTSIZE"] => 1000 _SERVER["OSTYPE"] => linux-gnu _SERVER["TERM"] => xterm _SERVER["HOME"] => /root _SERVER["SSH_ASKPASS"] => /usr/libexec/openssh/gnome-ssh-askpass _SERVER["PATH"] => /usr/local/sbin:/usr/sbin:/sbin:/bin:/sbin:/usr/bin:/usr/sbin:/usr/local/bin:/usr/local/sbin:/usr/bin/X11:/usr/X11R6/bin:/root/bin _SERVER["CONTENT_TYPE"] => _SERVER["PHP_SELF"] => _SERVER["SCRIPT_NAME"] => _SERVER["DOCUMENT_ROOT"] => _SERVER["argv"] => Array ( ) _SERVER["argc"] => 0 _ENV["PWD"] => /dat/dev/php/php-4.4.0dev-zend2 _ENV["MAKEFLAGS"] => _ENV["SCRIPT_FILENAME"] => _ENV["MFLAGS"] => _ENV["HOSTNAME"] => kossu.office.jdimedia.nl _ENV["QTDIR"] => /usr/lib/qt-2.3.0 _ENV["LESSOPEN"] => |/usr/bin/lesspipe.sh %s _ENV["CC"] => gcc _ENV["REQUEST_METHOD"] => _ENV["LS_COLORS"] => no=00:fi=00:di=01;34:ln=01;36:pi=40;33:so=01;35:bd=40;33;01:cd=40;33;01:or=01;05;37;41:mi=01;05;37;41:ex=01;32:*.cmd=01;32:*.exe=01;32:*.com=01;32:*.btm=01;32:*.bat=01;32:*.sh=01;32:*.csh=01;32:*.tar=01;31:*.tgz=01;31:*.arj=01;31:*.taz=01;31:*.lzh=01;31:*.zip=01;31:*.z=01;31:*.Z=01;31:*.gz=01;31:*.bz2=01;31:*.bz=01;31:*.tz=01;31:*.rpm=01;31:*.cpio=01;31:*.jpg=01;35:*.gif=01;35:*.bmp=01;35:*.xbm=01;35:*.xpm=01;35:*.png=01;35:*.tif=01;35: _ENV["USER"] => root _ENV["MACHTYPE"] => i386-redhat-linux-gnu _ENV["TEST_PHP_SRCDIR"] => /dat/dev/php/php-4.4.0dev-zend2 _ENV["MAIL"] => /var/spool/mail/root _ENV["INPUTRC"] => /etc/inputrc _ENV["BASH_ENV"] => /root/.bashrc _ENV["PATH_TRANSLATED"] => _ENV["LANG"] => en_US _ENV["QUERY_STRING"] => _ENV["CONTENT_LENGTH"] => _ENV["MAKELEVEL"] => 1 _ENV["DISPLAY"] => :0 _ENV["SHLVL"] => 3 _ENV["LOGNAME"] => root _ENV["REDIRECT_STATUS"] => _ENV["_"] => /dat/dev/php/php-4.4.0dev-zend2/sapi/cli/php _ENV["TEST_PHP_EXECUTABLE"] => /dat/dev/php/php-4.4.0dev-zend2/sapi/cli/php _ENV["SHELL"] => /bin/sh _ENV["USERNAME"] => root _ENV["HOSTTYPE"] => i386 _ENV["HISTSIZE"] => 1000 _ENV["OSTYPE"] => linux-gnu _ENV["TERM"] => xterm _ENV["HOME"] => /root _ENV["SSH_ASKPASS"] => /usr/libexec/openssh/gnome-ssh-askpass _ENV["PATH"] => /usr/local/sbin:/usr/sbin:/sbin:/bin:/sbin:/usr/bin:/usr/sbin:/usr/local/bin:/usr/local/sbin:/usr/bin/X11:/usr/X11R6/bin:/root/bin _ENV["CONTENT_TYPE"] => PHP License This program is free software; you can redistribute it and/or modify it under the terms of the PHP License as published by the PHP Group and included in the distribution in the file: LICENSE This program is distributed in the hope that it will be useful, but WITHOUT ANY WARRANTY; without even the implied warranty of MERCHANTABILITY or FITNESS FOR A PARTICULAR PURPOSE. If you did not receive a copy of the PHP license, or have any questions about PHP licensing, please contact license@php.net.

« previous php.qa (#6973) next »