Test results

From: Date: Mon, 25 Nov 2002 07:07:33 +0000
Subject: Test results
Groups: php.qa 
Request: Send a blank email to php-qa+get-6995@lists.php.net to get a copy of this message
===================================================================== FAILED TEST SUMMARY --------------------------------------------------------------------- File type functions [ext/standard/tests/file/001.phpt] microtime() function [ext/standard/tests/time/001.phpt] strtotime() function [ext/standard/tests/time/002.phpt] Check for mktime with out-of-range parameters [ext/standard/tests/time/003.phpt] String functions [tests/strings/001.phpt] ===================================================================== ================================================================================ /home/Verdana/php4/ext/standard/tests/file/001.phpt ================================================================================ ---- EXPECTED OUTPUT test.file does not exist test.file exists test.link exists test.file is not a symlink test.link is a symlink test.file exists test.link lstat and stat differ at element 1 test.link lstat and stat differ at element 2 test.link lstat and stat differ at element 7 test.link lstat and stat differ at element 8 test.link lstat and stat differ at element 9 test.link lstat and stat differ at element 10 test.file is file test.link is link test.file permissions are 0744 test.file size is 0 test.file is writeable test.file is readable test.file is executable test.file is a regular file test.link is a regular file test.link is not a directory ../file is a directory test.file is not a directory test.file does not exist test.file does not exist ---- ACTUAL OUTPUT test.file does not exist test.file exists test.link exists test.file is not a symlink test.link is a symlink test.file exists test.link lstat and stat differ at element 1 test.link lstat and stat differ at element 2 test.link lstat and stat differ at element 7 test.link lstat and stat differ at element 9 test.link lstat and stat differ at element 10 test.file is file test.link is link test.file permissions are 0644 test.file size is 0 test.file is writeable test.file is readable test.file is not executable test.file is a regular file test.link is a regular file test.link is not a directory ../file is a directory test.file is not a directory test.file does not exist test.file does not exist ---- FAILED ================================================================================ 010- test.link lstat and stat differ at element 8 010+ test.link lstat and stat differ at element 9 011- test.link lstat and stat differ at element 9 011+ test.link lstat and stat differ at element 10 012- test.link lstat and stat differ at element 10 012+ test.file is file 013- test.file is file 013+ test.link is link 014- test.link is link 014+ test.file permissions are 0644 015- test.file permissions are 0744 015+ test.file size is 0 016- test.file size is 0 016+ test.file is writeable 017- test.file is writeable 017+ test.file is readable 018- test.file is readable 018+ test.file is not executable 019- test.file is executable 019+ test.file is a regular file 020- test.file is a regular file 020+ test.link is a regular file 021- test.link is a regular file 021+ test.link is not a directory 022- test.link is not a directory 022+ ../file is a directory 023- ../file is a directory 023+ test.file is not a directory 024- test.file is not a directory 024+ test.file does not exist 026- test.file does not exist ================================================================================ ================================================================================ /home/Verdana/php4/ext/standard/tests/time/001.phpt ================================================================================ ---- EXPECTED OUTPUT Passed: 100000 Failed: 0 ---- ACTUAL OUTPUT Passed: 10076 Failed: 89924 000002: 1038207834 0.51242500 < 1038207834 0.51242500 000003: 1038207834 0.51242500 < 1038207834 0.51242500 000004: 1038207834 0.51242500 < 1038207834 0.51242500 000005: 1038207834 0.51242500 < 1038207834 0.51242500 000006: 1038207834 0.51242500 < 1038207834 0.51242500 000007: 1038207834 0.51242500 < 1038207834 0.51242500 000008: 1038207834 0.51242500 < 1038207834 0.51242500 000010: 1038207834 0.51342500 < 1038207834 0.51342500 000011: 1038207834 0.51342500 < 1038207834 0.51342500 000012: 1038207834 0.51342500 < 1038207834 0.51342500 000013: 1038207834 0.51342500 < 1038207834 0.51342500 ---- FAILED ================================================================================ 001- Passed: 100000 001+ Passed: 10076 002- Failed: 0 002+ Failed: 89924 003+ 000002: 1038207834 0.51242500 < 1038207834 0.51242500 004+ 000003: 1038207834 0.51242500 < 1038207834 0.51242500 005+ 000004: 1038207834 0.51242500 < 1038207834 0.51242500 006+ 000005: 1038207834 0.51242500 < 1038207834 0.51242500 007+ 000006: 1038207834 0.51242500 < 1038207834 0.51242500 008+ 000007: 1038207834 0.51242500 < 1038207834 0.51242500 009+ 000008: 1038207834 0.51242500 < 1038207834 0.51242500 010+ 000010: 1038207834 0.51342500 < 1038207834 0.51342500 011+ 000011: 1038207834 0.51342500 < 1038207834 0.51342500 012+ 000012: 1038207834 0.51342500 < 1038207834 0.51342500 013+ 000013: 1038207834 0.51342500 < 1038207834 0.51342500 ================================================================================ ================================================================================ /home/Verdana/php4/ext/standard/tests/time/002.phpt ================================================================================ ---- EXPECTED OUTPUT 1999-10-13 00:00:00 1999-10-13 00:00:00 2000-01-19 00:00:00 2000-01-19 00:00:00 2001-12-21 00:00:00 2001-12-21 00:00:00 2001-12-21 12:16:00 2001-12-21 12:16:00 1969-12-31 23:59:59 2001-10-22 21:19:58 2001-10-22 23:19:58 2001-10-22 23:32:58 2001-10-22 19:19:58 2001-10-22 19:06:58 1999-10-13 00:00:00 1999-10-13 00:00:00 2000-01-19 00:00:00 2000-01-19 00:00:00 2001-12-21 00:00:00 2001-12-21 00:00:00 2001-12-21 12:16:00 2001-12-21 12:16:00 1970-01-01 00:59:59 2001-10-22 21:19:58 2001-10-23 01:19:58 2001-10-23 01:32:58 2001-10-22 21:19:58 2001-10-22 21:06:58 ---- ACTUAL OUTPUT 1999-10-13 00:00:00 1999-10-13 00:00:00 2000-01-19 00:00:00 2000-01-19 00:00:00 2001-12-21 00:00:00 2001-12-21 00:00:00 2001-12-21 12:16:00 2001-12-21 12:16:00 1969-12-31 23:59:59 2001-10-22 21:19:58 2001-10-22 23:19:58 2001-10-22 23:32:58 2001-10-22 19:19:58 2001-10-22 19:06:58 1999-10-13 00:00:00 1999-10-13 00:00:00 2000-01-19 00:00:00 2000-01-19 00:00:00 2001-12-21 00:00:00 2001-12-21 00:00:00 2001-12-21 12:16:00 2001-12-21 12:16:00 1969-12-31 23:59:59 2001-10-22 21:19:58 2001-10-22 23:19:58 2001-10-22 23:32:58 2001-10-22 19:19:58 2001-10-22 19:06:58 ---- FAILED ================================================================================ 023- 1970-01-01 00:59:59 023+ 1969-12-31 23:59:59 025- 2001-10-23 01:19:58 025+ 2001-10-22 23:19:58 026- 2001-10-23 01:32:58 026+ 2001-10-22 23:32:58 027- 2001-10-22 21:19:58 027+ 2001-10-22 19:19:58 028- 2001-10-22 21:06:58 028+ 2001-10-22 19:06:58 ================================================================================ ================================================================================ /home/Verdana/php4/ext/standard/tests/time/003.phpt ================================================================================ ---- EXPECTED OUTPUT 2000-02-29 2000-02-28 2000-02-29 2001-02-28 2001-03-01 1999-11-30 2000-05-29 12:00:00 2000-05-29 13:00:00 2000-05-29 12:00:00 2000-01-31 12:00:00 2000-01-31 12:00:00 2000-01-31 11:00:00 2000-04-29 12:00:00 2000-04-29 13:00:00 2000-04-29 12:00:00 ---- ACTUAL OUTPUT 2000-02-29 2000-02-28 2000-02-29 2001-02-28 2001-03-01 1999-11-30 2000-05-29 12:00:00 2000-05-29 12:00:00 1969-12-31 23:58:58 2000-01-31 12:00:00 2000-01-31 12:00:00 1969-10-01 23:58:58 2000-04-29 12:00:00 2000-04-29 12:00:00 1969-12-29 23:58:58 ---- FAILED ================================================================================ 008- 2000-05-29 13:00:00 008+ 2000-05-29 12:00:00 009- 2000-05-29 12:00:00 009+ 1969-12-31 23:58:58 012- 2000-01-31 11:00:00 012+ 1969-10-01 23:58:58 014- 2000-04-29 13:00:00 014+ 2000-04-29 12:00:00 015- 2000-04-29 12:00:00 015+ 1969-12-29 23:58:58 ================================================================================ ================================================================================ /home/Verdana/php4/tests/strings/001.phpt ================================================================================ ---- EXPECTED OUTPUT Testing strtok: passed Testing strstr: passed Testing strrchr: passed Testing strtoupper: passed Testing strtolower: passed Testing substr: passed Testing rawurlencode: passed Testing rawurldecode: passed Testing urlencode: passed Testing urldecode: passed Testing quotemeta: passed Testing ufirst: passed Testing strtr: passed Testing addslashes: passed Testing stripslashes: passed Testing uniqid: passed ---- ACTUAL OUTPUT Testing strtok: passed Testing strstr: passed Testing strrchr: passed Testing strtoupper: passed Testing strtolower: passed Testing substr: passed Testing rawurlencode: passed Testing rawurldecode: passed Testing urlencode: passed Testing urldecode: passed Testing quotemeta: passed Testing ufirst: passed Testing strtr: passed Testing addslashes: passed Testing stripslashes: passed Testing uniqid: failed! ---- FAILED ================================================================================ 016- Testing uniqid: passed 016+ Testing uniqid: failed! ================================================================================ ================================================================================ BUILD ENVIRONMENT ================================================================================ OS: CYGWIN_NT-5.0 Automake: automake (GNU automake) 1.4-p5 Copyright (C) 1999, 2001 Free Software Foundation, Inc. This is free software; see the source for copying conditions. There is NO warranty; not even for MERCHANTABILITY or FITNESS FOR A PARTICULAR PURPOSE. Written by Tom Tromey <tromey@cygnus.com> Autoconf: Autoconf version 2.13 Libtool: ltmain.sh (GNU libtool) 1.4.3 (1.922.2.110 2002/10/23 01:39:54) Compiler: Reading specs from /usr/lib/gcc-lib/i686-pc-cygwin/3.2/specs Configured with: /netrel/src/gcc-3.2-3/configure --enable-languages=c,c++,f77,java --enable-libgcj --enable-threads=posix --with-system-zlib --enable-nls --without-included-gettext --enable-interpreter --disable-sjlj-exceptions --disable-version-specific-runtime-libs --enable-shared --build=i686-pc-linux --host=i686-pc-cygwin --target=i686-pc-cygwin --enable-haifa --prefix=/usr --exec-prefix=/usr --sysconfdir=/etc --libdir=/usr/lib --includedir=/nonexistent/include --libexecdir=/usr/sbin Thread model: posix gcc version 3.2 20020927 (prerelease) Bison: bison (GNU Bison) 1.75 Written by Robert Corbett and Richard Stallman. Copyright (C) 2002 Free Software Foundation, Inc. This is free software; see the source for copying conditions. There is NO warranty; not even for MERCHANTABILITY or FITNESS FOR A PARTICULAR PURPOSE. ================================================================================ PHPINFO ================================================================================ phpinfo() PHP Version => 4.4.0-dev System => CYGWIN_NT-5.0 VERDANA 1.3.15(0.63/3/2) 2002-11-07 13:57 i686 Build Date => Nov 25 2002 14:46:11 Configure Command => './configure' '--with-apxs=/usr/local/apache/bin/apxs' '--without-mysql' Server API => Command Line Interface Virtual Directory Support => disabled Configuration File (php.ini) Path => /usr/local/lib PHP API => 20020918 PHP Extension => 20020429 Zend Extension => 20021010 Debug Build => no Thread Safety => disabled Registered PHP Streams => php, http, ftp This program makes use of the Zend Scripting Language Engine: Zend Engine v1.4.0, Copyright (c) 1998-2002 Zend Technologies _______________________________________________________________________ Configuration PHP Core Directive => Local Value => Master Value allow_call_time_pass_reference => On => On allow_url_fopen => On => On always_populate_raw_post_data => Off => Off arg_separator.input => &amp; => &amp; arg_separator.output => &amp; => &amp; asp_tags => Off => Off auto_append_file => no value => no value auto_prepend_file => no value => no value browscap => no value => no value default_charset => no value => no value default_mimetype => text/html => text/html define_syslog_variables => Off => Off disable_functions => no value => no value display_errors => On => On display_startup_errors => Off => Off doc_root => no value => no value docref_ext => no value => no value docref_root => http://www.php.net/ => http://www.php.net/ enable_dl => On => On error_append_string => no value => no value error_log => no value => no value error_prepend_string => no value => no value error_reporting => no value => no value expose_php => On => On extension_dir => /usr/local/lib/php/extensions/no-debug-non-zts-20020429 => /usr/local/lib/php/extensions/no-debug-non-zts-20020429 file_uploads => On => On gpc_order => GPC => GPC highlight.bg => #FFFFFF => #FFFFFF highlight.comment => #FF8000 => #FF8000 highlight.default => #0000BB => #0000BB highlight.html => #000000 => #000000 highlight.keyword => #007700 => #007700 highlight.string => #DD0000 => #DD0000 html_errors => Off => On ignore_repeated_errors => Off => Off ignore_repeated_source => Off => Off ignore_user_abort => Off => Off implicit_flush => On => Off include_path => .:/usr/local/lib/php => .:/usr/local/lib/php log_errors => Off => Off log_errors_max_len => 1024 => 1024 magic_quotes_gpc => On => On magic_quotes_runtime => Off => Off magic_quotes_sybase => Off => Off max_execution_time => 0 => 30 max_input_time => -1 => -1 open_basedir => no value => no value output_buffering => 0 => 0 output_handler => no value => no value post_max_size => 8M => 8M precision => 14 => 14 register_argc_argv => On => On register_globals => Off => Off report_memleaks => On => On safe_mode => Off => Off safe_mode_exec_dir => 1 => 1 safe_mode_gid => Off => Off safe_mode_include_dir => no value => no value sendmail_from => no value => no value sendmail_path => -t -i => -t -i short_open_tag => On => On SMTP => localhost => localhost smtp_port => 25 => 25 sql.safe_mode => Off => Off track_errors => Off => Off unserialize_callback_func => no value => no value upload_max_filesize => 2M => 2M upload_tmp_dir => no value => no value user_dir => no value => no value variables_order => no value => no value xmlrpc_error_number => 0 => 0 xmlrpc_errors => Off => Off y2k_compliance => On => On ctype ctype functions => enabled overload User-Space Object Overloading Support => enabled pcre PCRE (Perl Compatible Regular Expressions) Support => enabled PCRE Library Version => 3.92 11-Sep-2002 posix Revision => $Revision: 1.51 $ session Session Support => enabled Registered save handlers => files user Directive => Local Value => Master Value session.auto_start => Off => Off session.bug_compat_42 => On => On session.bug_compat_warn => On => On session.cache_expire => 180 => 180 session.cache_limiter => nocache => nocache session.cookie_domain => no value => no value session.cookie_lifetime => 0 => 0 session.cookie_path => / => / session.cookie_secure => Off => Off session.entropy_file => no value => no value session.entropy_length => 0 => 0 session.gc_dividend => 100 => 100 session.gc_maxlifetime => 1440 => 1440 session.gc_probability => 1 => 1 session.name => PHPSESSID => PHPSESSID session.referer_check => no value => no value session.save_handler => files => files session.save_path => /tmp => /tmp session.serialize_handler => php => php session.use_cookies => On => On session.use_only_cookies => Off => Off session.use_trans_sid => Off => Off standard Regex Library => Bundled library enabled Dynamic Library Support => enabled Directive => Local Value => Master Value assert.active => 1 => 1 assert.bail => 0 => 0 assert.callback => no value => no value assert.quiet_eval => 0 => 0 assert.warning => 1 => 1 auto_detect_line_endings => 0 => 0 default_socket_timeout => 60 => 60 safe_mode_allowed_env_vars => PHP_ => PHP_ safe_mode_protected_env_vars => LD_LIBRARY_PATH => LD_LIBRARY_PATH url_rewriter.tags => a=href,area=href,frame=src,form=,fieldset= => a=href,area=href,frame=src,form=,fieldset= user_agent => no value => no value tokenizer Tokenizer Support => enabled xml XML Support => active XML Namespace Support => active EXPAT Version => 1.95.5 Additional Modules Module Name Environment Variable => Value !:: => ::\ !C: => C:\Documents and Settings\Verdana.ZENGLEI\×ÀÃæ !E: => E:\Cygwin\bin ALLUSERSPROFILE => C:\Documents and Settings\All Users APPDATA => C:\Documents and Settings\Verdana.ZENGLEI\Application Data CC => gcc COMMONPROGRAMFILES => C:\Program Files\Common Files COMPUTERNAME => VERDANA COMSPEC => C:\WINNT\system32\cmd.exe CONTENT_LENGTH => CONTENT_TYPE => CVSROOT => :pserver:verdana@cvs.php.net:/repository HOME => /home/Verdana HOMEDRIVE => C: HOMEPATH => \Documents and Settings\Verdana.ZENGLEI INCLUDE => C:\Program Files\Microsoft Visual Studio\VC98\atl\include;C:\Program Files\Microsoft Visual Studio\VC98\mfc\include;C:\Program Files\Microsoft Visual Studio\VC98\include;C:\Program Files\Microsoft.NET\FrameworkSDK\include\;C:\Program Files\Microsoft Visual Studio .NET\Vc7\include\ LIB => C:\Program Files\Microsoft Visual Studio\VC98\mfc\lib;C:\Program Files\Microsoft Visual Studio\VC98\lib;C:\Program Files\Microsoft Visual Studio .NET\Vc7\lib\;C:\Program Files\Microsoft.NET\FrameworkSDK\Lib\ LOGONSERVER => \\VERDANA MAKEFLAGS => --unix MAKELEVEL => 1 MAKE_MODE => unix MANPATH => :/usr/ssl/man MFLAGS => - --unix MSDEVDIR => C:\Program Files\Microsoft Visual Studio\Common\MSDev98 NETSAMPLEPATH => C:\PROGRA~1\MICROS~1.NET\FRAMEW~1\Samples NUMBER_OF_PROCESSORS => 1 OLDPWD => /home/Verdana/php4/libs OS2LIBPATH => C:\WINNT\system32\os2\dll; OS => Windows_NT PATH => /usr/local/bin:/usr/bin:/bin:/cygdrive/e/oracle/ora81/bin:/cygdrive/c/Program Files/Oracle/jre/1.1.7/bin:/cygdrive/c/Program Files/Microsoft.NET/FrameworkSDK/Bin/:/cygdrive/c/Program Files/Microsoft Visual Studio .NET/Common7/IDE/:/cygdrive/c/WINNT/Microsoft.NET/Framework/v1.0.3705/:/cygdrive/c/Program Files/Microsoft Visual Studio .NET/Vc7/bin/:/cygdrive/c/WINNT/system32:/cygdrive/c/WINNT:/cygdrive/c/WINNT/System32/Wbem:/cygdrive/e/Apache2/bin:/cygdrive/e/MySQL/bin:/cygdrive/c/Program Files/Microsoft SQL Server/80/Tools/Binn/:/cygdrive/c/Program Files/Microsoft Visual Studio/Common/Tools/WinNT:/cygdrive/c/Program Files/Microsoft Visual Studio/Common/MSDev98/Bin:/cygdrive/c/Program Files/Microsoft Visual Studio/Common/Tools:/cygdrive/c/Program Files/Microsoft Visual Studio/VC98/bin PATHEXT => .COM;.EXE;.BAT;.CMD;.VBS;.VBE;.JS;.JSE;.WSF;.WSH PATH_TRANSLATED => /home/Verdana/php4/tests/strings/004.php PROCESSOR_ARCHITECTURE => x86 PROCESSOR_IDENTIFIER => x86 Family 6 Model 8 Stepping 1, GenuineIntel PROCESSOR_LEVEL => 6 PROCESSOR_REVISION => 0801 PROGRAMFILES => C:\Program Files PROMPT => $P$G PS1 => \[\033]0;\w\007 \033[32m\]\u@\h \[\033[33m\w\033[0m\] $ PWD => /home/Verdana/php4 QUERY_STRING => REDIRECT_STATUS => 1 REQUEST_METHOD => GET SCRIPT_FILENAME => /home/Verdana/php4/tests/strings/004.php SESSIONNAME => Console SHELL => /bin/sh SHLVL => 1 SYSTEMDRIVE => C: SYSTEMROOT => C:\WINNT TEMP => /cygdrive/c/DOCUME~1/VERDAN~1.ZEN/LOCALS~1/Temp TERM => cygwin TEST_PHP_EXECUTABLE => /home/Verdana/php4/sapi/cli/php TEST_PHP_SRCDIR => /home/Verdana/php4 TMP => /cygdrive/c/DOCUME~1/VERDAN~1.ZEN/LOCALS~1/Temp USER => Verdana USERDOMAIN => VERDANA USERNAME => Verdana USERPROFILE => C:\Documents and Settings\Verdana.ZENGLEI WINDIR => C:\WINNT _ => /usr/bin/make PHP Variables Variable => Value _SERVER["!::"] => ::\\ _SERVER["!C:"] => C:\\Documents and Settings\\Verdana.ZENGLEI\\×ÀÃæ _SERVER["!E:"] => E:\\Cygwin\\bin _SERVER["ALLUSERSPROFILE"] => C:\\Documents and Settings\\All Users _SERVER["APPDATA"] => C:\\Documents and Settings\\Verdana.ZENGLEI\\Application Data _SERVER["CC"] => gcc _SERVER["COMMONPROGRAMFILES"] => C:\\Program Files\\Common Files _SERVER["COMPUTERNAME"] => VERDANA _SERVER["COMSPEC"] => C:\\WINNT\\system32\\cmd.exe _SERVER["CONTENT_LENGTH"] => _SERVER["CONTENT_TYPE"] => _SERVER["CVSROOT"] => :pserver:verdana@cvs.php.net:/repository _SERVER["HOME"] => /home/Verdana _SERVER["HOMEDRIVE"] => C: _SERVER["HOMEPATH"] => \\Documents and Settings\\Verdana.ZENGLEI _SERVER["INCLUDE"] => C:\\Program Files\\Microsoft Visual Studio\\VC98\\atl\\include;C:\\Program Files\\Microsoft Visual Studio\\VC98\\mfc\\include;C:\\Program Files\\Microsoft Visual Studio\\VC98\\include;C:\\Program Files\\Microsoft.NET\\FrameworkSDK\\include\\;C:\\Program Files\\Microsoft Visual Studio .NET\\Vc7\\include\\ _SERVER["LIB"] => C:\\Program Files\\Microsoft Visual Studio\\VC98\\mfc\\lib;C:\\Program Files\\Microsoft Visual Studio\\VC98\\lib;C:\\Program Files\\Microsoft Visual Studio .NET\\Vc7\\lib\\;C:\\Program Files\\Microsoft.NET\\FrameworkSDK\\Lib\\ _SERVER["LOGONSERVER"] => \\\\VERDANA _SERVER["MAKEFLAGS"] => --unix _SERVER["MAKELEVEL"] => 1 _SERVER["MAKE_MODE"] => unix _SERVER["MANPATH"] => :/usr/ssl/man _SERVER["MFLAGS"] => - --unix _SERVER["MSDEVDIR"] => C:\\Program Files\\Microsoft Visual Studio\\Common\\MSDev98 _SERVER["NETSAMPLEPATH"] => C:\\PROGRA~1\\MICROS~1.NET\\FRAMEW~1\\Samples _SERVER["NUMBER_OF_PROCESSORS"] => 1 _SERVER["OLDPWD"] => /home/Verdana/php4/libs _SERVER["OS2LIBPATH"] => C:\\WINNT\\system32\\os2\\dll; _SERVER["OS"] => Windows_NT _SERVER["PATH"] => /usr/local/bin:/usr/bin:/bin:/cygdrive/e/oracle/ora81/bin:/cygdrive/c/Program Files/Oracle/jre/1.1.7/bin:/cygdrive/c/Program Files/Microsoft.NET/FrameworkSDK/Bin/:/cygdrive/c/Program Files/Microsoft Visual Studio .NET/Common7/IDE/:/cygdrive/c/WINNT/Microsoft.NET/Framework/v1.0.3705/:/cygdrive/c/Program Files/Microsoft Visual Studio .NET/Vc7/bin/:/cygdrive/c/WINNT/system32:/cygdrive/c/WINNT:/cygdrive/c/WINNT/System32/Wbem:/cygdrive/e/Apache2/bin:/cygdrive/e/MySQL/bin:/cygdrive/c/Program Files/Microsoft SQL Server/80/Tools/Binn/:/cygdrive/c/Program Files/Microsoft Visual Studio/Common/Tools/WinNT:/cygdrive/c/Program Files/Microsoft Visual Studio/Common/MSDev98/Bin:/cygdrive/c/Program Files/Microsoft Visual Studio/Common/Tools:/cygdrive/c/Program Files/Microsoft Visual Studio/VC98/bin _SERVER["PATHEXT"] => .COM;.EXE;.BAT;.CMD;.VBS;.VBE;.JS;.JSE;.WSF;.WSH _SERVER["PATH_TRANSLATED"] => _SERVER["PROCESSOR_ARCHITECTURE"] => x86 _SERVER["PROCESSOR_IDENTIFIER"] => x86 Family 6 Model 8 Stepping 1, GenuineIntel _SERVER["PROCESSOR_LEVEL"] => 6 _SERVER["PROCESSOR_REVISION"] => 0801 _SERVER["PROGRAMFILES"] => C:\\Program Files _SERVER["PROMPT"] => $P$G _SERVER["PS1"] => \\[\\033]0;\\w\\007 \\033[32m\\]\\u@\\h \\[\\033[33m\\w\\033[0m\\] $ _SERVER["PWD"] => /home/Verdana/php4 _SERVER["QUERY_STRING"] => _SERVER["REDIRECT_STATUS"] => 1 _SERVER["REQUEST_METHOD"] => GET _SERVER["SCRIPT_FILENAME"] => _SERVER["SESSIONNAME"] => Console _SERVER["SHELL"] => /bin/sh _SERVER["SHLVL"] => 1 _SERVER["SYSTEMDRIVE"] => C: _SERVER["SYSTEMROOT"] => C:\\WINNT _SERVER["TEMP"] => /cygdrive/c/DOCUME~1/VERDAN~1.ZEN/LOCALS~1/Temp _SERVER["TERM"] => cygwin _SERVER["TEST_PHP_EXECUTABLE"] => /home/Verdana/php4/sapi/cli/php _SERVER["TEST_PHP_SRCDIR"] => /home/Verdana/php4 _SERVER["TMP"] => /cygdrive/c/DOCUME~1/VERDAN~1.ZEN/LOCALS~1/Temp _SERVER["USER"] => Verdana _SERVER["USERDOMAIN"] => VERDANA _SERVER["USERNAME"] => Verdana _SERVER["USERPROFILE"] => C:\\Documents and Settings\\Verdana.ZENGLEI _SERVER["WINDIR"] => C:\\WINNT _SERVER["_"] => /usr/bin/make _SERVER["PHP_SELF"] => _SERVER["SCRIPT_NAME"] => _SERVER["DOCUMENT_ROOT"] => _SERVER["argv"] => Array ( ) _SERVER["argc"] => 0 _ENV["!::"] => ::\\ _ENV["!C:"] => C:\\Documents and Settings\\Verdana.ZENGLEI\\×ÀÃæ _ENV["!E:"] => E:\\Cygwin\\bin _ENV["ALLUSERSPROFILE"] => C:\\Documents and Settings\\All Users _ENV["APPDATA"] => C:\\Documents and Settings\\Verdana.ZENGLEI\\Application Data _ENV["CC"] => gcc _ENV["COMMONPROGRAMFILES"] => C:\\Program Files\\Common Files _ENV["COMPUTERNAME"] => VERDANA _ENV["COMSPEC"] => C:\\WINNT\\system32\\cmd.exe _ENV["CONTENT_LENGTH"] => _ENV["CONTENT_TYPE"] => _ENV["CVSROOT"] => :pserver:verdana@cvs.php.net:/repository _ENV["HOME"] => /home/Verdana _ENV["HOMEDRIVE"] => C: _ENV["HOMEPATH"] => \\Documents and Settings\\Verdana.ZENGLEI _ENV["INCLUDE"] => C:\\Program Files\\Microsoft Visual Studio\\VC98\\atl\\include;C:\\Program Files\\Microsoft Visual Studio\\VC98\\mfc\\include;C:\\Program Files\\Microsoft Visual Studio\\VC98\\include;C:\\Program Files\\Microsoft.NET\\FrameworkSDK\\include\\;C:\\Program Files\\Microsoft Visual Studio .NET\\Vc7\\include\\ _ENV["LIB"] => C:\\Program Files\\Microsoft Visual Studio\\VC98\\mfc\\lib;C:\\Program Files\\Microsoft Visual Studio\\VC98\\lib;C:\\Program Files\\Microsoft Visual Studio .NET\\Vc7\\lib\\;C:\\Program Files\\Microsoft.NET\\FrameworkSDK\\Lib\\ _ENV["LOGONSERVER"] => \\\\VERDANA _ENV["MAKEFLAGS"] => --unix _ENV["MAKELEVEL"] => 1 _ENV["MAKE_MODE"] => unix _ENV["MANPATH"] => :/usr/ssl/man _ENV["MFLAGS"] => - --unix _ENV["MSDEVDIR"] => C:\\Program Files\\Microsoft Visual Studio\\Common\\MSDev98 _ENV["NETSAMPLEPATH"] => C:\\PROGRA~1\\MICROS~1.NET\\FRAMEW~1\\Samples _ENV["NUMBER_OF_PROCESSORS"] => 1 _ENV["OLDPWD"] => /home/Verdana/php4/libs _ENV["OS2LIBPATH"] => C:\\WINNT\\system32\\os2\\dll; _ENV["OS"] => Windows_NT _ENV["PATH"] => /usr/local/bin:/usr/bin:/bin:/cygdrive/e/oracle/ora81/bin:/cygdrive/c/Program Files/Oracle/jre/1.1.7/bin:/cygdrive/c/Program Files/Microsoft.NET/FrameworkSDK/Bin/:/cygdrive/c/Program Files/Microsoft Visual Studio .NET/Common7/IDE/:/cygdrive/c/WINNT/Microsoft.NET/Framework/v1.0.3705/:/cygdrive/c/Program Files/Microsoft Visual Studio .NET/Vc7/bin/:/cygdrive/c/WINNT/system32:/cygdrive/c/WINNT:/cygdrive/c/WINNT/System32/Wbem:/cygdrive/e/Apache2/bin:/cygdrive/e/MySQL/bin:/cygdrive/c/Program Files/Microsoft SQL Server/80/Tools/Binn/:/cygdrive/c/Program Files/Microsoft Visual Studio/Common/Tools/WinNT:/cygdrive/c/Program Files/Microsoft Visual Studio/Common/MSDev98/Bin:/cygdrive/c/Program Files/Microsoft Visual Studio/Common/Tools:/cygdrive/c/Program Files/Microsoft Visual Studio/VC98/bin _ENV["PATHEXT"] => .COM;.EXE;.BAT;.CMD;.VBS;.VBE;.JS;.JSE;.WSF;.WSH _ENV["PATH_TRANSLATED"] => /home/Verdana/php4/tests/strings/004.php _ENV["PROCESSOR_ARCHITECTURE"] => x86 _ENV["PROCESSOR_IDENTIFIER"] => x86 Family 6 Model 8 Stepping 1, GenuineIntel _ENV["PROCESSOR_LEVEL"] => 6 _ENV["PROCESSOR_REVISION"] => 0801 _ENV["PROGRAMFILES"] => C:\\Program Files _ENV["PROMPT"] => $P$G _ENV["PS1"] => \\[\\033]0;\\w\\007 \\033[32m\\]\\u@\\h \\[\\033[33m\\w\\033[0m\\] $ _ENV["PWD"] => /home/Verdana/php4 _ENV["QUERY_STRING"] => _ENV["REDIRECT_STATUS"] => 1 _ENV["REQUEST_METHOD"] => GET _ENV["SCRIPT_FILENAME"] => /home/Verdana/php4/tests/strings/004.php _ENV["SESSIONNAME"] => Console _ENV["SHELL"] => /bin/sh _ENV["SHLVL"] => 1 _ENV["SYSTEMDRIVE"] => C: _ENV["SYSTEMROOT"] => C:\\WINNT _ENV["TEMP"] => /cygdrive/c/DOCUME~1/VERDAN~1.ZEN/LOCALS~1/Temp _ENV["TERM"] => cygwin _ENV["TEST_PHP_EXECUTABLE"] => /home/Verdana/php4/sapi/cli/php _ENV["TEST_PHP_SRCDIR"] => /home/Verdana/php4 _ENV["TMP"] => /cygdrive/c/DOCUME~1/VERDAN~1.ZEN/LOCALS~1/Temp _ENV["USER"] => Verdana _ENV["USERDOMAIN"] => VERDANA _ENV["USERNAME"] => Verdana _ENV["USERPROFILE"] => C:\\Documents and Settings\\Verdana.ZENGLEI _ENV["WINDIR"] => C:\\WINNT _ENV["_"] => /usr/bin/make PHP License This program is free software; you can redistribute it and/or modify it under the terms of the PHP License as published by the PHP Group and included in the distribution in the file: LICENSE This program is distributed in the hope that it will be useful, but WITHOUT ANY WARRANTY; without even the implied warranty of MERCHANTABILITY or FITNESS FOR A PARTICULAR PURPOSE. If you did not receive a copy of the PHP license, or have any questions about PHP licensing, please contact license@php.net.

« previous php.qa (#6995) next »