Test results

From: Date: Mon, 25 Nov 2002 12:18:13 +0000
Subject: Test results
Groups: php.qa 
Request: Send a blank email to php-qa+get-6998@lists.php.net to get a copy of this message
OS: Darwin Automake: automake (GNU automake) 1.6.1 Written by Tom Tromey <tromey@redhat.com>. Copyright 2002 Free Software Foundation, Inc. This is free software; see the source for copying conditions. There is NO warranty; not even for MERCHANTABILITY or FITNESS FOR A PARTICULAR PURPOSE. Autoconf: autoconf (GNU Autoconf) 2.52 Written by David J. MacKenzie. Copyright 1992, 1993, 1994, 1996, 1999, 2000, 2001 Free Software Foundation, Inc. This is free software; see the source for copying conditions. There is NO warranty; not even for MERCHANTABILITY or FITNESS FOR A PARTICULAR PURPOSE. Libtool: Compiler: Reading specs from /usr/libexec/gcc/darwin/ppc/3.1/specs Thread model: posix Apple Computer, Inc. GCC version 1151, based on gcc version 3.1 20020420 (prerelease) Bison: GNU Bison version 1.28 ===================================================================== FAILED TEST SUMMARY --------------------------------------------------------------------- File type functions [ext/standard/tests/file/001.phpt] fopencookie detected and working (or cast mechanism works) [ext/standard/tests/file/fopencookie.phpt] Locale settings affecting float parsing [tests/lang/034.phpt] ===================================================================== ================================================================================ /usr/src/php-4.3.0RC1/ext/standard/tests/file/001.phpt ================================================================================ ---- EXPECTED OUTPUT test.file does not exist test.file exists test.link exists test.file is not a symlink test.link is a symlink test.file exists test.link lstat and stat differ at element 1 test.link lstat and stat differ at element 2 test.link lstat and stat differ at element 7 test.link lstat and stat differ at element 8 test.link lstat and stat differ at element 9 test.link lstat and stat differ at element 10 test.file is file test.link is link test.file permissions are 0744 test.file size is 0 test.file is writeable test.file is readable test.file is executable test.file is a regular file test.link is a regular file test.link is not a directory ../file is a directory test.file is not a directory test.file does not exist test.file does not exist ---- ACTUAL OUTPUT test.file does not exist test.file exists test.link exists test.file is not a symlink test.link is a symlink test.file exists test.link lstat and stat differ at element 1 test.link lstat and stat differ at element 2 test.link lstat and stat differ at element 4 test.link lstat and stat differ at element 7 test.link lstat and stat differ at element 8 test.link lstat and stat differ at element 9 test.file is file test.link is link test.file permissions are 0744 test.file size is 0 test.file is writeable test.file is readable test.file is executable test.file is a regular file test.link is a regular file test.link is not a directory ../file is a directory test.file is not a directory test.file does not exist test.file does not exist ---- FAILED ================================================================================ 009- test.link lstat and stat differ at element 7 009+ test.link lstat and stat differ at element 4 010- test.link lstat and stat differ at element 8 010+ test.link lstat and stat differ at element 7 011- test.link lstat and stat differ at element 9 011+ test.link lstat and stat differ at element 8 012- test.link lstat and stat differ at element 10 012+ test.link lstat and stat differ at element 9 ================================================================================ ================================================================================ /usr/src/php-4.3.0RC1/ext/standard/tests/file/fopencookie.phpt ================================================================================ ---- EXPECTED OUTPUT If you can read this, it worked ---- ACTUAL OUTPUT Warning: main() [/phpmanual/function.main.html]: cannot represent a stream of type user-space as a STDIO FILE* in /usr/src/php-4.3.0RC1/ext/standard/tests/file/fopencookie.php on line 79 Warning: Failed opening 'cookietest://foo' for inclusion (include_path='.:/usr/local/lib/php') in /usr/src/php-4.3.0RC1/ext/standard/tests/file/fopencookie.php on line 79 ---- FAILED ================================================================================ 001- If you can read this, it worked 001+ Warning: main() [/phpmanual/function.main.html]: cannot represent a stream of type user-space as a STDIO FILE* in /usr/src/php-4.3.0RC1/ext/standard/tests/file/fopencookie.php on line 79 002+ 003+ Warning: Failed opening 'cookietest://foo' for inclusion (include_path='.:/usr/local/lib/php') in /usr/src/php-4.3.0RC1/ext/standard/tests/file/fopencookie.php on line 79 ================================================================================ ================================================================================ /usr/src/php-4.3.0RC1/tests/lang/034.phpt ================================================================================ ---- EXPECTED OUTPUT 3,14 ---- ACTUAL OUTPUT 3.14 ---- FAILED ================================================================================ 001- 3,14 001+ 3.14 ================================================================================ ================================================================================ PHPINFO ================================================================================ phpinfo() PHP Version => 4.3.0RC1 System => Darwin phase1 6.2 Darwin Kernel Version 6.2: Tue Nov 5 22:00:03 PST 2002; root:xnu/xnu-344.12.2.obj~1/RELEASE_PPC Power Macintosh Build Date => Nov 25 2002 12:32:25 Configure Command => './configure' '--with-apxs' '--with-pgsql=/usr/local/pgsql/' Server API => Command Line Interface Virtual Directory Support => disabled Configuration File (php.ini) Path => /usr/local/lib PHP API => 20020918 PHP Extension => 20020429 Zend Extension => 20021010 Debug Build => no Thread Safety => disabled Registered PHP Streams => php, http, ftp This program makes use of the Zend Scripting Language Engine: Zend Engine v1.3.0, Copyright (c) 1998-2002 Zend Technologies _______________________________________________________________________ Configuration PHP Core Directive => Local Value => Master Value allow_call_time_pass_reference => On => On allow_url_fopen => On => On always_populate_raw_post_data => Off => Off arg_separator.input => &amp; => &amp; arg_separator.output => &amp; => &amp; asp_tags => Off => Off auto_append_file => no value => no value auto_prepend_file => no value => no value browscap => no value => no value default_charset => no value => no value default_mimetype => text/html => text/html define_syslog_variables => Off => Off disable_functions => no value => no value display_errors => On => On display_startup_errors => Off => Off doc_root => no value => no value docref_ext => no value => no value docref_root => http://www.php.net/ => http://www.php.net/ enable_dl => On => On error_append_string => no value => no value error_log => no value => no value error_prepend_string => no value => no value error_reporting => no value => no value expose_php => On => On extension_dir => /usr/local/lib/php/extensions/no-debug-non-zts-20020429 => /usr/local/lib/php/extensions/no-debug-non-zts-20020429 file_uploads => On => On gpc_order => GPC => GPC highlight.bg => #FFFFFF => #FFFFFF highlight.comment => #FF8000 => #FF8000 highlight.default => #0000BB => #0000BB highlight.html => #000000 => #000000 highlight.keyword => #007700 => #007700 highlight.string => #DD0000 => #DD0000 html_errors => Off => On ignore_repeated_errors => Off => Off ignore_repeated_source => Off => Off ignore_user_abort => Off => Off implicit_flush => On => Off include_path => .:/usr/local/lib/php => .:/usr/local/lib/php log_errors => Off => Off log_errors_max_len => 1024 => 1024 magic_quotes_gpc => On => On magic_quotes_runtime => Off => Off magic_quotes_sybase => Off => Off max_execution_time => 0 => 30 max_input_time => -1 => -1 open_basedir => no value => no value output_buffering => 0 => 0 output_handler => no value => no value post_max_size => 8M => 8M precision => 14 => 14 register_argc_argv => On => On register_globals => Off => Off report_memleaks => On => On safe_mode => Off => Off safe_mode_exec_dir => 1 => 1 safe_mode_gid => Off => Off safe_mode_include_dir => no value => no value sendmail_from => no value => no value sendmail_path => /usr/sbin/sendmail -t -i => /usr/sbin/sendmail -t -i short_open_tag => On => On SMTP => localhost => localhost smtp_port => 25 => 25 sql.safe_mode => Off => Off track_errors => Off => Off unserialize_callback_func => no value => no value upload_max_filesize => 2M => 2M upload_tmp_dir => no value => no value user_dir => no value => no value variables_order => no value => no value xmlrpc_error_number => 0 => 0 xmlrpc_errors => Off => Off y2k_compliance => On => On xml XML Support => active XML Namespace Support => active EXPAT Version => 1.95.2 tokenizer Tokenizer Support => enabled standard Regex Library => Bundled library enabled Dynamic Library Support => enabled Path to sendmail => /usr/sbin/sendmail -t -i Directive => Local Value => Master Value assert.active => 1 => 1 assert.bail => 0 => 0 assert.callback => no value => no value assert.quiet_eval => 0 => 0 assert.warning => 1 => 1 auto_detect_line_endings => 0 => 0 default_socket_timeout => 60 => 60 safe_mode_allowed_env_vars => PHP_ => PHP_ safe_mode_protected_env_vars => LD_LIBRARY_PATH => LD_LIBRARY_PATH url_rewriter.tags => a=href,area=href,frame=src,form=,fieldset= => a=href,area=href,frame=src,form=,fieldset= user_agent => no value => no value session Session Support => enabled Registered save handlers => files user Directive => Local Value => Master Value session.auto_start => Off => Off session.bug_compat_42 => On => On session.bug_compat_warn => On => On session.cache_expire => 180 => 180 session.cache_limiter => nocache => nocache session.cookie_domain => no value => no value session.cookie_lifetime => 0 => 0 session.cookie_path => / => / session.cookie_secure => Off => Off session.entropy_file => no value => no value session.entropy_length => 0 => 0 session.gc_dividend => 100 => 100 session.gc_maxlifetime => 1440 => 1440 session.gc_probability => 1 => 1 session.name => PHPSESSID => PHPSESSID session.referer_check => no value => no value session.save_handler => files => files session.save_path => /tmp => /tmp session.serialize_handler => php => php session.use_cookies => On => On session.use_only_cookies => Off => Off session.use_trans_sid => Off => Off posix Revision => $Revision: 1.51 $ pgsql PostgreSQL Support => enabled PostgreSQL(libpq) Version => 7.2.2 Multibyte charater support => enabled SSL support => disabled Active Persistent Links => 0 Active Links => 0 Directive => Local Value => Master Value pgsql.allow_persistent => On => On pgsql.auto_reset_persistent => Off => Off pgsql.ignore_notice => Off => Off pgsql.log_notice => Off => Off pgsql.max_links => Unlimited => Unlimited pgsql.max_persistent => Unlimited => Unlimited pcre PCRE (Perl Compatible Regular Expressions) Support => enabled PCRE Library Version => 3.92 11-Sep-2002 overload User-Space Object Overloading Support => enabled mysql MySQL Support => enabled Active Persistent Links => 0 Active Links => 0 Client API version => 3.23.49 MYSQL_MODULE_TYPE => builtin MYSQL_SOCKET => /tmp/mysql.sock MYSQL_INCLUDE => MYSQL_LIBS => Directive => Local Value => Master Value mysql.allow_persistent => On => On mysql.connect_timeout => -1 => -1 mysql.default_host => no value => no value mysql.default_password => no value => no value mysql.default_port => no value => no value mysql.default_socket => no value => no value mysql.default_user => no value => no value mysql.max_links => Unlimited => Unlimited mysql.max_persistent => Unlimited => Unlimited mysql.trace_mode => Off => Off ctype ctype functions => enabled Additional Modules Module Name Environment Variable => Value PWD => /usr/src/php-4.3.0RC1 MAKEFLAGS => VENDOR => apple MFLAGS => REDIRECT_STATUS => 1 TEST_PHP_EXECUTABLE => /usr/src/php-4.3.0RC1/sapi/cli/php CC => gcc USER => root MACHTYPE => powerpc SCRIPT_FILENAME => /usr/src/php-4.3.0RC1/tests/strings/004.php MAIL => /var/mail/root PATH_TRANSLATED => /usr/src/php-4.3.0RC1/tests/strings/004.php QUERY_STRING => CONTENT_LENGTH => HOST => phase1 MAKELEVEL => 1 SSH_CLIENT => 212.71.117.22 3936 22 SHLVL => 3 LOGNAME => root GROUP => wheel _ => /usr/src/php-4.3.0RC1/sapi/cli/php REQUEST_METHOD => GET SHELL => /bin/sh HOSTTYPE => macintosh TEST_PHP_SRCDIR => /usr/src/php-4.3.0RC1 OSTYPE => darwin TERM => vt100 HOME => /private/var/root PATH => /bin:/sbin:/usr/bin:/usr/sbin SSH_TTY => /dev/ttyp0 CONTENT_TYPE => PHP Variables Variable => Value _SERVER["PWD"] => /usr/src/php-4.3.0RC1 _SERVER["MAKEFLAGS"] => _SERVER["VENDOR"] => apple _SERVER["MFLAGS"] => _SERVER["REDIRECT_STATUS"] => 1 _SERVER["TEST_PHP_EXECUTABLE"] => /usr/src/php-4.3.0RC1/sapi/cli/php _SERVER["CC"] => gcc _SERVER["USER"] => root _SERVER["MACHTYPE"] => powerpc _SERVER["SCRIPT_FILENAME"] => _SERVER["MAIL"] => /var/mail/root _SERVER["PATH_TRANSLATED"] => _SERVER["QUERY_STRING"] => _SERVER["CONTENT_LENGTH"] => _SERVER["HOST"] => phase1 _SERVER["MAKELEVEL"] => 1 _SERVER["SSH_CLIENT"] => 212.71.117.22 3936 22 _SERVER["SHLVL"] => 3 _SERVER["LOGNAME"] => root _SERVER["GROUP"] => wheel _SERVER["_"] => /usr/src/php-4.3.0RC1/sapi/cli/php _SERVER["REQUEST_METHOD"] => GET _SERVER["SHELL"] => /bin/sh _SERVER["HOSTTYPE"] => macintosh _SERVER["TEST_PHP_SRCDIR"] => /usr/src/php-4.3.0RC1 _SERVER["OSTYPE"] => darwin _SERVER["TERM"] => vt100 _SERVER["HOME"] => /private/var/root _SERVER["PATH"] => /bin:/sbin:/usr/bin:/usr/sbin _SERVER["SSH_TTY"] => /dev/ttyp0 _SERVER["CONTENT_TYPE"] => _SERVER["PHP_SELF"] => _SERVER["SCRIPT_NAME"] => _SERVER["DOCUMENT_ROOT"] => _SERVER["argv"] => Array ( ) _SERVER["argc"] => 0 _ENV["PWD"] => /usr/src/php-4.3.0RC1 _ENV["MAKEFLAGS"] => _ENV["VENDOR"] => apple _ENV["MFLAGS"] => _ENV["REDIRECT_STATUS"] => 1 _ENV["TEST_PHP_EXECUTABLE"] => /usr/src/php-4.3.0RC1/sapi/cli/php _ENV["CC"] => gcc _ENV["USER"] => root _ENV["MACHTYPE"] => powerpc _ENV["SCRIPT_FILENAME"] => /usr/src/php-4.3.0RC1/tests/strings/004.php _ENV["MAIL"] => /var/mail/root _ENV["PATH_TRANSLATED"] => /usr/src/php-4.3.0RC1/tests/strings/004.php _ENV["QUERY_STRING"] => _ENV["CONTENT_LENGTH"] => _ENV["HOST"] => phase1 _ENV["MAKELEVEL"] => 1 _ENV["SSH_CLIENT"] => 212.71.117.22 3936 22 _ENV["SHLVL"] => 3 _ENV["LOGNAME"] => root _ENV["GROUP"] => wheel _ENV["_"] => /usr/src/php-4.3.0RC1/sapi/cli/php _ENV["REQUEST_METHOD"] => GET _ENV["SHELL"] => /bin/sh _ENV["HOSTTYPE"] => macintosh _ENV["TEST_PHP_SRCDIR"] => /usr/src/php-4.3.0RC1 _ENV["OSTYPE"] => darwin _ENV["TERM"] => vt100 _ENV["HOME"] => /private/var/root _ENV["PATH"] => /bin:/sbin:/usr/bin:/usr/sbin _ENV["SSH_TTY"] => /dev/ttyp0 _ENV["CONTENT_TYPE"] => PHP License This program is free software; you can redistribute it and/or modify it under the terms of the PHP License as published by the PHP Group and included in the distribution in the file: LICENSE This program is distributed in the hope that it will be useful, but WITHOUT ANY WARRANTY; without even the implied warranty of MERCHANTABILITY or FITNESS FOR A PARTICULAR PURPOSE. If you did not receive a copy of the PHP license, or have any questions about PHP licensing, please contact license@php.net.

« previous php.qa (#6998) next »