Test results

From: Date: Tue, 26 Nov 2002 04:48:22 +0000
Subject: Test results
Groups: php.qa 
Request: Send a blank email to php-qa+get-7009@lists.php.net to get a copy of this message
OS: Darwin Automake: automake (GNU automake) 1.6.1 Written by Tom Tromey <tromey@redhat.com>. Copyright 2002 Free Software Foundation, Inc. This is free software; see the source for copying conditions. There is NO warranty; not even for MERCHANTABILITY or FITNESS FOR A PARTICULAR PURPOSE. Autoconf: autoconf (GNU Autoconf) 2.52 Written by David J. MacKenzie. Copyright 1992, 1993, 1994, 1996, 1999, 2000, 2001 Free Software Foundation, Inc. This is free software; see the source for copying conditions. There is NO warranty; not even for MERCHANTABILITY or FITNESS FOR A PARTICULAR PURPOSE. Libtool: Compiler: Reading specs from /usr/libexec/gcc/darwin/ppc/3.1/specs Thread model: posix Apple Computer, Inc. GCC version 1151, based on gcc version 3.1 20020420 (prerelease) Bison: GNU Bison version 1.28 ===================================================================== FAILED TEST SUMMARY --------------------------------------------------------------------- mb_ereg() compat test 1 [ext/mbstring/tests/mb_ereg-compat-01.phpt] mb_ereg() compat test 2 [ext/mbstring/tests/mb_ereg-compat-02.phpt] mb_ereg() [ext/mbstring/tests/mb_ereg.phpt] mb_ereg_replace() compat test 1 [ext/mbstring/tests/mb_ereg_replace-compat-01.phpt] mb_ereg_replace() compat test 2 [ext/mbstring/tests/mb_ereg_replace-compat-02.phpt] mb_ereg_replace() compat test 3 [ext/mbstring/tests/mb_ereg_replace-compat-03.phpt] mb_ereg_replace() compat test 4 [ext/mbstring/tests/mb_ereg_replace-compat-04.phpt] mb_ereg_replace() compat test 5 [ext/mbstring/tests/mb_ereg_replace-compat-05.phpt] mb_ereg_replace() compat test 6 [ext/mbstring/tests/mb_ereg_replace-compat-06.phpt] mb_ereg_replace() compat test 7 [ext/mbstring/tests/mb_ereg_replace-compat-07.phpt] mb_ereg_replace() compat test 8 [ext/mbstring/tests/mb_ereg_replace-compat-08.phpt] mb_ereg_replace() compat test 9 [ext/mbstring/tests/mb_ereg_replace-compat-09.phpt] mb_ereg_replace() compat test 10 [ext/mbstring/tests/mb_ereg_replace-compat-10.phpt] mb_ereg_replace() compat test 11 [ext/mbstring/tests/mb_ereg_replace-compat-11.phpt] mb_ereg_replace() compat test 12 [ext/mbstring/tests/mb_ereg_replace-compat-12.phpt] mb_ereg_replace() compat test 13 [ext/mbstring/tests/mb_ereg_replace-compat-13.phpt] mb_ereg_replace() [ext/mbstring/tests/mb_ereg_replace.phpt] mb_ereg_search() stuff [ext/mbstring/tests/mb_ereg_search_xxx.phpt] mb_regex_set_options() [ext/mbstring/tests/mb_regex_set_options.phpt] mb_split() compat test 1 [ext/mbstring/tests/mb_split-compat-01.phpt] mb_split() [ext/mbstring/tests/mb_split.phpt] Function overloading test (said to be harmful) [ext/mbstring/tests/overload.phpt] php-users@php.gr.jp #10830 [ext/mbstring/tests/php_gr_jp_10830.phpt] File type functions [ext/standard/tests/file/001.phpt] fopencookie detected and working (or cast mechanism works) [ext/standard/tests/file/fopencookie.phpt] Locale settings affecting float parsing [tests/lang/034.phpt] ===================================================================== ================================================================================ /Users/michaelj/Projects/php/php-4.3.0RC1/ext/mbstring/tests/mb_ereg-compat-01.phpt ================================================================================ ---- EXPECTED OUTPUT ok ok ---- ACTUAL OUTPUT Fatal error: Call to undefined function: mb_ereg() in /Users/michaelj/Projects/php/php-4.3.0RC1/ext/mbstring/tests/mb_ereg-compat-01.php on line 4 ---- FAILED ================================================================================ 001- ok 001+ Fatal error: Call to undefined function: mb_ereg() in /Users/michaelj/Projects/php/php-4.3.0RC1/ext/mbstring/tests/mb_ereg-compat-01.php on line 4 002- ok ================================================================================ ================================================================================ /Users/michaelj/Projects/php/php-4.3.0RC1/ext/mbstring/tests/mb_ereg-compat-02.phpt ================================================================================ ---- EXPECTED OUTPUT 32 This is a nice and simple string is is ---- ACTUAL OUTPUT Fatal error: Call to undefined function: mb_ereg() in /Users/michaelj/Projects/php/php-4.3.0RC1/ext/mbstring/tests/mb_ereg-compat-02.php on line 4 ---- FAILED ================================================================================ 001- 32 001+ Fatal error: Call to undefined function: mb_ereg() in /Users/michaelj/Projects/php/php-4.3.0RC1/ext/mbstring/tests/mb_ereg-compat-02.php on line 4 002- This is a nice and simple string 003- is 004- is ================================================================================ ================================================================================ /Users/michaelj/Projects/php/php-4.3.0RC1/ext/mbstring/tests/mb_ereg.phpt ================================================================================ ---- EXPECTED OUTPUT (15)abc def ghi jkl def ghi jkl (27)£á£â£ã ¤¢¤ª¤¤ ¤«¤³¤Ê ¤ï¤ñ¤ó £á£â£ã ¤¢¤ª¤¤ ¤« ¤³¤Ê ¤ï¤ñ¤ó (27)£í£ú£ø£æ£ð ¤¦¤ª¤« ¤­¤« ¤ò¤ð £í£ú£ø£æ£ð ¤¦¤ª¤« ¤­¤« ¤ò¤ð (15)abc def ghi jkl def ghi jkl (27)£á£â£ã ¤¢¤ª¤¤ ¤«¤³¤Ê ¤ï¤ñ¤ó £á£â£ã ¤¢¤ª¤¤ ¤« ¤³¤Ê ¤ï¤ñ¤ó (27)£í£ú£ø£æ£ð ¤¦¤ª¤« ¤­¤« ¤ò¤ð £í£ú£ø£æ£ð ¤¦¤ª¤« ¤­¤« ¤ò¤ð (15)abc def ghi jkl def ghi jkl (27)£á£â£ã ¤¢¤ª¤¤ ¤«¤³¤Ê ¤ï¤ñ¤ó £á£â£ã ¤¢¤ª¤¤ ¤« ¤³¤Ê ¤ï¤ñ¤ó (27)£í£ú£ø£æ£ð ¤¦¤ª¤« ¤­¤« ¤ò¤ð £í£ú£ø£æ£ð ¤¦¤ª¤« ¤­¤« ¤ò¤ð (15)abc def ghi jkl def ghi jkl (39)£á£â£ã ¤¢¤ª¤¤ ¤«¤³¤Ê ¤ï¤ñ¤ó £á£â£ã ¤¢¤ª¤¤ ¤« ¤³¤Ê ¤ï¤ñ¤ó (39)£í£ú£ø£æ£ð ¤¦¤ª¤« ¤­¤« ¤ò¤ð £í£ú£ø£æ£ð ¤¦¤ª¤« ¤­¤« ¤ò¤ð ---- ACTUAL OUTPUT Fatal error: Call to undefined function: mb_regex_set_options() in /Users/michaelj/Projects/php/php-4.3.0RC1/ext/mbstring/tests/mb_ereg.php on line 2 ---- FAILED ================================================================================ 001- (15)abc def ghi jkl def ghi jkl 001+ Fatal error: Call to undefined function: mb_regex_set_options() in /Users/michaelj/Projects/php/php-4.3.0RC1/ext/mbstring/tests/mb_ereg.php on line 2 002- (27)£á£â£ã ¤¢¤ª¤¤ ¤«¤³¤Ê ¤ï¤ñ¤ó £á£â£ã ¤¢¤ª¤¤ ¤« ¤³¤Ê ¤ï¤ñ¤ó 003- (27)£í£ú£ø£æ£ð ¤¦¤ª¤« ¤­¤« ¤ò¤ð £í£ú£ø£æ£ð ¤¦¤ª¤« ¤­¤« ¤ò¤ð 004- (15)abc def ghi jkl def ghi jkl 005- (27)£á£â£ã ¤¢¤ª¤¤ ¤«¤³¤Ê ¤ï¤ñ¤ó £á£â£ã ¤¢¤ª¤¤ ¤« ¤³¤Ê ¤ï¤ñ¤ó 006- (27)£í£ú£ø£æ£ð ¤¦¤ª¤« ¤­¤« ¤ò¤ð £í£ú£ø£æ£ð ¤¦¤ª¤« ¤­¤« ¤ò¤ð 007- (15)abc def ghi jkl def ghi jkl 008- (27)£á£â£ã ¤¢¤ª¤¤ ¤«¤³¤Ê ¤ï¤ñ¤ó £á£â£ã ¤¢¤ª¤¤ ¤« ¤³¤Ê ¤ï¤ñ¤ó 009- (27)£í£ú£ø£æ£ð ¤¦¤ª¤« ¤­¤« ¤ò¤ð £í£ú£ø£æ£ð ¤¦¤ª¤« ¤­¤« ¤ò¤ð 010- (15)abc def ghi jkl def ghi jkl 011- (39)£á£â£ã ¤¢¤ª¤¤ ¤«¤³¤Ê ¤ï¤ñ¤ó £á£â£ã ¤¢¤ª¤¤ ¤« ¤³¤Ê ¤ï¤ñ¤ó 012- (39)£í£ú£ø£æ£ð ¤¦¤ª¤« ¤­¤« ¤ò¤ð £í£ú£ø£æ£ð ¤¦¤ª¤« ¤­¤« ¤ò¤ð ================================================================================ ================================================================================ /Users/michaelj/Projects/php/php-4.3.0RC1/ext/mbstring/tests/mb_ereg_replace-compat-01.phpt ================================================================================ ---- EXPECTED OUTPUT abcdef ---- ACTUAL OUTPUT Fatal error: Call to undefined function: mb_ereg_replace() in /Users/michaelj/Projects/php/php-4.3.0RC1/ext/mbstring/tests/mb_ereg_replace-compat-01.php on line 4 ---- FAILED ================================================================================ 001- abcdef 001+ Fatal error: Call to undefined function: mb_ereg_replace() in /Users/michaelj/Projects/php/php-4.3.0RC1/ext/mbstring/tests/mb_ereg_replace-compat-01.php on line 4 ================================================================================ ================================================================================ /Users/michaelj/Projects/php/php-4.3.0RC1/ext/mbstring/tests/mb_ereg_replace-compat-02.phpt ================================================================================ ---- EXPECTED OUTPUT abc ---- ACTUAL OUTPUT Fatal error: Call to undefined function: mb_ereg_replace() in /Users/michaelj/Projects/php/php-4.3.0RC1/ext/mbstring/tests/mb_ereg_replace-compat-02.php on line 4 ---- FAILED ================================================================================ 001- abc 001+ Fatal error: Call to undefined function: mb_ereg_replace() in /Users/michaelj/Projects/php/php-4.3.0RC1/ext/mbstring/tests/mb_ereg_replace-compat-02.php on line 4 ================================================================================ ================================================================================ /Users/michaelj/Projects/php/php-4.3.0RC1/ext/mbstring/tests/mb_ereg_replace-compat-03.phpt ================================================================================ ---- EXPECTED OUTPUT 'test ---- ACTUAL OUTPUT Fatal error: Call to undefined function: mb_ereg_replace() in /Users/michaelj/Projects/php/php-4.3.0RC1/ext/mbstring/tests/mb_ereg_replace-compat-03.php on line 4 ---- FAILED ================================================================================ 001- 'test 001+ Fatal error: Call to undefined function: mb_ereg_replace() in /Users/michaelj/Projects/php/php-4.3.0RC1/ext/mbstring/tests/mb_ereg_replace-compat-03.php on line 4 ================================================================================ ================================================================================ /Users/michaelj/Projects/php/php-4.3.0RC1/ext/mbstring/tests/mb_ereg_replace-compat-04.phpt ================================================================================ ---- EXPECTED OUTPUT That is a nice and simple string ---- ACTUAL OUTPUT Fatal error: Call to undefined function: mb_ereg_replace() in /Users/michaelj/Projects/php/php-4.3.0RC1/ext/mbstring/tests/mb_ereg_replace-compat-04.php on line 4 ---- FAILED ================================================================================ 001- That is a nice and simple string 001+ Fatal error: Call to undefined function: mb_ereg_replace() in /Users/michaelj/Projects/php/php-4.3.0RC1/ext/mbstring/tests/mb_ereg_replace-compat-04.php on line 4 ================================================================================ ================================================================================ /Users/michaelj/Projects/php/php-4.3.0RC1/ext/mbstring/tests/mb_ereg_replace-compat-05.phpt ================================================================================ ---- EXPECTED OUTPUT strlen($b)=0 ---- ACTUAL OUTPUT Fatal error: Call to undefined function: mb_ereg_replace() in /Users/michaelj/Projects/php/php-4.3.0RC1/ext/mbstring/tests/mb_ereg_replace-compat-05.php on line 4 ---- FAILED ================================================================================ 001- strlen($b)=0 001+ Fatal error: Call to undefined function: mb_ereg_replace() in /Users/michaelj/Projects/php/php-4.3.0RC1/ext/mbstring/tests/mb_ereg_replace-compat-05.php on line 4 ================================================================================ ================================================================================ /Users/michaelj/Projects/php/php-4.3.0RC1/ext/mbstring/tests/mb_ereg_replace-compat-06.phpt ================================================================================ ---- EXPECTED OUTPUT 123 abc +-|= ---- ACTUAL OUTPUT Fatal error: Call to undefined function: mb_ereg_replace() in /Users/michaelj/Projects/php/php-4.3.0RC1/ext/mbstring/tests/mb_ereg_replace-compat-06.php on line 3 ---- FAILED ================================================================================ 001- 123 abc +-|= 001+ Fatal error: Call to undefined function: mb_ereg_replace() in /Users/michaelj/Projects/php/php-4.3.0RC1/ext/mbstring/tests/mb_ereg_replace-compat-06.php on line 3 ================================================================================ ================================================================================ /Users/michaelj/Projects/php/php-4.3.0RC1/ext/mbstring/tests/mb_ereg_replace-compat-07.phpt ================================================================================ ---- EXPECTED OUTPUT abc2222222222def2222222222 ---- ACTUAL OUTPUT Fatal error: Call to undefined function: mb_ereg_replace() in /Users/michaelj/Projects/php/php-4.3.0RC1/ext/mbstring/tests/mb_ereg_replace-compat-07.php on line 4 ---- FAILED ================================================================================ 001- abc2222222222def2222222222 001+ Fatal error: Call to undefined function: mb_ereg_replace() in /Users/michaelj/Projects/php/php-4.3.0RC1/ext/mbstring/tests/mb_ereg_replace-compat-07.php on line 4 ================================================================================ ================================================================================ /Users/michaelj/Projects/php/php-4.3.0RC1/ext/mbstring/tests/mb_ereg_replace-compat-08.phpt ================================================================================ ---- EXPECTED OUTPUT abcdef123ghi ---- ACTUAL OUTPUT Fatal error: Call to undefined function: mb_ereg_replace() in /Users/michaelj/Projects/php/php-4.3.0RC1/ext/mbstring/tests/mb_ereg_replace-compat-08.php on line 4 ---- FAILED ================================================================================ 001- abcdef123ghi 001+ Fatal error: Call to undefined function: mb_ereg_replace() in /Users/michaelj/Projects/php/php-4.3.0RC1/ext/mbstring/tests/mb_ereg_replace-compat-08.php on line 4 ================================================================================ ================================================================================ /Users/michaelj/Projects/php/php-4.3.0RC1/ext/mbstring/tests/mb_ereg_replace-compat-09.phpt ================================================================================ ---- EXPECTED OUTPUT abcdef\1ghi ---- ACTUAL OUTPUT Fatal error: Call to undefined function: mb_ereg_replace() in /Users/michaelj/Projects/php/php-4.3.0RC1/ext/mbstring/tests/mb_ereg_replace-compat-09.php on line 4 ---- FAILED ================================================================================ 001- abcdef\1ghi 001+ Fatal error: Call to undefined function: mb_ereg_replace() in /Users/michaelj/Projects/php/php-4.3.0RC1/ext/mbstring/tests/mb_ereg_replace-compat-09.php on line 4 ================================================================================ ================================================================================ /Users/michaelj/Projects/php/php-4.3.0RC1/ext/mbstring/tests/mb_ereg_replace-compat-10.phpt ================================================================================ ---- EXPECTED OUTPUT abcdef\g\\hi\ ---- ACTUAL OUTPUT Fatal error: Call to undefined function: mb_ereg_replace() in /Users/michaelj/Projects/php/php-4.3.0RC1/ext/mbstring/tests/mb_ereg_replace-compat-10.php on line 4 ---- FAILED ================================================================================ 001- abcdef\g\\hi\ 001+ Fatal error: Call to undefined function: mb_ereg_replace() in /Users/michaelj/Projects/php/php-4.3.0RC1/ext/mbstring/tests/mb_ereg_replace-compat-10.php on line 4 ================================================================================ ================================================================================ /Users/michaelj/Projects/php/php-4.3.0RC1/ext/mbstring/tests/mb_ereg_replace-compat-11.phpt ================================================================================ ---- EXPECTED OUTPUT \2 ---- ACTUAL OUTPUT Fatal error: Call to undefined function: mb_ereg_replace() in /Users/michaelj/Projects/php/php-4.3.0RC1/ext/mbstring/tests/mb_ereg_replace-compat-11.php on line 4 ---- FAILED ================================================================================ 001- \2 001+ Fatal error: Call to undefined function: mb_ereg_replace() in /Users/michaelj/Projects/php/php-4.3.0RC1/ext/mbstring/tests/mb_ereg_replace-compat-11.php on line 4 ================================================================================ ================================================================================ /Users/michaelj/Projects/php/php-4.3.0RC1/ext/mbstring/tests/mb_ereg_replace-compat-12.phpt ================================================================================ ---- EXPECTED OUTPUT zabc123 ---- ACTUAL OUTPUT Fatal error: Call to undefined function: mb_ereg_replace() in /Users/michaelj/Projects/php/php-4.3.0RC1/ext/mbstring/tests/mb_ereg_replace-compat-12.php on line 3 ---- FAILED ================================================================================ 001- zabc123 001+ Fatal error: Call to undefined function: mb_ereg_replace() in /Users/michaelj/Projects/php/php-4.3.0RC1/ext/mbstring/tests/mb_ereg_replace-compat-12.php on line 3 ================================================================================ ================================================================================ /Users/michaelj/Projects/php/php-4.3.0RC1/ext/mbstring/tests/mb_ereg_replace-compat-13.phpt ================================================================================ ---- EXPECTED OUTPUT abc123abc ---- ACTUAL OUTPUT Fatal error: Call to undefined function: mb_ereg_replace() in /Users/michaelj/Projects/php/php-4.3.0RC1/ext/mbstring/tests/mb_ereg_replace-compat-13.php on line 3 ---- FAILED ================================================================================ 001- abc123abc 001+ Fatal error: Call to undefined function: mb_ereg_replace() in /Users/michaelj/Projects/php/php-4.3.0RC1/ext/mbstring/tests/mb_ereg_replace-compat-13.php on line 3 ================================================================================ ================================================================================ /Users/michaelj/Projects/php/php-4.3.0RC1/ext/mbstring/tests/mb_ereg_replace.phpt ================================================================================ ---- EXPECTED OUTPUT a-b-c-d-e [abc] [def] [ghi] ---- ACTUAL OUTPUT Fatal error: Call to undefined function: mb_regex_set_options() in /Users/michaelj/Projects/php/php-4.3.0RC1/ext/mbstring/tests/mb_ereg_replace.php on line 2 ---- FAILED ================================================================================ 001- a-b-c-d-e 001+ Fatal error: Call to undefined function: mb_regex_set_options() in /Users/michaelj/Projects/php/php-4.3.0RC1/ext/mbstring/tests/mb_ereg_replace.php on line 2 002- [abc] [def] [ghi] ================================================================================ ================================================================================ /Users/michaelj/Projects/php/php-4.3.0RC1/ext/mbstring/tests/mb_ereg_search_xxx.phpt ================================================================================ ---- EXPECTED OUTPUT (EUC-JP) (10) ¡¦¢Ï (EUC-JP) (5) abcde (EUC-JP) (14) abdeabcf (EUC-JP) (22) abc (EUC-JP) (31) abcd (EUC-JP) (5) ¢Ï¡¦ (EUC-JP) (10) ¡¦¢Ï (EUC-JP) (5) abcde (EUC-JP) (14) abdeabcf (EUC-JP) (22) abc (EUC-JP) (31) abcd (Shift_JIS) (10) ¡¦¢Ï (Shift_JIS) (5) abcde (Shift_JIS) (14) abdeabcf (Shift_JIS) (22) abc (Shift_JIS) (31) abcd (Shift_JIS) (5) ¢Ï¡¦ (Shift_JIS) (10) ¡¦¢Ï (Shift_JIS) (5) abcde (Shift_JIS) (14) abdeabcf (Shift_JIS) (22) abc (Shift_JIS) (31) abcd (SJIS) (10) ¡¦¢Ï (SJIS) (5) abcde (SJIS) (14) abdeabcf (SJIS) (22) abc (SJIS) (31) abcd (SJIS) (5) ¢Ï¡¦ (SJIS) (10) ¡¦¢Ï (SJIS) (5) abcde (SJIS) (14) abdeabcf (SJIS) (22) abc (SJIS) (31) abcd (UTF-8) (14) ¡¦¢Ï (UTF-8) (5) abcde (UTF-8) (14) abdeabcf (UTF-8) (22) abc (UTF-8) (31) abcd (UTF-8) (7) ¢Ï¡¦ (UTF-8) (14) ¡¦¢Ï (UTF-8) (5) abcde (UTF-8) (14) abdeabcf (UTF-8) (22) abc (UTF-8) (31) abcd ---- ACTUAL OUTPUT Fatal error: Call to undefined function: mb_regex_set_options() in /Users/michaelj/Projects/php/php-4.3.0RC1/ext/mbstring/tests/mb_ereg_search_xxx.php on line 2 ---- FAILED ================================================================================ 001- (EUC-JP) (10) ¡¦¢Ï 001+ Fatal error: Call to undefined function: mb_regex_set_options() in /Users/michaelj/Projects/php/php-4.3.0RC1/ext/mbstring/tests/mb_ereg_search_xxx.php on line 2 002- (EUC-JP) (5) abcde 003- (EUC-JP) (14) abdeabcf 004- (EUC-JP) (22) abc 005- (EUC-JP) (31) abcd 006- (EUC-JP) (5) ¢Ï¡¦ 007- (EUC-JP) (10) ¡¦¢Ï 008- (EUC-JP) (5) abcde 009- (EUC-JP) (14) abdeabcf 010- (EUC-JP) (22) abc 011- (EUC-JP) (31) abcd 012- (Shift_JIS) (10) ¡¦¢Ï 013- (Shift_JIS) (5) abcde 014- (Shift_JIS) (14) abdeabcf 015- (Shift_JIS) (22) abc 016- (Shift_JIS) (31) abcd 017- (Shift_JIS) (5) ¢Ï¡¦ 018- (Shift_JIS) (10) ¡¦¢Ï 019- (Shift_JIS) (5) abcde 020- (Shift_JIS) (14) abdeabcf 021- (Shift_JIS) (22) abc 022- (Shift_JIS) (31) abcd 023- (SJIS) (10) ¡¦¢Ï 024- (SJIS) (5) abcde 025- (SJIS) (14) abdeabcf 026- (SJIS) (22) abc 027- (SJIS) (31) abcd 028- (SJIS) (5) ¢Ï¡¦ 029- (SJIS) (10) ¡¦¢Ï 030- (SJIS) (5) abcde 031- (SJIS) (14) abdeabcf 032- (SJIS) (22) abc 033- (SJIS) (31) abcd 034- (UTF-8) (14) ¡¦¢Ï 035- (UTF-8) (5) abcde 036- (UTF-8) (14) abdeabcf 037- (UTF-8) (22) abc 038- (UTF-8) (31) abcd 039- (UTF-8) (7) ¢Ï¡¦ 040- (UTF-8) (14) ¡¦¢Ï 041- (UTF-8) (5) abcde 042- (UTF-8) (14) abdeabcf 043- (UTF-8) (22) abc 044- (UTF-8) (31) abcd ================================================================================ ================================================================================ /Users/michaelj/Projects/php/php-4.3.0RC1/ext/mbstring/tests/mb_regex_set_options.phpt ================================================================================ ---- EXPECTED OUTPUT + + + + +-++++ ---- ACTUAL OUTPUT Fatal error: Call to undefined function: mb_regex_set_options() in /Users/michaelj/Projects/php/php-4.3.0RC1/ext/mbstring/tests/mb_regex_set_options.php on line 2 ---- FAILED ================================================================================ 001- + + + + +-++++ 001+ Fatal error: Call to undefined function: mb_regex_set_options() in /Users/michaelj/Projects/php/php-4.3.0RC1/ext/mbstring/tests/mb_regex_set_options.php on line 2 ================================================================================ ================================================================================ /Users/michaelj/Projects/php/php-4.3.0RC1/ext/mbstring/tests/mb_split-compat-01.phpt ================================================================================ ---- EXPECTED OUTPUT 4 this is a test ---- ACTUAL OUTPUT Fatal error: Call to undefined function: mb_split() in /Users/michaelj/Projects/php/php-4.3.0RC1/ext/mbstring/tests/mb_split-compat-01.php on line 3 ---- FAILED ================================================================================ 001- 4 001+ Fatal error: Call to undefined function: mb_split() in /Users/michaelj/Projects/php/php-4.3.0RC1/ext/mbstring/tests/mb_split-compat-01.php on line 3 002- this 003- is 004- a 005- test ================================================================================ ================================================================================ /Users/michaelj/Projects/php/php-4.3.0RC1/ext/mbstring/tests/mb_split.phpt ================================================================================ ---- EXPECTED OUTPUT bool(true) ok ok ok ok ok ok 2-2 3-3 4-4 ---- ACTUAL OUTPUT Fatal error: Call to undefined function: mb_regex_set_options() in /Users/michaelj/Projects/php/php-4.3.0RC1/ext/mbstring/tests/mb_split.php on line 2 ---- FAILED ================================================================================ 001- bool(true) 001+ Fatal error: Call to undefined function: mb_regex_set_options() in /Users/michaelj/Projects/php/php-4.3.0RC1/ext/mbstring/tests/mb_split.php on line 2 002- ok 003- ok 004- ok 005- ok 006- ok 007- ok 008- 2-2 009- 3-3 010- 4-4 ================================================================================ ================================================================================ /Users/michaelj/Projects/php/php-4.3.0RC1/ext/mbstring/tests/overload.phpt ================================================================================ ---- EXPECTED OUTPUT EUC-JP int(33) int(33) int(10) int(8) int(3) int(29) ---- ACTUAL OUTPUT EUC-JP int(33) int(33) Fatal error: Call to undefined function: mb_regex_encoding() in /Users/michaelj/Projects/php/php-4.3.0RC1/ext/mbstring/tests/overload.php on line 10 ---- FAILED ================================================================================ 004- int(10) 004+ 005- int(8) 005+ Fatal error: Call to undefined function: mb_regex_encoding() in /Users/michaelj/Projects/php/php-4.3.0RC1/ext/mbstring/tests/overload.php on line 10 006- int(3) 007- int(29) ================================================================================ ================================================================================ /Users/michaelj/Projects/php/php-4.3.0RC1/ext/mbstring/tests/php_gr_jp_10830.phpt ================================================================================ ---- EXPECTED OUTPUT bool(false) bool(false) ---- ACTUAL OUTPUT Fatal error: Call to undefined function: mb_ereg() in /Users/michaelj/Projects/php/php-4.3.0RC1/ext/mbstring/tests/php_gr_jp_10830.php on line 4 ---- FAILED ================================================================================ 001- bool(false) 001+ Fatal error: Call to undefined function: mb_ereg() in /Users/michaelj/Projects/php/php-4.3.0RC1/ext/mbstring/tests/php_gr_jp_10830.php on line 4 002- bool(false) ================================================================================ ================================================================================ /Users/michaelj/Projects/php/php-4.3.0RC1/ext/standard/tests/file/001.phpt ================================================================================ ---- EXPECTED OUTPUT test.file does not exist test.file exists test.link exists test.file is not a symlink test.link is a symlink test.file exists test.link lstat and stat differ at element 1 test.link lstat and stat differ at element 2 test.link lstat and stat differ at element 7 test.link lstat and stat differ at element 8 test.link lstat and stat differ at element 9 test.link lstat and stat differ at element 10 test.file is file test.link is link test.file permissions are 0744 test.file size is 0 test.file is writeable test.file is readable test.file is executable test.file is a regular file test.link is a regular file test.link is not a directory ../file is a directory test.file is not a directory test.file does not exist test.file does not exist ---- ACTUAL OUTPUT test.file does not exist test.file exists test.link exists test.file is not a symlink test.link is a symlink test.file exists test.link lstat and stat differ at element 1 test.link lstat and stat differ at element 2 test.link lstat and stat differ at element 7 test.link lstat and stat differ at element 8 test.link lstat and stat differ at element 9 test.file is file test.link is link test.file permissions are 0744 test.file size is 0 test.file is writeable test.file is readable test.file is executable test.file is a regular file test.link is a regular file test.link is not a directory ../file is a directory test.file is not a directory test.file does not exist test.file does not exist ---- FAILED ================================================================================ 012- test.link lstat and stat differ at element 10 012+ test.file is file 013- test.file is file 013+ test.link is link 014- test.link is link 014+ test.file permissions are 0744 015- test.file permissions are 0744 015+ test.file size is 0 016- test.file size is 0 016+ test.file is writeable 017- test.file is writeable 017+ test.file is readable 018- test.file is readable 018+ test.file is executable 019- test.file is executable 019+ test.file is a regular file 020- test.file is a regular file 020+ test.link is a regular file 021- test.link is a regular file 021+ test.link is not a directory 022- test.link is not a directory 022+ ../file is a directory 023- ../file is a directory 023+ test.file is not a directory 024- test.file is not a directory 024+ test.file does not exist 026- test.file does not exist ================================================================================ ================================================================================ /Users/michaelj/Projects/php/php-4.3.0RC1/ext/standard/tests/file/fopencookie.phpt ================================================================================ ---- EXPECTED OUTPUT If you can read this, it worked ---- ACTUAL OUTPUT Warning: main() [/phpmanual/function.main.html]: cannot represent a stream of type user-space as a STDIO FILE* in /Users/michaelj/Projects/php/php-4.3.0RC1/ext/standard/tests/file/fopencookie.php on line 79 Warning: Failed opening 'cookietest://foo' for inclusion (include_path='.:') in /Users/michaelj/Projects/php/php-4.3.0RC1/ext/standard/tests/file/fopencookie.php on line 79 ---- FAILED ================================================================================ 001- If you can read this, it worked 001+ Warning: main() [/phpmanual/function.main.html]: cannot represent a stream of type user-space as a STDIO FILE* in /Users/michaelj/Projects/php/php-4.3.0RC1/ext/standard/tests/file/fopencookie.php on line 79 002+ 003+ Warning: Failed opening 'cookietest://foo' for inclusion (include_path='.:') in /Users/michaelj/Projects/php/php-4.3.0RC1/ext/standard/tests/file/fopencookie.php on line 79 ================================================================================ ================================================================================ /Users/michaelj/Projects/php/php-4.3.0RC1/tests/lang/034.phpt ================================================================================ ---- EXPECTED OUTPUT 3,14 ---- ACTUAL OUTPUT 3.14 ---- FAILED ================================================================================ 001- 3,14 001+ 3.14 ================================================================================ ================================================================================ PHPINFO ================================================================================ phpinfo() PHP Version => 4.3.0RC1 System => Darwin AirBook.local. 6.2 Darwin Kernel Version 6.2: Tue Nov 5 22:00:03 PST 2002; root:xnu/xnu-344.12.2.obj~1/RELEASE_PPC Power Macintosh Build Date => Nov 25 2002 22:27:17 Configure Command => './configure' '--with-xml' '--with-zlib' '--with-apxs=/usr/sbin/apxs' '--with-fbsql' '--enable-ftp' '--enable-mbstring' '--enable-mbstr-enc-trans' '--without-pear' Server API => Command Line Interface Virtual Directory Support => disabled Configuration File (php.ini) Path => /usr/local/lib PHP API => 20020918 PHP Extension => 20020429 Zend Extension => 20021010 Debug Build => no Thread Safety => disabled Registered PHP Streams => php, http, ftp, compress.zlib This program makes use of the Zend Scripting Language Engine: Zend Engine v1.3.0, Copyright (c) 1998-2002 Zend Technologies _______________________________________________________________________ Configuration PHP Core Directive => Local Value => Master Value allow_call_time_pass_reference => On => On allow_url_fopen => On => On always_populate_raw_post_data => Off => Off arg_separator.input => &amp; => &amp; arg_separator.output => &amp; => &amp; asp_tags => Off => Off auto_append_file => no value => no value auto_prepend_file => no value => no value browscap => no value => no value default_charset => no value => no value default_mimetype => text/html => text/html define_syslog_variables => Off => Off disable_functions => no value => no value display_errors => On => On display_startup_errors => Off => Off doc_root => no value => no value docref_ext => no value => no value docref_root => http://www.php.net/ => http://www.php.net/ enable_dl => On => On error_append_string => no value => no value error_log => no value => no value error_prepend_string => no value => no value error_reporting => no value => no value expose_php => On => On extension_dir => /usr/local/lib/php/extensions/no-debug-non-zts-20020429 => /usr/local/lib/php/extensions/no-debug-non-zts-20020429 file_uploads => On => On gpc_order => GPC => GPC highlight.bg => #FFFFFF => #FFFFFF highlight.comment => #FF8000 => #FF8000 highlight.default => #0000BB => #0000BB highlight.html => #000000 => #000000 highlight.keyword => #007700 => #007700 highlight.string => #DD0000 => #DD0000 html_errors => Off => On ignore_repeated_errors => Off => Off ignore_repeated_source => Off => Off ignore_user_abort => Off => Off implicit_flush => On => Off include_path => .: => .: log_errors => Off => Off log_errors_max_len => 1024 => 1024 magic_quotes_gpc => On => On magic_quotes_runtime => Off => Off magic_quotes_sybase => Off => Off max_execution_time => 0 => 30 max_input_time => -1 => -1 open_basedir => no value => no value output_buffering => 0 => 0 output_handler => no value => no value post_max_size => 8M => 8M precision => 14 => 14 register_argc_argv => On => On register_globals => Off => Off report_memleaks => On => On safe_mode => Off => Off safe_mode_exec_dir => 1 => 1 safe_mode_gid => Off => Off safe_mode_include_dir => no value => no value sendmail_from => no value => no value sendmail_path => /usr/sbin/sendmail -t -i => /usr/sbin/sendmail -t -i short_open_tag => On => On SMTP => localhost => localhost smtp_port => 25 => 25 sql.safe_mode => Off => Off track_errors => Off => Off unserialize_callback_func => no value => no value upload_max_filesize => 2M => 2M upload_tmp_dir => no value => no value user_dir => no value => no value variables_order => no value => no value xmlrpc_error_number => 0 => 0 xmlrpc_errors => Off => Off y2k_compliance => On => On xml XML Support => active XML Namespace Support => active EXPAT Version => 1.95.2 tokenizer Tokenizer Support => enabled standard Regex Library => Bundled library enabled Dynamic Library Support => enabled Path to sendmail => /usr/sbin/sendmail -t -i Directive => Local Value => Master Value assert.active => 1 => 1 assert.bail => 0 => 0 assert.callback => no value => no value assert.quiet_eval => 0 => 0 assert.warning => 1 => 1 auto_detect_line_endings => 0 => 0 default_socket_timeout => 60 => 60 safe_mode_allowed_env_vars => PHP_ => PHP_ safe_mode_protected_env_vars => LD_LIBRARY_PATH => LD_LIBRARY_PATH url_rewriter.tags => a=href,area=href,frame=src,form=,fieldset= => a=href,area=href,frame=src,form=,fieldset= user_agent => no value => no value session Session Support => enabled Registered save handlers => files user Directive => Local Value => Master Value session.auto_start => Off => Off session.bug_compat_42 => On => On session.bug_compat_warn => On => On session.cache_expire => 180 => 180 session.cache_limiter => nocache => nocache session.cookie_domain => no value => no value session.cookie_lifetime => 0 => 0 session.cookie_path => / => / session.cookie_secure => Off => Off session.entropy_file => no value => no value session.entropy_length => 0 => 0 session.gc_dividend => 100 => 100 session.gc_maxlifetime => 1440 => 1440 session.gc_probability => 1 => 1 session.name => PHPSESSID => PHPSESSID session.referer_check => no value => no value session.save_handler => files => files session.save_path => /tmp => /tmp session.serialize_handler => php => php session.use_cookies => On => On session.use_only_cookies => Off => Off session.use_trans_sid => Off => Off posix Revision => $Revision: 1.51 $ pcre PCRE (Perl Compatible Regular Expressions) Support => enabled PCRE Library Version => 3.92 11-Sep-2002 overload User-Space Object Overloading Support => enabled mysql MySQL Support => enabled Active Persistent Links => 0 Active Links => 0 Client API version => 3.23.49 MYSQL_MODULE_TYPE => builtin MYSQL_SOCKET => /tmp/mysql.sock MYSQL_INCLUDE => MYSQL_LIBS => Directive => Local Value => Master Value mysql.allow_persistent => On => On mysql.connect_timeout => -1 => -1 mysql.default_host => no value => no value mysql.default_password => no value => no value mysql.default_port => no value => no value mysql.default_socket => no value => no value mysql.default_user => no value => no value mysql.max_links => Unlimited => Unlimited mysql.max_persistent => Unlimited => Unlimited mysql.trace_mode => Off => Off mbstring Multibyte Support => enabled Japanese support => enabled Directive => Local Value => Master Value mbstring.detect_order => no value => no value mbstring.encoding_translation => Off => Off mbstring.func_overload => 0 => 0 mbstring.http_input => pass => pass mbstring.http_output => pass => pass mbstring.internal_encoding => none => none mbstring.language => neutral => neutral mbstring.substitute_character => no value => no value ftp FTP support => enabled fbsql FrontBase support => enabled Client API version => 2.24 Active Persistent Links => 0 Active Links => 0 Directive => Local Value => Master Value fbsql.allow_persistent => On => On fbsql.autocommit => On => On fbsql.batchSize => 1000 => 1000 fbsql.default_database => no value => no value fbsql.default_database_password => no value => no value fbsql.default_host => no value => no value fbsql.default_password => no value => no value fbsql.default_user => _SYSTEM => _SYSTEM fbsql.generate_warnings => Off => Off fbsql.max_connections => 128 => 128 fbsql.max_links => 128 => 128 fbsql.max_persistent => Unlimited => Unlimited fbsql.max_results => 128 => 128 ctype ctype functions => enabled zlib ZLib Support => enabled 'zlib:' fopen wrapper => enabled Compiled Version => 1.1.3 Linked Version => 1.1.3 Directive => Local Value => Master Value zlib.output_compression => Off => Off zlib.output_compression_level => -1 => -1 zlib.output_handler => no value => no value Additional Modules Module Name Environment Variable => Value PWD => /Users/michaelj/Projects/php/php-4.3.0RC1 MAKEFLAGS => VENDOR => apple MFLAGS => REDIRECT_STATUS => 1 TEST_PHP_EXECUTABLE => /Users/michaelj/Projects/php/php-4.3.0RC1/sapi/cli/php TERM_PROGRAM => Apple_Terminal MANPATH => /Users/michaelj/man:/usr/local/share/man:/usr/share/man CC => gcc USER => michaelj MACHTYPE => powerpc SCRIPT_FILENAME => /Users/michaelj/Projects/php/php-4.3.0RC1/tests/strings/004.php ENV_SET => CVS_RSH => ssh PATH_TRANSLATED => /Users/michaelj/Projects/php/php-4.3.0RC1/tests/strings/004.php TERMCAP => ¿ÿ×@ QUERY_STRING => CONTENT_LENGTH => HOST => airbook.local. MAKELEVEL => 1 DISPLAY => :0.0 SHLVL => 3 SSH_AGENT_PID => 390 LOGNAME => michaelj GROUP => staff _ => /Users/michaelj/Projects/php/php-4.3.0RC1/sapi/cli/php REQUEST_METHOD => GET SHELL => /bin/sh HOSTTYPE => macintosh TEST_PHP_SRCDIR => /Users/michaelj/Projects/php/php-4.3.0RC1 OSTYPE => darwin TERM => vt100 HOME => /Users/michaelj TERM_PROGRAM_VERSION => 81 SSH_ASKPASS => /Applications/Utilities/sshAskPass.app/Contents/MacOS/sshAskPass_SSHAdd SSH_AUTH_SOCK => /tmp/ssh-ckMU6rLG/agent.389 PATH => ~/bin/powerpc-apple-darwin:/Users/michaelj/bin:/usr/local/bin:/usr/bin:/bin:/usr/local/sbin:/usr/sbin:/sbin __CF_USER_TEXT_ENCODING => 0x1F5:0:0 CONTENT_TYPE => PHP Variables Variable => Value _SERVER["PWD"] => /Users/michaelj/Projects/php/php-4.3.0RC1 _SERVER["MAKEFLAGS"] => _SERVER["VENDOR"] => apple _SERVER["MFLAGS"] => _SERVER["REDIRECT_STATUS"] => 1 _SERVER["TEST_PHP_EXECUTABLE"] => /Users/michaelj/Projects/php/php-4.3.0RC1/sapi/cli/php _SERVER["TERM_PROGRAM"] => Apple_Terminal _SERVER["MANPATH"] => /Users/michaelj/man:/usr/local/share/man:/usr/share/man _SERVER["CC"] => gcc _SERVER["USER"] => michaelj _SERVER["MACHTYPE"] => powerpc _SERVER["SCRIPT_FILENAME"] => _SERVER["ENV_SET"] => _SERVER["CVS_RSH"] => ssh _SERVER["PATH_TRANSLATED"] => _SERVER["TERMCAP"] => ¿ÿ×@ _SERVER["QUERY_STRING"] => _SERVER["CONTENT_LENGTH"] => _SERVER["HOST"] => airbook.local. _SERVER["MAKELEVEL"] => 1 _SERVER["DISPLAY"] => :0.0 _SERVER["SHLVL"] => 3 _SERVER["SSH_AGENT_PID"] => 390 _SERVER["LOGNAME"] => michaelj _SERVER["GROUP"] => staff _SERVER["_"] => /Users/michaelj/Projects/php/php-4.3.0RC1/sapi/cli/php _SERVER["REQUEST_METHOD"] => GET _SERVER["SHELL"] => /bin/sh _SERVER["HOSTTYPE"] => macintosh _SERVER["TEST_PHP_SRCDIR"] => /Users/michaelj/Projects/php/php-4.3.0RC1 _SERVER["OSTYPE"] => darwin _SERVER["TERM"] => vt100 _SERVER["HOME"] => /Users/michaelj _SERVER["TERM_PROGRAM_VERSION"] => 81 _SERVER["SSH_ASKPASS"] => /Applications/Utilities/sshAskPass.app/Contents/MacOS/sshAskPass_SSHAdd _SERVER["SSH_AUTH_SOCK"] => /tmp/ssh-ckMU6rLG/agent.389 _SERVER["PATH"] => ~/bin/powerpc-apple-darwin:/Users/michaelj/bin:/usr/local/bin:/usr/bin:/bin:/usr/local/sbin:/usr/sbin:/sbin _SERVER["__CF_USER_TEXT_ENCODING"] => 0x1F5:0:0 _SERVER["CONTENT_TYPE"] => _SERVER["PHP_SELF"] => _SERVER["SCRIPT_NAME"] => _SERVER["DOCUMENT_ROOT"] => _SERVER["argv"] => Array ( ) _SERVER["argc"] => 0 _ENV["PWD"] => /Users/michaelj/Projects/php/php-4.3.0RC1 _ENV["MAKEFLAGS"] => _ENV["VENDOR"] => apple _ENV["MFLAGS"] => _ENV["REDIRECT_STATUS"] => 1 _ENV["TEST_PHP_EXECUTABLE"] => /Users/michaelj/Projects/php/php-4.3.0RC1/sapi/cli/php _ENV["TERM_PROGRAM"] => Apple_Terminal _ENV["MANPATH"] => /Users/michaelj/man:/usr/local/share/man:/usr/share/man _ENV["CC"] => gcc _ENV["USER"] => michaelj _ENV["MACHTYPE"] => powerpc _ENV["SCRIPT_FILENAME"] => /Users/michaelj/Projects/php/php-4.3.0RC1/tests/strings/004.php _ENV["ENV_SET"] => _ENV["CVS_RSH"] => ssh _ENV["PATH_TRANSLATED"] => /Users/michaelj/Projects/php/php-4.3.0RC1/tests/strings/004.php _ENV["TERMCAP"] => ¿ÿ×@ _ENV["QUERY_STRING"] => _ENV["CONTENT_LENGTH"] => _ENV["HOST"] => airbook.local. _ENV["MAKELEVEL"] => 1 _ENV["DISPLAY"] => :0.0 _ENV["SHLVL"] => 3 _ENV["SSH_AGENT_PID"] => 390 _ENV["LOGNAME"] => michaelj _ENV["GROUP"] => staff _ENV["_"] => /Users/michaelj/Projects/php/php-4.3.0RC1/sapi/cli/php _ENV["REQUEST_METHOD"] => GET _ENV["SHELL"] => /bin/sh _ENV["HOSTTYPE"] => macintosh _ENV["TEST_PHP_SRCDIR"] => /Users/michaelj/Projects/php/php-4.3.0RC1 _ENV["OSTYPE"] => darwin _ENV["TERM"] => vt100 _ENV["HOME"] => /Users/michaelj _ENV["TERM_PROGRAM_VERSION"] => 81 _ENV["SSH_ASKPASS"] => /Applications/Utilities/sshAskPass.app/Contents/MacOS/sshAskPass_SSHAdd _ENV["SSH_AUTH_SOCK"] => /tmp/ssh-ckMU6rLG/agent.389 _ENV["PATH"] => ~/bin/powerpc-apple-darwin:/Users/michaelj/bin:/usr/local/bin:/usr/bin:/bin:/usr/local/sbin:/usr/sbin:/sbin _ENV["__CF_USER_TEXT_ENCODING"] => 0x1F5:0:0 _ENV["CONTENT_TYPE"] => PHP License This program is free software; you can redistribute it and/or modify it under the terms of the PHP License as published by the PHP Group and included in the distribution in the file: LICENSE This program is distributed in the hope that it will be useful, but WITHOUT ANY WARRANTY; without even the implied warranty of MERCHANTABILITY or FITNESS FOR A PARTICULAR PURPOSE. If you did not receive a copy of the PHP license, or have any questions about PHP licensing, please contact license@php.net.

« previous php.qa (#7009) next »