Test results
| From: | noreply@php.net | Date: | Fri, 06 Dec 2002 03:17:49 +0000 |
| Subject: | Test results | ||
| Groups: | php.qa | ||
| Request: | Send a blank email to php-qa+get-7119@lists.php.net to get a copy of this message | ||
=====================================================================
FAILED TEST SUMMARY
---------------------------------------------------------------------
File type functions
[/Volumes/Darwin/Documents/OS9Documents/downloads/php-4.3.0RC2/ext/standard/tests/file/001.phpt]
Relative and absolute arg handling
[/Volumes/Darwin/Documents/OS9Documents/downloads/php-4.3.0RC2/ext/xslt/tests/bug20177.phpt]
Don't override xslt_set_base (bug #20518)
[/Volumes/Darwin/Documents/OS9Documents/downloads/php-4.3.0RC2/ext/xslt/tests/bug20518.phpt]
Various ways to provide xml and xslt arguments and params
[/Volumes/Darwin/Documents/OS9Documents/downloads/php-4.3.0RC2/ext/xslt/tests/xslt_process-001.phpt]
Crash xslt_process with reused handler (this test may take a while)
[/Volumes/Darwin/Documents/OS9Documents/downloads/php-4.3.0RC2/ext/xslt/tests/xslt_process-002.phpt]
xslt_set_object function
[/Volumes/Darwin/Documents/OS9Documents/downloads/php-4.3.0RC2/ext/xslt/tests/xslt_set_object.phpt]
xslt_setopt function and public entities
[/Volumes/Darwin/Documents/OS9Documents/downloads/php-4.3.0RC2/ext/xslt/tests/xslt_setopt.phpt]
=====================================================================
================================================================================
/Volumes/Darwin/Documents/OS9Documents/downloads/php-4.3.0RC2/ext/standard/tests/file/001.phpt
================================================================================
---- EXPECTED OUTPUT
test.file does not exist
test.file exists
test.link exists
test.file is not a symlink
test.link is a symlink
test.file exists
test.link lstat and stat differ at element 1
test.link lstat and stat differ at element 2
test.link lstat and stat differ at element 7
test.link lstat and stat differ at element 8
test.link lstat and stat differ at element 9
test.link lstat and stat differ at element 10
test.file is file
test.link is link
test.file permissions are 0744
test.file size is 0
test.file is writeable
test.file is readable
test.file is executable
test.file is a regular file
test.link is a regular file
test.link is not a directory
../file is a directory
test.file is not a directory
test.file does not exist
test.file does not exist
---- ACTUAL OUTPUT
test.file does not exist
test.file exists
test.link exists
test.file is not a symlink
test.link is a symlink
test.file exists
test.link lstat and stat differ at element 1
test.link lstat and stat differ at element 2
test.link lstat and stat differ at element 7
test.link lstat and stat differ at element 8
test.link lstat and stat differ at element 9
test.file is file
test.link is link
test.file permissions are 0744
test.file size is 0
test.file is writeable
test.file is readable
test.file is executable
test.file is a regular file
test.link is a regular file
test.link is not a directory
../file is a directory
test.file is not a directory
test.file does not exist
test.file does not exist
---- FAILED
================================================================================
012- test.link lstat and stat differ at element 10
012+ test.file is file
013- test.file is file
013+ test.link is link
014- test.link is link
014+ test.file permissions are 0744
015- test.file permissions are 0744
015+ test.file size is 0
016- test.file size is 0
016+ test.file is writeable
017- test.file is writeable
017+ test.file is readable
018- test.file is readable
018+ test.file is executable
019- test.file is executable
019+ test.file is a regular file
020- test.file is a regular file
020+ test.link is a regular file
021- test.link is a regular file
021+ test.link is not a directory
022- test.link is not a directory
022+ ../file is a directory
023- ../file is a directory
023+ test.file is not a directory
024- test.file is not a directory
024+ test.file does not exist
026- test.file does not exist
================================================================================
================================================================================
/Volumes/Darwin/Documents/OS9Documents/downloads/php-4.3.0RC2/ext/xslt/tests/bug20177.phpt
================================================================================
---- EXPECTED OUTPUT
Test has passed
Test has passed
---- ACTUAL OUTPUT
Warning: Sablotron error on line 5: unknown encoding 'ISO-8859-1' in
/Volumes/Darwin/Documents/OS9Documents/downloads/php-4.3.0RC2/ext/xslt/tests/bug20177.php on line 14
Warning: Sablotron error on line 5: unknown encoding 'ISO-8859-1' in
/Volumes/Darwin/Documents/OS9Documents/downloads/php-4.3.0RC2/ext/xslt/tests/bug20177.php on line 16
---- FAILED
================================================================================
001- Test has passed
001+ Warning: Sablotron error on line 5: unknown encoding 'ISO-8859-1' in
/Volumes/Darwin/Documents/OS9Documents/downloads/php-4.3.0RC2/ext/xslt/tests/bug20177.php on line 14
002- Test has passed
002+
003+
004+ Warning: Sablotron error on line 5: unknown encoding 'ISO-8859-1' in
/Volumes/Darwin/Documents/OS9Documents/downloads/php-4.3.0RC2/ext/xslt/tests/bug20177.php on line 16
================================================================================
================================================================================
/Volumes/Darwin/Documents/OS9Documents/downloads/php-4.3.0RC2/ext/xslt/tests/bug20518.phpt
================================================================================
---- EXPECTED OUTPUT
Test has passed
---- ACTUAL OUTPUT
Warning: Sablotron error on line 5: unknown encoding 'ISO-8859-1' in
/Volumes/Darwin/Documents/OS9Documents/downloads/php-4.3.0RC2/ext/xslt/tests/bug20518.php on line 16
---- FAILED
================================================================================
001- Test has passed
001+ Warning: Sablotron error on line 5: unknown encoding 'ISO-8859-1' in
/Volumes/Darwin/Documents/OS9Documents/downloads/php-4.3.0RC2/ext/xslt/tests/bug20518.php on line 16
================================================================================
================================================================================
/Volumes/Darwin/Documents/OS9Documents/downloads/php-4.3.0RC2/ext/xslt/tests/xslt_process-001.phpt
================================================================================
---- EXPECTED OUTPUT
Test has passed
Test has passed
Test has passed
Test has passed
Test has passed
Test has passed
Test has passed
Test has passed
PHP QA®
PHP QA®
PHP QA®
PHP QA®
---- ACTUAL OUTPUT
Warning: Sablotron error on line 4: unknown encoding 'ISO-8859-1' in
/Volumes/Darwin/Documents/OS9Documents/downloads/php-4.3.0RC2/ext/xslt/tests/xslt_process-001.php on
line 9
Warning: Sablotron error on line 4: unknown encoding 'ISO-8859-1' in
/Volumes/Darwin/Documents/OS9Documents/downloads/php-4.3.0RC2/ext/xslt/tests/xslt_process-001.php on
line 11
Warning: Sablotron error on line 4: unknown encoding 'ISO-8859-1' in
/Volumes/Darwin/Documents/OS9Documents/downloads/php-4.3.0RC2/ext/xslt/tests/xslt_process-001.php on
line 13
Warning: Sablotron error on line 4: unknown encoding 'ISO-8859-1' in
/Volumes/Darwin/Documents/OS9Documents/downloads/php-4.3.0RC2/ext/xslt/tests/xslt_process-001.php on
line 15
Warning: Sablotron error on line 4: unknown encoding 'ISO-8859-1' in
/Volumes/Darwin/Documents/OS9Documents/downloads/php-4.3.0RC2/ext/xslt/tests/xslt_process-001.php on
line 26
Warning: Sablotron error on line 4: unknown encoding 'ISO-8859-1' in
/Volumes/Darwin/Documents/OS9Documents/downloads/php-4.3.0RC2/ext/xslt/tests/xslt_process-001.php on
line 28
Warning: Sablotron error on line 4: unknown encoding 'ISO-8859-1' in
/Volumes/Darwin/Documents/OS9Documents/downloads/php-4.3.0RC2/ext/xslt/tests/xslt_process-001.php on
line 30
Warning: Sablotron error on line 4: unknown encoding 'ISO-8859-1' in
/Volumes/Darwin/Documents/OS9Documents/downloads/php-4.3.0RC2/ext/xslt/tests/xslt_process-001.php on
line 32
Warning: Sablotron error on line 4: unknown encoding 'ISO-8859-1' in
/Volumes/Darwin/Documents/OS9Documents/downloads/php-4.3.0RC2/ext/xslt/tests/xslt_process-001.php on
line 26
Warning: Sablotron error on line 4: unknown encoding 'ISO-8859-1' in
/Volumes/Darwin/Documents/OS9Documents/downloads/php-4.3.0RC2/ext/xslt/tests/xslt_process-001.php on
line 28
Warning: Sablotron error on line 4: unknown encoding 'ISO-8859-1' in
/Volumes/Darwin/Documents/OS9Documents/downloads/php-4.3.0RC2/ext/xslt/tests/xslt_process-001.php on
line 30
Warning: Sablotron error on line 4: unknown encoding 'ISO-8859-1' in
/Volumes/Darwin/Documents/OS9Documents/downloads/php-4.3.0RC2/ext/xslt/tests/xslt_process-001.php on
line 32
---- FAILED
================================================================================
001- Test has passed
001+ Warning: Sablotron error on line 4: unknown encoding 'ISO-8859-1' in
/Volumes/Darwin/Documents/OS9Documents/downloads/php-4.3.0RC2/ext/xslt/tests/xslt_process-001.php on
line 9
002- Test has passed
002+
003- Test has passed
003+
004- Test has passed
004+ Warning: Sablotron error on line 4: unknown encoding 'ISO-8859-1' in
/Volumes/Darwin/Documents/OS9Documents/downloads/php-4.3.0RC2/ext/xslt/tests/xslt_process-001.php on
line 11
005- Test has passed
005+
006- Test has passed
006+
007- Test has passed
007+ Warning: Sablotron error on line 4: unknown encoding 'ISO-8859-1' in
/Volumes/Darwin/Documents/OS9Documents/downloads/php-4.3.0RC2/ext/xslt/tests/xslt_process-001.php on
line 13
008- Test has passed
008+
009- PHP QA®
009+
010- PHP QA®
010+ Warning: Sablotron error on line 4: unknown encoding 'ISO-8859-1' in
/Volumes/Darwin/Documents/OS9Documents/downloads/php-4.3.0RC2/ext/xslt/tests/xslt_process-001.php on
line 15
011- PHP QA®
011+
012- PHP QA®
012+
013+ Warning: Sablotron error on line 4: unknown encoding 'ISO-8859-1' in
/Volumes/Darwin/Documents/OS9Documents/downloads/php-4.3.0RC2/ext/xslt/tests/xslt_process-001.php on
line 26
014+
015+
016+ Warning: Sablotron error on line 4: unknown encoding 'ISO-8859-1' in
/Volumes/Darwin/Documents/OS9Documents/downloads/php-4.3.0RC2/ext/xslt/tests/xslt_process-001.php on
line 28
017+
018+
019+ Warning: Sablotron error on line 4: unknown encoding 'ISO-8859-1' in
/Volumes/Darwin/Documents/OS9Documents/downloads/php-4.3.0RC2/ext/xslt/tests/xslt_process-001.php on
line 30
020+
021+
022+ Warning: Sablotron error on line 4: unknown encoding 'ISO-8859-1' in
/Volumes/Darwin/Documents/OS9Documents/downloads/php-4.3.0RC2/ext/xslt/tests/xslt_process-001.php on
line 32
023+
024+
025+ Warning: Sablotron error on line 4: unknown encoding 'ISO-8859-1' in
/Volumes/Darwin/Documents/OS9Documents/downloads/php-4.3.0RC2/ext/xslt/tests/xslt_process-001.php on
line 26
026+
027+
028+ Warning: Sablotron error on line 4: unknown encoding 'ISO-8859-1' in
/Volumes/Darwin/Documents/OS9Documents/downloads/php-4.3.0RC2/ext/xslt/tests/xslt_process-001.php on
line 28
029+
030+
031+ Warning: Sablotron error on line 4: unknown encoding 'ISO-8859-1' in
/Volumes/Darwin/Documents/OS9Documents/downloads/php-4.3.0RC2/ext/xslt/tests/xslt_process-001.php on
line 30
032+
033+
034+ Warning: Sablotron error on line 4: unknown encoding 'ISO-8859-1' in
/Volumes/Darwin/Documents/OS9Documents/downloads/php-4.3.0RC2/ext/xslt/tests/xslt_process-001.php on
line 32
================================================================================
================================================================================
/Volumes/Darwin/Documents/OS9Documents/downloads/php-4.3.0RC2/ext/xslt/tests/xslt_process-002.phpt
================================================================================
---- EXPECTED OUTPUT
OK
---- ACTUAL OUTPUT
Warning: Sablotron error on line 4: unknown encoding 'ISO-8859-1' in
/Volumes/Darwin/Documents/OS9Documents/downloads/php-4.3.0RC2/ext/xslt/tests/xslt_process-002.php on
line 52
Failed 0 / R<hy(?5r¾O®:
Decode: 82 60 104 121 40 63 53 114 190 79 174
Warning: Sablotron error on line 4: unknown encoding 'ISO-8859-1' in
/Volumes/Darwin/Documents/OS9Documents/downloads/php-4.3.0RC2/ext/xslt/tests/xslt_process-002.php on
line 52
Failed 1 / ¿·¥:
Decode: 24 191 183 165
Warning: Sablotron error on line 4: unknown encoding 'ISO-8859-1' in
/Volumes/Darwin/Documents/OS9Documents/downloads/php-4.3.0RC2/ext/xslt/tests/xslt_process-002.php on
line 52
Failed 2 / ôÕ¯:
Decode: 143 244 213 175
Warning: Sablotron error on line 4: unknown encoding 'ISO-8859-1' in
/Volumes/Darwin/Documents/OS9Documents/downloads/php-4.3.0RC2/ext/xslt/tests/xslt_process-002.php on
line 52
Failed 3 / Û2G|º®lýIú`ê:
Decode: 219 50 71 124 148 186 174 108 253 131 136 73 250 96 234
Warning: Sablotron error on line 4: unknown encoding 'ISO-8859-1' in
/Volumes/Darwin/Documents/OS9Documents/downloads/php-4.3.0RC2/ext/xslt/tests/xslt_process-002.php on
line 52
Failed 4 / /,º¯:
Decode: 47 44 186 175
Warning: Sablotron error on line 4: unknown encoding 'ISO-8859-1' in
/Volumes/Darwin/Documents/OS9Documents/downloads/php-4.3.0RC2/ext/xslt/tests/xslt_process-002.php on
line 52
Failed 5 / f*¿è5ö§R:
Decode: 102 21 173 42 191 156 232 53 246 167 129 82
Warning: Sablotron error on line 4: unknown encoding 'ISO-8859-1' in
/Volumes/Darwin/Documents/OS9Documents/downloads/php-4.3.0RC2/ext/xslt/tests/xslt_process-002.php on
line 52
Failed 6 / MÌËPpE¼ºµÌJS;æº:
Decode: 77 204 203 80 112 69 188 186 181 204 74 83 59 230 186
Warning: Sablotron error on line 4: unknown encoding 'ISO-8859-1' in
/Volumes/Darwin/Documents/OS9Documents/downloads/php-4.3.0RC2/ext/xslt/tests/xslt_process-002.php on
line 52
Failed 7 / 15WvWhÄa}Ó>2Ù:
Decode: 49 53 87 118 129 141 87 104 196 97 125 211 62 50 217
Warning: Sablotron error on line 4: unknown encoding 'ISO-8859-1' in
/Volumes/Darwin/Documents/OS9Documents/downloads/php-4.3.0RC2/ext/xslt/tests/xslt_process-002.php on
line 52
Failed 8 / 8ð/3X:
Decode: 142 152 56 240 150 47 51 88
Warning: Sablotron error on line 4: unknown encoding 'ISO-8859-1' in
/Volumes/Darwin/Documents/OS9Documents/downloads/php-4.3.0RC2/ext/xslt/tests/xslt_process-002.php on
line 52
Failed 9 / àKLÛ:
Decode: 224 75 150 148 76 219
Warning: Sablotron error on line 4: unknown encoding 'ISO-8859-1' in
/Volumes/Darwin/Documents/OS9Documents/downloads/php-4.3.0RC2/ext/xslt/tests/xslt_process-002.php on
line 52
Failed 10 / ;;asH¤'0ïPR¬ :
Decode: 59 59 97 115 72 164 39 48 239 80 82 172 160
Warning: Sablotron error on line 4: unknown encoding 'ISO-8859-1' in
/Volumes/Darwin/Documents/OS9Documents/downloads/php-4.3.0RC2/ext/xslt/tests/xslt_process-002.php on
line 52
Failed 11 / »`Ùiá<eÀ:
Decode: 187 96 217 105 225 60 173 101 192
Warning: Sablotron error on line 4: unknown encoding 'ISO-8859-1' in
/Volumes/Darwin/Documents/OS9Documents/downloads/php-4.3.0RC2/ext/xslt/tests/xslt_process-002.php on
line 52
Failed 12 / Ù%ÅúOÛV;:
Decode: 217 37 197 250 79 219 86 59
Warning: Sablotron error on line 4: unknown encoding 'ISO-8859-1' in
/Volumes/Darwin/Documents/OS9Documents/downloads/php-4.3.0RC2/ext/xslt/tests/xslt_process-002.php on
line 52
Failed 13 / ò:
Decode: 242 152
Warning: Sablotron error on line 4: unknown encoding 'ISO-8859-1' in
/Volumes/Darwin/Documents/OS9Documents/downloads/php-4.3.0RC2/ext/xslt/tests/xslt_process-002.php on
line 52
Failed 14 / 1ñy}Z:
Decode: 49 241 121 125 90
Warning: Sablotron error on line 4: unknown encoding 'ISO-8859-1' in
/Volumes/Darwin/Documents/OS9Documents/downloads/php-4.3.0RC2/ext/xslt/tests/xslt_process-002.php on
line 52
Failed 15 / Zñdj°:
Decode: 90 135 241 130 100 31 106 176
Warning: Sablotron error on line 4: unknown encoding 'ISO-8859-1' in
/Volumes/Darwin/Documents/OS9Documents/downloads/php-4.3.0RC2/ext/xslt/tests/xslt_process-002.php on
line 52
Failed 16 / êº:
Decode: 234 186
Warning: Sablotron error on line 4: unknown encoding 'ISO-8859-1' in
/Volumes/Darwin/Documents/OS9Documents/downloads/php-4.3.0RC2/ext/xslt/tests/xslt_process-002.php on
line 52
Failed 17 / 6C:
Decode: 54 67
Warning: Sablotron error on line 4: unknown encoding 'ISO-8859-1' in
/Volumes/Darwin/Documents/OS9Documents/downloads/php-4.3.0RC2/ext/xslt/tests/xslt_process-002.php on
line 52
Failed 18 / ùcm±CÑ×â:
Decode: 249 99 109 177 26 67 209 215 226
Warning: Sablotron error on line 4: unknown encoding 'ISO-8859-1' in
/Volumes/Darwin/Documents/OS9Documents/downloads/php-4.3.0RC2/ext/xslt/tests/xslt_process-002.php on
line 52
Failed 19 / »¾¶_°¬ )éß:
Decode: 187 190 182 129 130 95 176 31 172 160 41 233 223
Warning: Sablotron error on line 4: unknown encoding 'ISO-8859-1' in
/Volumes/Darwin/Documents/OS9Documents/downloads/php-4.3.0RC2/ext/xslt/tests/xslt_process-002.php on
line 52
Failed 20 / :ÂQ«ÙÒ
ÝV@$:
Decode: 58 194 81 171 217 210 133 221 86 64 36
Warning: Sablotron error on line 4: unknown encoding 'ISO-8859-1' in
/Volumes/Darwin/Documents/OS9Documents/downloads/php-4.3.0RC2/ext/xslt/tests/xslt_process-002.php on
line 52
Failed 21 / :
Decode: 127 147 27
Warning: Sablotron error on line 4: unknown encoding 'ISO-8859-1' in
/Volumes/Darwin/Documents/OS9Documents/downloads/php-4.3.0RC2/ext/xslt/tests/xslt_process-002.php on
line 52
Failed 22 / ö-3Í=:
Decode: 246 45 155 29 51 205 61
Warning: Sablotron error on line 4: unknown encoding 'ISO-8859-1' in
/Volumes/Darwin/Documents/OS9Documents/downloads/php-4.3.0RC2/ext/xslt/tests/xslt_process-002.php on
line 52
Failed 23 / ,¿:
Decode: 44 191
Warning: Sablotron error on line 4: unknown encoding 'ISO-8859-1' in
/Volumes/Darwin/Documents/OS9Documents/downloads/php-4.3.0RC2/ext/xslt/tests/xslt_process-002.php on
line 52
Failed 24 / Bf·AK&¿Ï6O=:
Decode: 66 102 136 151 183 65 75 38 191 207 2 54 79 61
Warning: Sablotron error on line 4: unknown encoding 'ISO-8859-1' in
/Volumes/Darwin/Documents/OS9Documents/downloads/php-4.3.0RC2/ext/xslt/tests/xslt_process-002.php on
line 52
Failed 25 / ø@IJV©&ÛÓrN:
Decode: 248 155 64 196 178 86 28 169 38 219 211 114 78 2 135
Warning: Sablotron error on line 4: unknown encoding 'ISO-8859-1' in
/Volumes/Darwin/Documents/OS9Documents/downloads/php-4.3.0RC2/ext/xslt/tests/xslt_process-002.php on
line 52
Failed 26 /
FñvÂ&<´ógè:
Decode: 28 133 29 70 241 118 194 38 60 180 173 243 103 232 134
Warning: Sablotron error on line 4: unknown encoding 'ISO-8859-1' in
/Volumes/Darwin/Documents/OS9Documents/downloads/php-4.3.0RC2/ext/xslt/tests/xslt_process-002.php on
line 52
Failed 27 / |j¿¶6¨XÆY÷~GkP:
Decode: 124 106 151 191 182 136 54 168 88 198 89 247 126 71 107 80
Warning: Sablotron error on line 4: unknown encoding 'ISO-8859-1' in
/Volumes/Darwin/Documents/OS9Documents/downloads/php-4.3.0RC2/ext/xslt/tests/xslt_process-002.php on
line 52
Failed 28 / æv(4::H=:
Decode: 30 230 150 118 150 40 52 58 31 58 72 61 157
Warning: Sablotron error on line 4: unknown encoding 'ISO-8859-1' in
/Volumes/Darwin/Documents/OS9Documents/downloads/php-4.3.0RC2/ext/xslt/tests/xslt_process-002.php on
line 52
Failed 29 / ×Ð:
Decode: 215 21 208
Warning: Sablotron error on line 4: unknown encoding 'ISO-8859-1' in
/Volumes/Darwin/Documents/OS9Documents/downloads/php-4.3.0RC2/ext/xslt/tests/xslt_process-002.php on
line 52
Failed 30 / ÖûM]:
Decode: 214 251 136 77 93
Warning: Sablotron error on line 4: unknown encoding 'ISO-8859-1' in
/Volumes/Darwin/Documents/OS9Documents/downloads/php-4.3.0RC2/ext/xslt/tests/xslt_process-002.php on
line 52
Failed 31 / {>N@ëg¢:
Decode: 123 62 158 78 64 235 103 162
Warning: Sablotron error on line 4: unknown encoding 'ISO-8859-1' in
/Volumes/Darwin/Documents/OS9Documents/downloads/php-4.3.0RC2/ext/xslt/tests/xslt_process-002.php on
line 52
Failed 32 / Å~Õ:,/5nqAýÿ_:
Decode: 197 126 213 58 44 47 53 12 110 113 65 253 255 95
Warning: Sablotron error on line 4: unknown encoding 'ISO-8859-1' in
/Volumes/Darwin/Documents/OS9Documents/downloads/php-4.3.0RC2/ext/xslt/tests/xslt_process-002.php on
line 52
Failed 33 / ÀP©!Ñ :
Decode: 192 80 169 33 209 32 130
Warning: Sablotron error on line 4: unknown encoding 'ISO-8859-1' in
/Volumes/Darwin/Documents/OS9Documents/downloads/php-4.3.0RC2/ext/xslt/tests/xslt_process-002.php on
line 52
Failed 34 / ½ÓW zÚ:BZ
´:
Decode: 189 21 211 87 9 122 218 58 159 66 90 10 180
Warning: Sablotron error on line 4: unknown encoding 'ISO-8859-1' in
/Volumes/Darwin/Documents/OS9Documents/downloads/php-4.3.0RC2/ext/xslt/tests/xslt_process-002.php on
line 52
Failed 35 / HÕIü:
Decode: 154 72 213 73 252
Warning: Sablotron error on line 4: unknown encoding 'ISO-8859-1' in
/Volumes/Darwin/Documents/OS9Documents/downloads/php-4.3.0RC2/ext/xslt/tests/xslt_process-002.php on
line 52
Failed 36 / CµÿuפÊ:
Decode: 67 181 255 117 215 164 202 143 129
Warning: Sablotron error on line 4: unknown encoding 'ISO-8859-1' in
/Volumes/Darwin/Documents/OS9Documents/downloads/php-4.3.0RC2/ext/xslt/tests/xslt_process-002.php on
line 52
Failed 37 / ¹®_&|Q:
Decode: 185 174 95 38 124 81
Warning: Sablotron error on line 4: unknown encoding 'ISO-8859-1' in
/Volumes/Darwin/Documents/OS9Documents/downloads/php-4.3.0RC2/ext/xslt/tests/xslt_process-002.php on
line 52
Failed 38 / þ'NÇOðb(:
Decode: 254 39 78 199 79 240 98 40 137
Warning: Sablotron error on line 4: unknown encoding 'ISO-8859-1' in
/Volumes/Darwin/Documents/OS9Documents/downloads/php-4.3.0RC2/ext/xslt/tests/xslt_process-002.php on
line 52
Failed 39 / ,4¨ôr:
Decode: 44 52 168 244 158 114
Warning: Sablotron error on line 4: unknown encoding 'ISO-8859-1' in
/Volumes/Darwin/Documents/OS9Documents/downloads/php-4.3.0RC2/ext/xslt/tests/xslt_process-002.php on
line 52
Failed 40 / ÚòÐØeÞ6`:
Decode: 218 242 208 216 101 222 54 138 96
Warning: Sablotron error on line 4: unknown encoding 'ISO-8859-1' in
/Volumes/Darwin/Documents/OS9Documents/downloads/php-4.3.0RC2/ext/xslt/tests/xslt_process-002.php on
line 52
Failed 41 / d:
Decode: 9 137 100
Warning: Sablotron error on line 4: unknown encoding 'ISO-8859-1' in
/Volumes/Darwin/Documents/OS9Documents/downloads/php-4.3.0RC2/ext/xslt/tests/xslt_process-002.php on
line 52
Failed 42 / Aäw}¢*:
Decode: 65 228 119 125 162 42
Warning: Sablotron error on line 4: unknown encoding 'ISO-8859-1' in
/Volumes/Darwin/Documents/OS9Documents/downloads/php-4.3.0RC2/ext/xslt/tests/xslt_process-002.php on
line 52
Failed 43 / Göh®&ÇzS±ê:
Decode: 141 71 246 104 129 174 38 199 122 83 177 234
Warning: Sablotron error on line 4: unknown encoding 'ISO-8859-1' in
/Volumes/Darwin/Documents/OS9Documents/downloads/php-4.3.0RC2/ext/xslt/tests/xslt_process-002.php on
line 52
Failed 44 / CÄgÂfý-åI¥¦à:
Decode: 67 196 103 194 102 253 45 229 73 151 165 166 224
Warning: Sablotron error on line 4: unknown encoding 'ISO-8859-1' in
/Volumes/Darwin/Documents/OS9Documents/downloads/php-4.3.0RC2/ext/xslt/tests/xslt_process-002.php on
line 52
Failed 45 / 2ÖP¸:
Decode: 50 158 214 146 80 184 130
Warning: Sablotron error on line 4: unknown encoding 'ISO-8859-1' in
/Volumes/Darwin/Documents/OS9Documents/downloads/php-4.3.0RC2/ext/xslt/tests/xslt_process-002.php on
line 52
Failed 46 / ®È³ÚòkY*a ØzK5:
Decode: 174 200 179 218 145 242 107 89 42 97 32 216 122 75 53
Warning: Sablotron error on line 4: unknown encoding 'ISO-8859-1' in
/Volumes/Darwin/Documents/OS9Documents/downloads/php-4.3.0RC2/ext/xslt/tests/xslt_process-002.php on
line 52
Failed 47 / ôN/ÐñÐöÅ:
Decode: 244 78 47 208 241 147 208 144 246 197
Warning: Sablotron error on line 4: unknown encoding 'ISO-8859-1' in
/Volumes/Darwin/Documents/OS9Documents/downloads/php-4.3.0RC2/ext/xslt/tests/xslt_process-002.php on
line 52
Failed 48 / ¿AǾÀ¢ÆÄ:
Decode: 191 65 159 199 190 192 136 162 198 196
Warning: Sablotron error on line 4: unknown encoding 'ISO-8859-1' in
/Volumes/Darwin/Documents/OS9Documents/downloads/php-4.3.0RC2/ext/xslt/tests/xslt_process-002.php on
line 52
Failed 49 / !¥ø©::
Decode: 33 25 165 7 248 169 58 140
OK
---- FAILED
================================================================================
001- OK
001+ Warning: Sablotron error on line 4: unknown encoding 'ISO-8859-1' in
/Volumes/Darwin/Documents/OS9Documents/downloads/php-4.3.0RC2/ext/xslt/tests/xslt_process-002.php on
line 52
002+ Failed 0 / R<hy(?5r¾O®:
003+ Decode: 82 60 104 121 40 63 53 114 190 79 174
004+
005+ Warning: Sablotron error on line 4: unknown encoding 'ISO-8859-1' in
/Volumes/Darwin/Documents/OS9Documents/downloads/php-4.3.0RC2/ext/xslt/tests/xslt_process-002.php on
line 52
006+ Failed 1 / ¿·¥:
007+ Decode: 24 191 183 165
008+
009+ Warning: Sablotron error on line 4: unknown encoding 'ISO-8859-1' in
/Volumes/Darwin/Documents/OS9Documents/downloads/php-4.3.0RC2/ext/xslt/tests/xslt_process-002.php on
line 52
010+ Failed 2 / ôÕ¯:
011+ Decode: 143 244 213 175
012+
013+ Warning: Sablotron error on line 4: unknown encoding 'ISO-8859-1' in
/Volumes/Darwin/Documents/OS9Documents/downloads/php-4.3.0RC2/ext/xslt/tests/xslt_process-002.php on
line 52
014+ Failed 3 / Û2G|º®lýIú`ê:
015+ Decode: 219 50 71 124 148 186 174 108 253 131 136 73 250 96 234
016+
017+ Warning: Sablotron error on line 4: unknown encoding 'ISO-8859-1' in
/Volumes/Darwin/Documents/OS9Documents/downloads/php-4.3.0RC2/ext/xslt/tests/xslt_process-002.php on
line 52
018+ Failed 4 / /,º¯:
019+ Decode: 47 44 186 175
020+
021+ Warning: Sablotron error on line 4: unknown encoding 'ISO-8859-1' in
/Volumes/Darwin/Documents/OS9Documents/downloads/php-4.3.0RC2/ext/xslt/tests/xslt_process-002.php on
line 52
022+ Failed 5 / f*¿è5ö§R:
023+ Decode: 102 21 173 42 191 156 232 53 246 167 129 82
024+
025+ Warning: Sablotron error on line 4: unknown encoding 'ISO-8859-1' in
/Volumes/Darwin/Documents/OS9Documents/downloads/php-4.3.0RC2/ext/xslt/tests/xslt_process-002.php on
line 52
026+ Failed 6 / MÌËPpE¼ºµÌJS;æº:
027+ Decode: 77 204 203 80 112 69 188 186 181 204 74 83 59 230 186
028+
029+ Warning: Sablotron error on line 4: unknown encoding 'ISO-8859-1' in
/Volumes/Darwin/Documents/OS9Documents/downloads/php-4.3.0RC2/ext/xslt/tests/xslt_process-002.php on
line 52
030+ Failed 7 / 15WvWhÄa}Ó>2Ù:
031+ Decode: 49 53 87 118 129 141 87 104 196 97 125 211 62 50 217
032+
033+ Warning: Sablotron error on line 4: unknown encoding 'ISO-8859-1' in
/Volumes/Darwin/Documents/OS9Documents/downloads/php-4.3.0RC2/ext/xslt/tests/xslt_process-002.php on
line 52
034+ Failed 8 / 8ð/3X:
035+ Decode: 142 152 56 240 150 47 51 88
036+
037+ Warning: Sablotron error on line 4: unknown encoding 'ISO-8859-1' in
/Volumes/Darwin/Documents/OS9Documents/downloads/php-4.3.0RC2/ext/xslt/tests/xslt_process-002.php on
line 52
038+ Failed 9 / àKLÛ:
039+ Decode: 224 75 150 148 76 219
040+
041+ Warning: Sablotron error on line 4: unknown encoding 'ISO-8859-1' in
/Volumes/Darwin/Documents/OS9Documents/downloads/php-4.3.0RC2/ext/xslt/tests/xslt_process-002.php on
line 52
042+ Failed 10 / ;;asH¤'0ïPR¬ :
043+ Decode: 59 59 97 115 72 164 39 48 239 80 82 172 160
044+
045+ Warning: Sablotron error on line 4: unknown encoding 'ISO-8859-1' in
/Volumes/Darwin/Documents/OS9Documents/downloads/php-4.3.0RC2/ext/xslt/tests/xslt_process-002.php on
line 52
046+ Failed 11 / »`Ùiá<eÀ:
047+ Decode: 187 96 217 105 225 60 173 101 192
048+
049+ Warning: Sablotron error on line 4: unknown encoding 'ISO-8859-1' in
/Volumes/Darwin/Documents/OS9Documents/downloads/php-4.3.0RC2/ext/xslt/tests/xslt_process-002.php on
line 52
050+ Failed 12 / Ù%ÅúOÛV;:
051+ Decode: 217 37 197 250 79 219 86 59
052+
053+ Warning: Sablotron error on line 4: unknown encoding 'ISO-8859-1' in
/Volumes/Darwin/Documents/OS9Documents/downloads/php-4.3.0RC2/ext/xslt/tests/xslt_process-002.php on
line 52
054+ Failed 13 / ò:
055+ Decode: 242 152
056+
057+ Warning: Sablotron error on line 4: unknown encoding 'ISO-8859-1' in
/Volumes/Darwin/Documents/OS9Documents/downloads/php-4.3.0RC2/ext/xslt/tests/xslt_process-002.php on
line 52
058+ Failed 14 / 1ñy}Z:
059+ Decode: 49 241 121 125 90
060+
061+ Warning: Sablotron error on line 4: unknown encoding 'ISO-8859-1' in
/Volumes/Darwin/Documents/OS9Documents/downloads/php-4.3.0RC2/ext/xslt/tests/xslt_process-002.php on
line 52
062+ Failed 15 / Zñdj°:
063+ Decode: 90 135 241 130 100 31 106 176
064+
065+ Warning: Sablotron error on line 4: unknown encoding 'ISO-8859-1' in
/Volumes/Darwin/Documents/OS9Documents/downloads/php-4.3.0RC2/ext/xslt/tests/xslt_process-002.php on
line 52
066+ Failed 16 / êº:
067+ Decode: 234 186
068+
069+ Warning: Sablotron error on line 4: unknown encoding 'ISO-8859-1' in
/Volumes/Darwin/Documents/OS9Documents/downloads/php-4.3.0RC2/ext/xslt/tests/xslt_process-002.php on
line 52
070+ Failed 17 / 6C:
071+ Decode: 54 67
072+
073+ Warning: Sablotron error on line 4: unknown encoding 'ISO-8859-1' in
/Volumes/Darwin/Documents/OS9Documents/downloads/php-4.3.0RC2/ext/xslt/tests/xslt_process-002.php on
line 52
074+ Failed 18 / ùcm±CÑ×â:
075+ Decode: 249 99 109 177 26 67 209 215 226
076+
077+ Warning: Sablotron error on line 4: unknown encoding 'ISO-8859-1' in
/Volumes/Darwin/Documents/OS9Documents/downloads/php-4.3.0RC2/ext/xslt/tests/xslt_process-002.php on
line 52
078+ Failed 19 / »¾¶_°¬ )éß:
079+ Decode: 187 190 182 129 130 95 176 31 172 160 41 233 223
080+
081+ Warning: Sablotron error on line 4: unknown encoding 'ISO-8859-1' in
/Volumes/Darwin/Documents/OS9Documents/downloads/php-4.3.0RC2/ext/xslt/tests/xslt_process-002.php on
line 52
082+ Failed 20 / :ÂQ«ÙÒ
ÝV@$:
083+ Decode: 58 194 81 171 217 210 133 221 86 64 36
084+
085+ Warning: Sablotron error on line 4: unknown encoding 'ISO-8859-1' in
/Volumes/Darwin/Documents/OS9Documents/downloads/php-4.3.0RC2/ext/xslt/tests/xslt_process-002.php on
line 52
086+ Failed 21 / :
087+ Decode: 127 147 27
088+
089+ Warning: Sablotron error on line 4: unknown encoding 'ISO-8859-1' in
/Volumes/Darwin/Documents/OS9Documents/downloads/php-4.3.0RC2/ext/xslt/tests/xslt_process-002.php on
line 52
090+ Failed 22 / ö-3Í=:
091+ Decode: 246 45 155 29 51 205 61
092+
093+ Warning: Sablotron error on line 4: unknown encoding 'ISO-8859-1' in
/Volumes/Darwin/Documents/OS9Documents/downloads/php-4.3.0RC2/ext/xslt/tests/xslt_process-002.php on
line 52
094+ Failed 23 / ,¿:
095+ Decode: 44 191
096+
097+ Warning: Sablotron error on line 4: unknown encoding 'ISO-8859-1' in
/Volumes/Darwin/Documents/OS9Documents/downloads/php-4.3.0RC2/ext/xslt/tests/xslt_process-002.php on
line 52
098+ Failed 24 / Bf·AK&¿Ï6O=:
099+ Decode: 66 102 136 151 183 65 75 38 191 207 2 54 79 61
100+
101+ Warning: Sablotron error on line 4: unknown encoding 'ISO-8859-1' in
/Volumes/Darwin/Documents/OS9Documents/downloads/php-4.3.0RC2/ext/xslt/tests/xslt_process-002.php on
line 52
102+ Failed 25 / ø@IJV©&ÛÓrN:
103+ Decode: 248 155 64 196 178 86 28 169 38 219 211 114 78 2 135
104+
105+ Warning: Sablotron error on line 4: unknown encoding 'ISO-8859-1' in
/Volumes/Darwin/Documents/OS9Documents/downloads/php-4.3.0RC2/ext/xslt/tests/xslt_process-002.php on
line 52
106+ Failed 26 /
FñvÂ&<´ógè:
107+ Decode: 28 133 29 70 241 118 194 38 60 180 173 243 103 232 134
108+
109+ Warning: Sablotron error on line 4: unknown encoding 'ISO-8859-1' in
/Volumes/Darwin/Documents/OS9Documents/downloads/php-4.3.0RC2/ext/xslt/tests/xslt_process-002.php on
line 52
110+ Failed 27 / |j¿¶6¨XÆY÷~GkP:
111+ Decode: 124 106 151 191 182 136 54 168 88 198 89 247 126 71 107 80
112+
113+ Warning: Sablotron error on line 4: unknown encoding 'ISO-8859-1' in
/Volumes/Darwin/Documents/OS9Documents/downloads/php-4.3.0RC2/ext/xslt/tests/xslt_process-002.php on
line 52
114+ Failed 28 / æv(4::H=:
115+ Decode: 30 230 150 118 150 40 52 58 31 58 72 61 157
116+
117+ Warning: Sablotron error on line 4: unknown encoding 'ISO-8859-1' in
/Volumes/Darwin/Documents/OS9Documents/downloads/php-4.3.0RC2/ext/xslt/tests/xslt_process-002.php on
line 52
118+ Failed 29 / ×Ð:
119+ Decode: 215 21 208
120+
121+ Warning: Sablotron error on line 4: unknown encoding 'ISO-8859-1' in
/Volumes/Darwin/Documents/OS9Documents/downloads/php-4.3.0RC2/ext/xslt/tests/xslt_process-002.php on
line 52
122+ Failed 30 / ÖûM]:
123+ Decode: 214 251 136 77 93
124+
125+ Warning: Sablotron error on line 4: unknown encoding 'ISO-8859-1' in
/Volumes/Darwin/Documents/OS9Documents/downloads/php-4.3.0RC2/ext/xslt/tests/xslt_process-002.php on
line 52
126+ Failed 31 / {>N@ëg¢:
127+ Decode: 123 62 158 78 64 235 103 162
128+
129+ Warning: Sablotron error on line 4: unknown encoding 'ISO-8859-1' in
/Volumes/Darwin/Documents/OS9Documents/downloads/php-4.3.0RC2/ext/xslt/tests/xslt_process-002.php on
line 52
130+ Failed 32 / Å~Õ:,/5nqAýÿ_:
131+ Decode: 197 126 213 58 44 47 53 12 110 113 65 253 255 95
132+
133+ Warning: Sablotron error on line 4: unknown encoding 'ISO-8859-1' in
/Volumes/Darwin/Documents/OS9Documents/downloads/php-4.3.0RC2/ext/xslt/tests/xslt_process-002.php on
line 52
134+ Failed 33 / ÀP©!Ñ :
135+ Decode: 192 80 169 33 209 32 130
136+
137+ Warning: Sablotron error on line 4: unknown encoding 'ISO-8859-1' in
/Volumes/Darwin/Documents/OS9Documents/downloads/php-4.3.0RC2/ext/xslt/tests/xslt_process-002.php on
line 52
138+ Failed 34 / ½ÓW zÚ:BZ
139+ ´:
140+ Decode: 189 21 211 87 9 122 218 58 159 66 90 10 180
141+
142+ Warning: Sablotron error on line 4: unknown encoding 'ISO-8859-1' in
/Volumes/Darwin/Documents/OS9Documents/downloads/php-4.3.0RC2/ext/xslt/tests/xslt_process-002.php on
line 52
143+ Failed 35 / HÕIü:
144+ Decode: 154 72 213 73 252
145+
146+ Warning: Sablotron error on line 4: unknown encoding 'ISO-8859-1' in
/Volumes/Darwin/Documents/OS9Documents/downloads/php-4.3.0RC2/ext/xslt/tests/xslt_process-002.php on
line 52
147+ Failed 36 / CµÿuפÊ:
148+ Decode: 67 181 255 117 215 164 202 143 129
149+
150+ Warning: Sablotron error on line 4: unknown encoding 'ISO-8859-1' in
/Volumes/Darwin/Documents/OS9Documents/downloads/php-4.3.0RC2/ext/xslt/tests/xslt_process-002.php on
line 52
151+ Failed 37 / ¹®_&|Q:
152+ Decode: 185 174 95 38 124 81
153+
154+ Warning: Sablotron error on line 4: unknown encoding 'ISO-8859-1' in
/Volumes/Darwin/Documents/OS9Documents/downloads/php-4.3.0RC2/ext/xslt/tests/xslt_process-002.php on
line 52
155+ Failed 38 / þ'NÇOðb(:
156+ Decode: 254 39 78 199 79 240 98 40 137
157+
158+ Warning: Sablotron error on line 4: unknown encoding 'ISO-8859-1' in
/Volumes/Darwin/Documents/OS9Documents/downloads/php-4.3.0RC2/ext/xslt/tests/xslt_process-002.php on
line 52
159+ Failed 39 / ,4¨ôr:
160+ Decode: 44 52 168 244 158 114
161+
162+ Warning: Sablotron error on line 4: unknown encoding 'ISO-8859-1' in
/Volumes/Darwin/Documents/OS9Documents/downloads/php-4.3.0RC2/ext/xslt/tests/xslt_process-002.php on
line 52
163+ Failed 40 / ÚòÐØeÞ6`:
164+ Decode: 218 242 208 216 101 222 54 138 96
165+
166+ Warning: Sablotron error on line 4: unknown encoding 'ISO-8859-1' in
/Volumes/Darwin/Documents/OS9Documents/downloads/php-4.3.0RC2/ext/xslt/tests/xslt_process-002.php on
line 52
167+ Failed 41 / d:
168+ Decode: 9 137 100
169+
170+ Warning: Sablotron error on line 4: unknown encoding 'ISO-8859-1' in
/Volumes/Darwin/Documents/OS9Documents/downloads/php-4.3.0RC2/ext/xslt/tests/xslt_process-002.php on
line 52
171+ Failed 42 / Aäw}¢*:
172+ Decode: 65 228 119 125 162 42
173+
174+ Warning: Sablotron error on line 4: unknown encoding 'ISO-8859-1' in
/Volumes/Darwin/Documents/OS9Documents/downloads/php-4.3.0RC2/ext/xslt/tests/xslt_process-002.php on
line 52
175+ Failed 43 / Göh®&ÇzS±ê:
176+ Decode: 141 71 246 104 129 174 38 199 122 83 177 234
177+
178+ Warning: Sablotron error on line 4: unknown encoding 'ISO-8859-1' in
/Volumes/Darwin/Documents/OS9Documents/downloads/php-4.3.0RC2/ext/xslt/tests/xslt_process-002.php on
line 52
179+ Failed 44 / CÄgÂfý-åI¥¦à:
180+ Decode: 67 196 103 194 102 253 45 229 73 151 165 166 224
181+
182+ Warning: Sablotron error on line 4: unknown encoding 'ISO-8859-1' in
/Volumes/Darwin/Documents/OS9Documents/downloads/php-4.3.0RC2/ext/xslt/tests/xslt_process-002.php on
line 52
183+ Failed 45 / 2ÖP¸:
184+ Decode: 50 158 214 146 80 184 130
185+
186+ Warning: Sablotron error on line 4: unknown encoding 'ISO-8859-1' in
/Volumes/Darwin/Documents/OS9Documents/downloads/php-4.3.0RC2/ext/xslt/tests/xslt_process-002.php on
line 52
187+ Failed 46 / ®È³ÚòkY*a ØzK5:
188+ Decode: 174 200 179 218 145 242 107 89 42 97 32 216 122 75 53
189+
190+ Warning: Sablotron error on line 4: unknown encoding 'ISO-8859-1' in
/Volumes/Darwin/Documents/OS9Documents/downloads/php-4.3.0RC2/ext/xslt/tests/xslt_process-002.php on
line 52
191+ Failed 47 / ôN/ÐñÐöÅ:
192+ Decode: 244 78 47 208 241 147 208 144 246 197
193+
194+ Warning: Sablotron error on line 4: unknown encoding 'ISO-8859-1' in
/Volumes/Darwin/Documents/OS9Documents/downloads/php-4.3.0RC2/ext/xslt/tests/xslt_process-002.php on
line 52
195+ Failed 48 / ¿AǾÀ¢ÆÄ:
196+ Decode: 191 65 159 199 190 192 136 162 198 196
197+
198+ Warning: Sablotron error on line 4: unknown encoding 'ISO-8859-1' in
/Volumes/Darwin/Documents/OS9Documents/downloads/php-4.3.0RC2/ext/xslt/tests/xslt_process-002.php on
line 52
199+ Failed 49 / !¥ø©::
200+ Decode: 33 25 165 7 248 169 58 140
201+ OK
================================================================================
================================================================================
/Volumes/Darwin/Documents/OS9Documents/downloads/php-4.3.0RC2/ext/xslt/tests/xslt_set_object.phpt
================================================================================
---- EXPECTED OUTPUT
OK
OK
---- ACTUAL OUTPUT
Warning: Sablotron error on line 4: unknown encoding 'ISO-8859-1' in
/Volumes/Darwin/Documents/OS9Documents/downloads/php-4.3.0RC2/ext/xslt/tests/xslt_set_object.php on
line 19
Warning: Sablotron error on line 4: unknown encoding 'ISO-8859-1' in
/Volumes/Darwin/Documents/OS9Documents/downloads/php-4.3.0RC2/ext/xslt/tests/xslt_set_object.php on
line 30
OK
OK
---- FAILED
================================================================================
001- OK
001+ Warning: Sablotron error on line 4: unknown encoding 'ISO-8859-1' in
/Volumes/Darwin/Documents/OS9Documents/downloads/php-4.3.0RC2/ext/xslt/tests/xslt_set_object.php on
line 19
002- OK
002+
003+ Warning: Sablotron error on line 4: unknown encoding 'ISO-8859-1' in
/Volumes/Darwin/Documents/OS9Documents/downloads/php-4.3.0RC2/ext/xslt/tests/xslt_set_object.php on
line 30
004+ OK
005+ OK
================================================================================
================================================================================
/Volumes/Darwin/Documents/OS9Documents/downloads/php-4.3.0RC2/ext/xslt/tests/xslt_setopt.phpt
================================================================================
---- EXPECTED OUTPUT
PHP QA®
string(95) "<html>
<head>
<title>foo</title>
</head>
<body>
<p>PHP QA®</p>
</body>
</html>
"
string(172) "<html>
<head>
<meta http-equiv="Content-Type" content="text/html;
charset=ISO-8859-1">
<title>foo</title>
</head>
<body>
<p>PHP QA®</p>
</body>
</html>
"
---- ACTUAL OUTPUT
Warning: Sablotron error on line 4: unknown encoding 'ISO-8859-1' in
/Volumes/Darwin/Documents/OS9Documents/downloads/php-4.3.0RC2/ext/xslt/tests/xslt_setopt.php on line
10
Warning: Sablotron error on line 4: unknown encoding 'ISO-8859-1' in
/Volumes/Darwin/Documents/OS9Documents/downloads/php-4.3.0RC2/ext/xslt/tests/xslt_setopt.php on line
19
bool(false)
Warning: Sablotron error on line 4: unknown encoding 'ISO-8859-1' in
/Volumes/Darwin/Documents/OS9Documents/downloads/php-4.3.0RC2/ext/xslt/tests/xslt_setopt.php on line
23
bool(false)
---- FAILED
================================================================================
001- PHP QA®
001+ Warning: Sablotron error on line 4: unknown encoding 'ISO-8859-1' in
/Volumes/Darwin/Documents/OS9Documents/downloads/php-4.3.0RC2/ext/xslt/tests/xslt_setopt.php on line
10
002- string(95) "<html>
002+
003- <head>
003+
004- <title>foo</title>
004+ Warning: Sablotron error on line 4: unknown encoding 'ISO-8859-1' in
/Volumes/Darwin/Documents/OS9Documents/downloads/php-4.3.0RC2/ext/xslt/tests/xslt_setopt.php on line
19
005- </head>
005+ bool(false)
006- <body>
006+
007- <p>PHP QA®</p>
007+ Warning: Sablotron error on line 4: unknown encoding 'ISO-8859-1' in
/Volumes/Darwin/Documents/OS9Documents/downloads/php-4.3.0RC2/ext/xslt/tests/xslt_setopt.php on line
23
008- </body>
008+ bool(false)
009- </html>
010- "
011- string(172) "<html>
012- <head>
013- <meta http-equiv="Content-Type" content="text/html;
charset=ISO-8859-1">
014- <title>foo</title>
015- </head>
016- <body>
017- <p>PHP QA®</p>
018- </body>
019- </html>
020- "
================================================================================
================================================================================
BUILD ENVIRONMENT
================================================================================
OS:
Darwin
Automake:
automake (GNU automake) 1.6.1
Written by Tom Tromey <tromey@redhat.com>.
Copyright 2002 Free Software Foundation, Inc.
This is free software; see the source for copying conditions. There is NO
warranty; not even for MERCHANTABILITY or FITNESS FOR A PARTICULAR PURPOSE.
Autoconf:
autoconf (GNU Autoconf) 2.53
Written by David J. MacKenzie and Akim Demaille.
Copyright 2002 Free Software Foundation, Inc.
This is free software; see the source for copying conditions. There is NO
warranty; not even for MERCHANTABILITY or FITNESS FOR A PARTICULAR PURPOSE.
Libtool:
Compiler:
Reading specs from /usr/libexec/gcc/darwin/ppc/2.95.2/specs
Apple Computer, Inc. version gcc-937.2, based on gcc version 2.95.2 19991024 (release)
Bison:
GNU Bison version 1.28
================================================================================
PHPINFO
================================================================================
phpinfo()
PHP Version => 4.3.0RC2
System => Darwin 128kb.com 5.5 Darwin Kernel Version 5.5: Thu May 30 14:51:26 PDT 2002;
root:xnu/xnu-201.42.3.obj~1/RELEASE_PPC Power Macintosh
Build Date => Dec 4 2002 18:26:07
Configure Command => './configure' '--disable-cli'
'--with-mysql=/usr/local' '--with-apxs=/usr/sbin/apxs'
'--with-freetype-dir=/sw' '--with-t1lib=/sw' '--enable-trans-sid'
'--enable-exif' '--with-xml' '--enable-ftp'
'--enable-mbstring' '--enable-mbstr-enc-trans' '--enable-dbx'
'--enable-dbase' '--enable-sockets'
'--with-imap=/usr/local/src/imap-2001a' '--with-zlib=/usr'
'--enable-wddx'
Server API => Command Line Interface
Virtual Directory Support => disabled
Configuration File (php.ini) Path => /usr/local/lib/php.ini
PHP API => 20020918
PHP Extension => 20020429
Zend Extension => 20021010
Debug Build => no
Thread Safety => disabled
Registered PHP Streams => php, http, ftp, compress.zlib
This program makes use of the Zend Scripting Language Engine:
Zend Engine v1.4.0, Copyright (c) 1998-2002 Zend Technologies
_______________________________________________________________________
Configuration
PHP Core
Directive => Local Value => Master Value
allow_call_time_pass_reference => On => On
allow_url_fopen => On => On
always_populate_raw_post_data => Off => Off
arg_separator.input => & => &
arg_separator.output => & => &
asp_tags => Off => Off
auto_append_file => no value => no value
auto_prepend_file => no value => no value
browscap => no value => no value
default_charset => no value => no value
default_mimetype => text/html => text/html
define_syslog_variables => Off => Off
disable_functions => no value => no value
display_errors => On => On
display_startup_errors => Off => Off
doc_root => /Library/www/docs/ => /Library/www/docs/
docref_ext => no value => no value
docref_root => http://www.php.net/ => http://www.php.net/
enable_dl => On => On
error_append_string => no value => no value
error_log => no value => no value
error_prepend_string => no value => no value
error_reporting => no value => no value
expose_php => On => On
extension_dir => /usr/local/lib/php/extensions/no-debug-non-zts-20020429 =>
/usr/local/lib/php/extensions/no-debug-non-zts-20020429
file_uploads => On => On
gpc_order => GPC => GPC
highlight.bg => #FFFFFF => #FFFFFF
highlight.comment => 999999 => 999999
highlight.default => #0000BB => #0000BB
highlight.html => #000000 => #000000
highlight.keyword => #007700 => #007700
highlight.string => FF0099 => FF0099
html_errors => Off => On
ignore_repeated_errors => Off => Off
ignore_repeated_source => Off => Off
ignore_user_abort => Off => Off
implicit_flush => On => Off
include_path => .:/usr/local/lib/php => .:/usr/local/lib/php
log_errors => Off => Off
log_errors_max_len => 1024 => 1024
magic_quotes_gpc => On => On
magic_quotes_runtime => Off => Off
magic_quotes_sybase => Off => Off
max_execution_time => 0 => 30
max_input_time => -1 => -1
open_basedir => no value => no value
output_buffering => 0 => 0
output_handler => no value => no value
post_max_size => 8M => 8M
precision => 14 => 14
register_argc_argv => On => On
register_globals => On => On
report_memleaks => On => On
safe_mode => Off => Off
safe_mode_exec_dir => 1 => 1
safe_mode_gid => Off => Off
safe_mode_include_dir => no value => no value
sendmail_from => no value => no value
sendmail_path => /usr/sbin/sendmail -t -i => /usr/sbin/sendmail -t -i
short_open_tag => On => On
SMTP => localhost => localhost
smtp_port => 25 => 25
sql.safe_mode => Off => Off
track_errors => Off => Off
unserialize_callback_func => no value => no value
upload_max_filesize => 2M => 2M
upload_tmp_dir => no value => no value
user_dir => no value => no value
variables_order => no value => no value
xmlrpc_error_number => 0 => 0
xmlrpc_errors => Off => Off
y2k_compliance => On => On
ctype
ctype functions => enabled
curl
CURL support => enabled
CURL Information => libcurl/7.10.2 OpenSSL/0.9.6e zlib/1.1.3
dbx
dbx support => enabled
dbx version => 1.0.0
supported databases => MySQL
ODBC
PostgreSQL
Microsoft SQL Server
FrontBase
Oracle 8 (oci8)
Sybase-CT
Directive => Local Value => Master Value
dbx.colnames_case => unchanged => unchanged
exif
EXIF Support => enabled
EXIF Version => 1.4 $Id: exif.c,v 1.118.2.3 2002/11/27 02:43:21 helly Exp $
Supported EXIF Version => 0220
Supported filetypes => JPEG,TIFF
ftp
FTP support => enabled
imap
IMAP c-Client Version => 2001
mbstring
Multibyte Support => enabled
Japanese support => enabled
Directive => Local Value => Master Value
mbstring.detect_order => no value => no value
mbstring.encoding_translation => Off => Off
mbstring.func_overload => 0 => 0
mbstring.http_input => pass => pass
mbstring.http_output => pass => pass
mbstring.internal_encoding => none => none
mbstring.language => neutral => neutral
mbstring.substitute_character => no value => no value
mysql
MySQL Support => enabled
Active Persistent Links => 0
Active Links => 0
Client API version => 3.23.51
MYSQL_MODULE_TYPE => external
MYSQL_SOCKET => /tmp/mysql.sock
MYSQL_INCLUDE => -I/usr/local/include/mysql
MYSQL_LIBS => -L/usr/local/lib/mysql -lmysqlclient
Directive => Local Value => Master Value
mysql.allow_persistent => On => On
mysql.connect_timeout => -1 => -1
mysql.default_host => no value => no value
mysql.default_password => no value => no value
mysql.default_port => no value => no value
mysql.default_socket => no value => no value
mysql.default_user => no value => no value
mysql.max_links => Unlimited => Unlimited
mysql.max_persistent => Unlimited => Unlimited
mysql.trace_mode => Off => Off
overload
User-Space Object Overloading Support => enabled
pcre
PCRE (Perl Compatible Regular Expressions) Support => enabled
PCRE Library Version => 3.92 11-Sep-2002
posix
Revision => $Revision: 1.51 $
session
Session Support => enabled
Registered save handlers => files user
Directive => Local Value => Master Value
session.auto_start => Off => Off
session.bug_compat_42 => On => On
session.bug_compat_warn => On => On
session.cache_expire => 180 => 180
session.cache_limiter => nocache => nocache
session.cookie_domain => no value => no value
session.cookie_lifetime => 0 => 0
session.cookie_path => / => /
session.cookie_secure => Off => Off
session.entropy_file => no value => no value
session.entropy_length => 0 => 0
session.gc_dividend => 100 => 100
session.gc_maxlifetime => 1440 => 1440
session.gc_probability => 1 => 1
session.name => PHPSESSID => PHPSESSID
session.referer_check => no value => no value
session.save_handler => files => files
session.save_path => /tmp => /tmp
session.serialize_handler => php => php
session.use_cookies => On => On
session.use_only_cookies => Off => Off
session.use_trans_sid => Off => Off
sockets
Sockets Support => enabled
standard
Regex Library => Bundled library enabled
Dynamic Library Support => enabled
Path to sendmail => /usr/sbin/sendmail -t -i
Directive => Local Value => Master Value
assert.active => 1 => 1
assert.bail => 0 => 0
assert.callback => no value => no value
assert.quiet_eval => 0 => 0
assert.warning => 1 => 1
auto_detect_line_endings => 0 => 0
default_socket_timeout => 60 => 60
safe_mode_allowed_env_vars => PHP_ => PHP_
safe_mode_protected_env_vars => LD_LIBRARY_PATH => LD_LIBRARY_PATH
url_rewriter.tags => a=href,area=href,frame=src,form=,fieldset= =>
a=href,area=href,frame=src,form=,fieldset=
user_agent => no value => no value
tokenizer
Tokenizer Support => enabled
wddx
WDDX Support => enabled
WDDX Session Serializer => enabled
xml
XML Support => active
XML Namespace Support => active
EXPAT Version => 1.95.2
xslt
XSLT support => enabled
Backend => Sablotron
Sablotron Version => 0.96
zlib
ZLib Support => enabled
Compiled Version => 1.1.3
Linked Version => 1.1.3
Directive => Local Value => Master Value
zlib.output_compression => Off => Off
zlib.output_compression_level => -1 => -1
zlib.output_handler => no value => no value
Additional Modules
Module Name
dbase
Environment
Variable => Value
SESSION_MANAGER => local/128kb.com:/tmp/.ICE-unix/2303
HOSTNAME => 128kb.com
MANPATH =>
/sw/share/man:/sw/man:/usr/share/man:/usr/bin/man:/usr/local/man:/usr/local/share/man:/usr/X11/man:/usr/man:/usr/X11R6/man
INFOPATH =>
/sw/share/info:/sw/info:/sw/share/info:/sw/info:/sw/share/info:/sw/info:/usr/local/share/info:/usr/local/lib/info:/usr/local/info:/usr/share/info
ETERM_THEME_ROOT => /sw/share/Eterm/themes/Eterm
TERM => xterm
SHELL => /bin/sh
KDE_MULTIHEAD => false
HOME => /Users/m31
PAGER => /usr/bin/less
SHLVL => 6
GS_LIB => /Users/m31/.kde/share/fonts
DISPLAY => :0.0
PS1 =>
\[\e[33;1m\]\T\[\e[0m\]>-\[\e[$COLOUR;1m\]\u\[\e[0m\]@\[\e[$COLOUR;1m\]\H\[\e[0m\]->[\[\e[$COLOUR;1m\]\w\[\e[0m\]]\$
WINDOWMANAGER => blackbox
PATH =>
/sw/bin:/sw/sbin:/sbin:/bin:/usr/bin:/usr/sbin:/usr/local/bin:/usr/local/sbin:/Users/m31/bin:/usr/local/mysql-3.23.46/bin:/Developer/Tools:/usr/X11R6/bin
EDITOR => /usr/bin/pico
COLORFGBG => 15;default;0
WINDOWID => 29360592
CPPFLAGS => -traditional-cpp -no-cpp-precomp -no-cpp-precomp
-I/Users/m31/Documents/downloads/php-4.3.0RC2/TSRM
__CF_USER_TEXT_ENCODING => 0x1F5:0:0
PWD => /Users/m31/Documents/downloads/php-4.3.0RC2
GTK_RC_FILES => /etc/gtk/gtkrc:/Users/m31/.gtkrc
MFLAGS => ETERM_USER_ROOT => /sw/share/Eterm/themes/Eterm
CVSROOT => :pserver:anonymous@cvs-mirror.mozilla.org:/cvsroot
ETERM_VERSION => 0.9
USER => m31
CCFLAGS => -traditional-cpp
CFLAGS => -traditional-cpp -prefer-non-pic -static
MAKEFLAGS => _ => /Users/m31/Documents/downloads/php-4.3.0RC2/sapi/cli/php
PERL5LIB => /sw/lib/perl5:/sw/lib/perl5:/sw/lib/perl5
EMAIL => m31@128kb.com
LOGNAME => m31
MAIL => /private/var/mail/m31
OSTYPE => darwin1.4
KDEDIR => /sw
KDE_STARTUP_ENV => 128kb.com;1039057883;355169;2289
OLDPWD => /Users/m31/Documents/downloads
HOSTTYPE => powerpc
MACHTYPE => powerpc
PS2 => \[\e[32;1m\]->>\[\e[0m\]
COLORTERM => Eterm
COLORTERM_BCE => Eterm
MAKELEVEL => 1
TEST_PHP_EXECUTABLE => /Users/m31/Documents/downloads/php-4.3.0RC2/sapi/cli/php
TEST_PHP_SRCDIR => /Users/m31/Documents/downloads/php-4.3.0RC2
CC => gcc
REDIRECT_STATUS => 1
QUERY_STRING => PATH_TRANSLATED =>
/Volumes/Darwin/Documents/OS9Documents/downloads/php-4.3.0RC2/tests/strings/004.php
SCRIPT_FILENAME =>
/Volumes/Darwin/Documents/OS9Documents/downloads/php-4.3.0RC2/tests/strings/004.php
REQUEST_METHOD => GET
CONTENT_TYPE => CONTENT_LENGTH =>
PHP Variables
Variable => Value
PHP_SELF => _SERVER["SESSION_MANAGER"] => local/128kb.com:/tmp/.ICE-unix/2303
_SERVER["HOSTNAME"] => 128kb.com
_SERVER["MANPATH"] =>
/sw/share/man:/sw/man:/usr/share/man:/usr/bin/man:/usr/local/man:/usr/local/share/man:/usr/X11/man:/usr/man:/usr/X11R6/man
_SERVER["INFOPATH"] =>
/sw/share/info:/sw/info:/sw/share/info:/sw/info:/sw/share/info:/sw/info:/usr/local/share/info:/usr/local/lib/info:/usr/local/info:/usr/share/info
_SERVER["ETERM_THEME_ROOT"] => /sw/share/Eterm/themes/Eterm
_SERVER["TERM"] => xterm
_SERVER["SHELL"] => /bin/sh
_SERVER["KDE_MULTIHEAD"] => false
_SERVER["HOME"] => /Users/m31
_SERVER["PAGER"] => /usr/bin/less
_SERVER["SHLVL"] => 6
_SERVER["GS_LIB"] => /Users/m31/.kde/share/fonts
_SERVER["DISPLAY"] => :0.0
_SERVER["PS1"] =>
\\[\\e[33;1m\\]\\T\\[\\e[0m\\]>-\\[\\e[$COLOUR;1m\\]\\u\\[\\e[0m\\]@\\[\\e[$COLOUR;1m\\]\\H\\[\\e[0m\\]->[\\[\\e[$COLOUR;1m\\]\\w\\[\\e[0m\\]]\\$
_SERVER["WINDOWMANAGER"] => blackbox
_SERVER["PATH"] =>
/sw/bin:/sw/sbin:/sbin:/bin:/usr/bin:/usr/sbin:/usr/local/bin:/usr/local/sbin:/Users/m31/bin:/usr/local/mysql-3.23.46/bin:/Developer/Tools:/usr/X11R6/bin
_SERVER["EDITOR"] => /usr/bin/pico
_SERVER["COLORFGBG"] => 15;default;0
_SERVER["WINDOWID"] => 29360592
_SERVER["CPPFLAGS"] => -traditional-cpp -no-cpp-precomp -no-cpp-precomp
-I/Users/m31/Documents/downloads/php-4.3.0RC2/TSRM
_SERVER["__CF_USER_TEXT_ENCODING"] => 0x1F5:0:0
_SERVER["PWD"] => /Users/m31/Documents/downloads/php-4.3.0RC2
_SERVER["GTK_RC_FILES"] => /etc/gtk/gtkrc:/Users/m31/.gtkrc
_SERVER["MFLAGS"] =>
_SERVER["ETERM_USER_ROOT"] => /sw/share/Eterm/themes/Eterm
_SERVER["CVSROOT"] => :pserver:anonymous@cvs-mirror.mozilla.org:/cvsroot
_SERVER["ETERM_VERSION"] => 0.9
_SERVER["USER"] => m31
_SERVER["CCFLAGS"] => -traditional-cpp
_SERVER["CFLAGS"] => -traditional-cpp -prefer-non-pic -static
_SERVER["MAKEFLAGS"] =>
_SERVER["_"] => /Users/m31/Documents/downloads/php-4.3.0RC2/sapi/cli/php
_SERVER["PERL5LIB"] => /sw/lib/perl5:/sw/lib/perl5:/sw/lib/perl5
_SERVER["EMAIL"] => m31@128kb.com
_SERVER["LOGNAME"] => m31
_SERVER["MAIL"] => /private/var/mail/m31
_SERVER["OSTYPE"] => darwin1.4
_SERVER["KDEDIR"] => /sw
_SERVER["KDE_STARTUP_ENV"] => 128kb.com;1039057883;355169;2289
_SERVER["OLDPWD"] => /Users/m31/Documents/downloads
_SERVER["HOSTTYPE"] => powerpc
_SERVER["MACHTYPE"] => powerpc
_SERVER["PS2"] => \\[\\e[32;1m\\]->>\\[\\e[0m\\]
_SERVER["COLORTERM"] => Eterm
_SERVER["COLORTERM_BCE"] => Eterm
_SERVER["MAKELEVEL"] => 1
_SERVER["TEST_PHP_EXECUTABLE"] =>
/Users/m31/Documents/downloads/php-4.3.0RC2/sapi/cli/php
_SERVER["TEST_PHP_SRCDIR"] => /Users/m31/Documents/downloads/php-4.3.0RC2
_SERVER["CC"] => gcc
_SERVER["REDIRECT_STATUS"] => 1
_SERVER["QUERY_STRING"] =>
_SERVER["PATH_TRANSLATED"] =>
_SERVER["SCRIPT_FILENAME"] =>
_SERVER["REQUEST_METHOD"] => GET
_SERVER["CONTENT_TYPE"] =>
_SERVER["CONTENT_LENGTH"] =>
_SERVER["PHP_SELF"] =>
_SERVER["SCRIPT_NAME"] =>
_SERVER["DOCUMENT_ROOT"] =>
_SERVER["argv"] => Array
(
)
_SERVER["argc"] => 0
_ENV["SESSION_MANAGER"] => local/128kb.com:/tmp/.ICE-unix/2303
_ENV["HOSTNAME"] => 128kb.com
_ENV["MANPATH"] =>
/sw/share/man:/sw/man:/usr/share/man:/usr/bin/man:/usr/local/man:/usr/local/share/man:/usr/X11/man:/usr/man:/usr/X11R6/man
_ENV["INFOPATH"] =>
/sw/share/info:/sw/info:/sw/share/info:/sw/info:/sw/share/info:/sw/info:/usr/local/share/info:/usr/local/lib/info:/usr/local/info:/usr/share/info
_ENV["ETERM_THEME_ROOT"] => /sw/share/Eterm/themes/Eterm
_ENV["TERM"] => xterm
_ENV["SHELL"] => /bin/sh
_ENV["KDE_MULTIHEAD"] => false
_ENV["HOME"] => /Users/m31
_ENV["PAGER"] => /usr/bin/less
_ENV["SHLVL"] => 6
_ENV["GS_LIB"] => /Users/m31/.kde/share/fonts
_ENV["DISPLAY"] => :0.0
_ENV["PS1"] =>
\\[\\e[33;1m\\]\\T\\[\\e[0m\\]>-\\[\\e[$COLOUR;1m\\]\\u\\[\\e[0m\\]@\\[\\e[$COLOUR;1m\\]\\H\\[\\e[0m\\]->[\\[\\e[$COLOUR;1m\\]\\w\\[\\e[0m\\]]\\$
_ENV["WINDOWMANAGER"] => blackbox
_ENV["PATH"] =>
/sw/bin:/sw/sbin:/sbin:/bin:/usr/bin:/usr/sbin:/usr/local/bin:/usr/local/sbin:/Users/m31/bin:/usr/local/mysql-3.23.46/bin:/Developer/Tools:/usr/X11R6/bin
_ENV["EDITOR"] => /usr/bin/pico
_ENV["COLORFGBG"] => 15;default;0
_ENV["WINDOWID"] => 29360592
_ENV["CPPFLAGS"] => -traditional-cpp -no-cpp-precomp -no-cpp-precomp
-I/Users/m31/Documents/downloads/php-4.3.0RC2/TSRM
_ENV["__CF_USER_TEXT_ENCODING"] => 0x1F5:0:0
_ENV["PWD"] => /Users/m31/Documents/downloads/php-4.3.0RC2
_ENV["GTK_RC_FILES"] => /etc/gtk/gtkrc:/Users/m31/.gtkrc
_ENV["MFLAGS"] =>
_ENV["ETERM_USER_ROOT"] => /sw/share/Eterm/themes/Eterm
_ENV["CVSROOT"] => :pserver:anonymous@cvs-mirror.mozilla.org:/cvsroot
_ENV["ETERM_VERSION"] => 0.9
_ENV["USER"] => m31
_ENV["CCFLAGS"] => -traditional-cpp
_ENV["CFLAGS"] => -traditional-cpp -prefer-non-pic -static
_ENV["MAKEFLAGS"] =>
_ENV["_"] => /Users/m31/Documents/downloads/php-4.3.0RC2/sapi/cli/php
_ENV["PERL5LIB"] => /sw/lib/perl5:/sw/lib/perl5:/sw/lib/perl5
_ENV["EMAIL"] => m31@128kb.com
_ENV["LOGNAME"] => m31
_ENV["MAIL"] => /private/var/mail/m31
_ENV["OSTYPE"] => darwin1.4
_ENV["KDEDIR"] => /sw
_ENV["KDE_STARTUP_ENV"] => 128kb.com;1039057883;355169;2289
_ENV["OLDPWD"] => /Users/m31/Documents/downloads
_ENV["HOSTTYPE"] => powerpc
_ENV["MACHTYPE"] => powerpc
_ENV["PS2"] => \\[\\e[32;1m\\]->>\\[\\e[0m\\]
_ENV["COLORTERM"] => Eterm
_ENV["COLORTERM_BCE"] => Eterm
_ENV["MAKELEVEL"] => 1
_ENV["TEST_PHP_EXECUTABLE"] => /Users/m31/Documents/downloads/php-4.3.0RC2/sapi/cli/php
_ENV["TEST_PHP_SRCDIR"] => /Users/m31/Documents/downloads/php-4.3.0RC2
_ENV["CC"] => gcc
_ENV["REDIRECT_STATUS"] => 1
_ENV["QUERY_STRING"] =>
_ENV["PATH_TRANSLATED"] =>
/Volumes/Darwin/Documents/OS9Documents/downloads/php-4.3.0RC2/tests/strings/004.php
_ENV["SCRIPT_FILENAME"] =>
/Volumes/Darwin/Documents/OS9Documents/downloads/php-4.3.0RC2/tests/strings/004.php
_ENV["REQUEST_METHOD"] => GET
_ENV["CONTENT_TYPE"] =>
_ENV["CONTENT_LENGTH"] =>
PHP License
This program is free software; you can redistribute it and/or modify
it under the terms of the PHP License as published by the PHP Group
and included in the distribution in the file: LICENSE
This program is distributed in the hope that it will be useful,
but WITHOUT ANY WARRANTY; without even the implied warranty of
MERCHANTABILITY or FITNESS FOR A PARTICULAR PURPOSE.
If you did not receive a copy of the PHP license, or have any
questions about PHP licensing, please contact license@php.net.