Test results
| From: | noreply@php.net | Date: | Thu, 12 Dec 2002 02:04:13 +0000 |
| Subject: | Test results | ||
| Groups: | php.qa | ||
| Request: | Send a blank email to php-qa+get-7186@lists.php.net to get a copy of this message | ||
=====================================================================
FAILED TEST SUMMARY
---------------------------------------------------------------------
Locale settings affecting float parsing [tests/lang/034.phpt]
aggregating everything [ext/standard/tests/aggregation/aggregate.phpt]
aggregating all methods [ext/standard/tests/aggregation/aggregate_methods.phpt]
aggregating methods specified in the list
[ext/standard/tests/aggregation/aggregate_methods_by_list.phpt]
aggregating methods matching regular expression
[ext/standard/tests/aggregation/aggregate_methods_by_regexp.phpt]
aggregating all default properties [ext/standard/tests/aggregation/aggregate_properties.phpt]
aggregating default properties specified in the list
[ext/standard/tests/aggregation/aggregate_properties_by_list.phpt]
aggregating default properties matching regular expression
[ext/standard/tests/aggregation/aggregate_properties_by_regexp.phpt]
retrieving aggregation info [ext/standard/tests/aggregation/aggregation_info.phpt]
deaggreating [ext/standard/tests/aggregation/deaggregate.phpt]
Test array_merge and array_walk [ext/standard/tests/array/001.phpt]
Test arsort, asort, krsort, ksort, rsort, and sort [ext/standard/tests/array/002.phpt]
Test usort, uksort and uasort [ext/standard/tests/array/003.phpt]
search_array and in_array (including bug 13567) [ext/standard/tests/array/array_search.phpt]
File type functions [ext/standard/tests/file/001.phpt]
getopt [ext/standard/tests/general_functions/getopt.phpt]
Simple math tests [ext/standard/tests/math/abs.phpt]
Various pow() tests [ext/standard/tests/math/pow.phpt]
Simple math tests [ext/standard/tests/math/round.phpt]
trim(), rtrim() and ltrim() functions [ext/standard/tests/strings/trim.phpt]
wordwrap() function [ext/standard/tests/strings/wordwrap.phpt]
=====================================================================
================================================================================
/usr/local/php/php-4.3.0RC3/tests/lang/034.phpt
================================================================================
---- EXPECTED OUTPUT
3,14
---- ACTUAL OUTPUT
3.14
---- FAILED
================================================================================
001- 3,14
001+ 3.14
================================================================================
================================================================================
/usr/local/php/php-4.3.0RC3/ext/standard/tests/aggregation/aggregate.phpt
================================================================================
---- EXPECTED OUTPUT
I'm alive!
I'm helping!
I'm aggregating!
****
---- ACTUAL OUTPUT
Warning: main(ext/standard/tests/aggregation/aggregate.lib) [/phpmanual/function.main.html]: failed
to create stream: No such file or directory in
/usr/local/php/php-4.3.0RC3/ext/standard/tests/aggregation/aggregate.php on line 3
Warning: main() [/phpmanual/function.main.html]: Failed opening
'ext/standard/tests/aggregation/aggregate.lib' for inclusion
(include_path='/Library/WebServer/Documents/scripts') in
/usr/local/php/php-4.3.0RC3/ext/standard/tests/aggregation/aggregate.php on line 3
Fatal error: Cannot instantiate non-existent class: simple in
/usr/local/php/php-4.3.0RC3/ext/standard/tests/aggregation/aggregate.php on line 5
---- FAILED
================================================================================
001- I'm alive!
001+ Warning: main(ext/standard/tests/aggregation/aggregate.lib) [/phpmanual/function.main.html]:
failed to create stream: No such file or directory in
/usr/local/php/php-4.3.0RC3/ext/standard/tests/aggregation/aggregate.php on line 3
002- I'm helping!
002+
003- I'm aggregating!
003+ Warning: main() [/phpmanual/function.main.html]: Failed opening
'ext/standard/tests/aggregation/aggregate.lib' for inclusion
(include_path='/Library/WebServer/Documents/scripts') in
/usr/local/php/php-4.3.0RC3/ext/standard/tests/aggregation/aggregate.php on line 3
004- ****
004+
005+ Fatal error: Cannot instantiate non-existent class: simple in
/usr/local/php/php-4.3.0RC3/ext/standard/tests/aggregation/aggregate.php on line 5
================================================================================
================================================================================
/usr/local/php/php-4.3.0RC3/ext/standard/tests/aggregation/aggregate_methods.phpt
================================================================================
---- EXPECTED OUTPUT
I'm alive!
mixing
100
simple,mix_it
simple_prop
mixing
---- ACTUAL OUTPUT
Warning: main(ext/standard/tests/aggregation/aggregate.lib) [/phpmanual/function.main.html]: failed
to create stream: No such file or directory in
/usr/local/php/php-4.3.0RC3/ext/standard/tests/aggregation/aggregate_methods.php on line 2
Warning: main() [/phpmanual/function.main.html]: Failed opening
'ext/standard/tests/aggregation/aggregate.lib' for inclusion
(include_path='/Library/WebServer/Documents/scripts') in
/usr/local/php/php-4.3.0RC3/ext/standard/tests/aggregation/aggregate_methods.php on line 2
Fatal error: Cannot instantiate non-existent class: simple in
/usr/local/php/php-4.3.0RC3/ext/standard/tests/aggregation/aggregate_methods.php on line 4
---- FAILED
================================================================================
001- I'm alive!
001+ Warning: main(ext/standard/tests/aggregation/aggregate.lib) [/phpmanual/function.main.html]:
failed to create stream: No such file or directory in
/usr/local/php/php-4.3.0RC3/ext/standard/tests/aggregation/aggregate_methods.php on line 2
002- mixing
002+
003- 100
003+ Warning: main() [/phpmanual/function.main.html]: Failed opening
'ext/standard/tests/aggregation/aggregate.lib' for inclusion
(include_path='/Library/WebServer/Documents/scripts') in
/usr/local/php/php-4.3.0RC3/ext/standard/tests/aggregation/aggregate_methods.php on line 2
004- simple,mix_it
004+
005- simple_prop
005+ Fatal error: Cannot instantiate non-existent class: simple in
/usr/local/php/php-4.3.0RC3/ext/standard/tests/aggregation/aggregate_methods.php on line 4
006- mixing
================================================================================
================================================================================
/usr/local/php/php-4.3.0RC3/ext/standard/tests/aggregation/aggregate_methods_by_list.phpt
================================================================================
---- EXPECTED OUTPUT
I'm alive!
simple,just_another_method
I'm alive!
simple,do_this,do_that
yep, that's me
---- ACTUAL OUTPUT
Warning: main(ext/standard/tests/aggregation/aggregate.lib) [/phpmanual/function.main.html]: failed
to create stream: No such file or directory in
/usr/local/php/php-4.3.0RC3/ext/standard/tests/aggregation/aggregate_methods_by_list.php on line 2
Warning: main() [/phpmanual/function.main.html]: Failed opening
'ext/standard/tests/aggregation/aggregate.lib' for inclusion
(include_path='/Library/WebServer/Documents/scripts') in
/usr/local/php/php-4.3.0RC3/ext/standard/tests/aggregation/aggregate_methods_by_list.php on line 2
Fatal error: Cannot instantiate non-existent class: simple in
/usr/local/php/php-4.3.0RC3/ext/standard/tests/aggregation/aggregate_methods_by_list.php on line 4
---- FAILED
================================================================================
001- I'm alive!
001+ Warning: main(ext/standard/tests/aggregation/aggregate.lib) [/phpmanual/function.main.html]:
failed to create stream: No such file or directory in
/usr/local/php/php-4.3.0RC3/ext/standard/tests/aggregation/aggregate_methods_by_list.php on line 2
002- simple,just_another_method
002+
003- I'm alive!
003+ Warning: main() [/phpmanual/function.main.html]: Failed opening
'ext/standard/tests/aggregation/aggregate.lib' for inclusion
(include_path='/Library/WebServer/Documents/scripts') in
/usr/local/php/php-4.3.0RC3/ext/standard/tests/aggregation/aggregate_methods_by_list.php on line 2
004- simple,do_this,do_that
004+
005- yep, that's me
005+ Fatal error: Cannot instantiate non-existent class: simple in
/usr/local/php/php-4.3.0RC3/ext/standard/tests/aggregation/aggregate_methods_by_list.php on line 4
================================================================================
================================================================================
/usr/local/php/php-4.3.0RC3/ext/standard/tests/aggregation/aggregate_methods_by_regexp.phpt
================================================================================
---- EXPECTED OUTPUT
I'm alive!
simple,do_this,do_that
I'm alive!
simple,just_another_method
---- ACTUAL OUTPUT
Warning: main(ext/standard/tests/aggregation/aggregate.lib) [/phpmanual/function.main.html]: failed
to create stream: No such file or directory in
/usr/local/php/php-4.3.0RC3/ext/standard/tests/aggregation/aggregate_methods_by_regexp.php on line 2
Warning: main() [/phpmanual/function.main.html]: Failed opening
'ext/standard/tests/aggregation/aggregate.lib' for inclusion
(include_path='/Library/WebServer/Documents/scripts') in
/usr/local/php/php-4.3.0RC3/ext/standard/tests/aggregation/aggregate_methods_by_regexp.php on line 2
Fatal error: Cannot instantiate non-existent class: simple in
/usr/local/php/php-4.3.0RC3/ext/standard/tests/aggregation/aggregate_methods_by_regexp.php on line 4
---- FAILED
================================================================================
001- I'm alive!
001+ Warning: main(ext/standard/tests/aggregation/aggregate.lib) [/phpmanual/function.main.html]:
failed to create stream: No such file or directory in
/usr/local/php/php-4.3.0RC3/ext/standard/tests/aggregation/aggregate_methods_by_regexp.php on line 2
002- simple,do_this,do_that
002+
003- I'm alive!
003+ Warning: main() [/phpmanual/function.main.html]: Failed opening
'ext/standard/tests/aggregation/aggregate.lib' for inclusion
(include_path='/Library/WebServer/Documents/scripts') in
/usr/local/php/php-4.3.0RC3/ext/standard/tests/aggregation/aggregate_methods_by_regexp.php on line 2
004- simple,just_another_method
004+
005+ Fatal error: Cannot instantiate non-existent class: simple in
/usr/local/php/php-4.3.0RC3/ext/standard/tests/aggregation/aggregate_methods_by_regexp.php on line 4
================================================================================
================================================================================
/usr/local/php/php-4.3.0RC3/ext/standard/tests/aggregation/aggregate_properties.phpt
================================================================================
---- EXPECTED OUTPUT
I'm alive!
simple_prop,mix
100
simple
---- ACTUAL OUTPUT
Warning: main(ext/standard/tests/aggregation/aggregate.lib) [/phpmanual/function.main.html]: failed
to create stream: No such file or directory in
/usr/local/php/php-4.3.0RC3/ext/standard/tests/aggregation/aggregate_properties.php on line 2
Warning: main() [/phpmanual/function.main.html]: Failed opening
'ext/standard/tests/aggregation/aggregate.lib' for inclusion
(include_path='/Library/WebServer/Documents/scripts') in
/usr/local/php/php-4.3.0RC3/ext/standard/tests/aggregation/aggregate_properties.php on line 2
Fatal error: Cannot instantiate non-existent class: simple in
/usr/local/php/php-4.3.0RC3/ext/standard/tests/aggregation/aggregate_properties.php on line 4
---- FAILED
================================================================================
001- I'm alive!
001+ Warning: main(ext/standard/tests/aggregation/aggregate.lib) [/phpmanual/function.main.html]:
failed to create stream: No such file or directory in
/usr/local/php/php-4.3.0RC3/ext/standard/tests/aggregation/aggregate_properties.php on line 2
002- simple_prop,mix
002+
003- 100
003+ Warning: main() [/phpmanual/function.main.html]: Failed opening
'ext/standard/tests/aggregation/aggregate.lib' for inclusion
(include_path='/Library/WebServer/Documents/scripts') in
/usr/local/php/php-4.3.0RC3/ext/standard/tests/aggregation/aggregate_properties.php on line 2
004- simple
004+
005+ Fatal error: Cannot instantiate non-existent class: simple in
/usr/local/php/php-4.3.0RC3/ext/standard/tests/aggregation/aggregate_properties.php on line 4
================================================================================
================================================================================
/usr/local/php/php-4.3.0RC3/ext/standard/tests/aggregation/aggregate_properties_by_list.phpt
================================================================================
---- EXPECTED OUTPUT
I'm alive!
simple_prop,my_prop,our_prop
I'm alive!
simple_prop,your_prop,our_prop
---- ACTUAL OUTPUT
Warning: main(ext/standard/tests/aggregation/aggregate.lib) [/phpmanual/function.main.html]: failed
to create stream: No such file or directory in
/usr/local/php/php-4.3.0RC3/ext/standard/tests/aggregation/aggregate_properties_by_list.php on line
2
Warning: main() [/phpmanual/function.main.html]: Failed opening
'ext/standard/tests/aggregation/aggregate.lib' for inclusion
(include_path='/Library/WebServer/Documents/scripts') in
/usr/local/php/php-4.3.0RC3/ext/standard/tests/aggregation/aggregate_properties_by_list.php on line
2
Fatal error: Cannot instantiate non-existent class: simple in
/usr/local/php/php-4.3.0RC3/ext/standard/tests/aggregation/aggregate_properties_by_list.php on line
4
---- FAILED
================================================================================
001- I'm alive!
001+ Warning: main(ext/standard/tests/aggregation/aggregate.lib) [/phpmanual/function.main.html]:
failed to create stream: No such file or directory in
/usr/local/php/php-4.3.0RC3/ext/standard/tests/aggregation/aggregate_properties_by_list.php on line
2
002- simple_prop,my_prop,our_prop
002+
003- I'm alive!
003+ Warning: main() [/phpmanual/function.main.html]: Failed opening
'ext/standard/tests/aggregation/aggregate.lib' for inclusion
(include_path='/Library/WebServer/Documents/scripts') in
/usr/local/php/php-4.3.0RC3/ext/standard/tests/aggregation/aggregate_properties_by_list.php on line
2
004- simple_prop,your_prop,our_prop
004+
005+ Fatal error: Cannot instantiate non-existent class: simple in
/usr/local/php/php-4.3.0RC3/ext/standard/tests/aggregation/aggregate_properties_by_list.php on line
4
================================================================================
================================================================================
/usr/local/php/php-4.3.0RC3/ext/standard/tests/aggregation/aggregate_properties_by_regexp.phpt
================================================================================
---- EXPECTED OUTPUT
I'm alive!
simple_prop,my_prop
I'm alive!
simple_prop,your_prop,our_prop
---- ACTUAL OUTPUT
Warning: main(ext/standard/tests/aggregation/aggregate.lib) [/phpmanual/function.main.html]: failed
to create stream: No such file or directory in
/usr/local/php/php-4.3.0RC3/ext/standard/tests/aggregation/aggregate_properties_by_regexp.php on
line 2
Warning: main() [/phpmanual/function.main.html]: Failed opening
'ext/standard/tests/aggregation/aggregate.lib' for inclusion
(include_path='/Library/WebServer/Documents/scripts') in
/usr/local/php/php-4.3.0RC3/ext/standard/tests/aggregation/aggregate_properties_by_regexp.php on
line 2
Fatal error: Cannot instantiate non-existent class: simple in
/usr/local/php/php-4.3.0RC3/ext/standard/tests/aggregation/aggregate_properties_by_regexp.php on
line 4
---- FAILED
================================================================================
001- I'm alive!
001+ Warning: main(ext/standard/tests/aggregation/aggregate.lib) [/phpmanual/function.main.html]:
failed to create stream: No such file or directory in
/usr/local/php/php-4.3.0RC3/ext/standard/tests/aggregation/aggregate_properties_by_regexp.php on
line 2
002- simple_prop,my_prop
002+
003- I'm alive!
003+ Warning: main() [/phpmanual/function.main.html]: Failed opening
'ext/standard/tests/aggregation/aggregate.lib' for inclusion
(include_path='/Library/WebServer/Documents/scripts') in
/usr/local/php/php-4.3.0RC3/ext/standard/tests/aggregation/aggregate_properties_by_regexp.php on
line 2
004- simple_prop,your_prop,our_prop
004+
005+ Fatal error: Cannot instantiate non-existent class: simple in
/usr/local/php/php-4.3.0RC3/ext/standard/tests/aggregation/aggregate_properties_by_regexp.php on
line 4
================================================================================
================================================================================
/usr/local/php/php-4.3.0RC3/ext/standard/tests/aggregation/aggregation_info.phpt
================================================================================
---- EXPECTED OUTPUT
I'm alive!
Array
(
[mixin] => Array
(
[methods] => Array
(
[0] => mix_it
)
[properties] => Array
(
[0] => mix
)
)
)
---- ACTUAL OUTPUT
Warning: main(ext/standard/tests/aggregation/aggregate.lib) [/phpmanual/function.main.html]: failed
to create stream: No such file or directory in
/usr/local/php/php-4.3.0RC3/ext/standard/tests/aggregation/aggregation_info.php on line 2
Warning: main() [/phpmanual/function.main.html]: Failed opening
'ext/standard/tests/aggregation/aggregate.lib' for inclusion
(include_path='/Library/WebServer/Documents/scripts') in
/usr/local/php/php-4.3.0RC3/ext/standard/tests/aggregation/aggregation_info.php on line 2
Fatal error: Cannot instantiate non-existent class: simple in
/usr/local/php/php-4.3.0RC3/ext/standard/tests/aggregation/aggregation_info.php on line 4
---- FAILED
================================================================================
001- I'm alive!
001+ Warning: main(ext/standard/tests/aggregation/aggregate.lib) [/phpmanual/function.main.html]:
failed to create stream: No such file or directory in
/usr/local/php/php-4.3.0RC3/ext/standard/tests/aggregation/aggregation_info.php on line 2
002- Array
002+
003- (
003+ Warning: main() [/phpmanual/function.main.html]: Failed opening
'ext/standard/tests/aggregation/aggregate.lib' for inclusion
(include_path='/Library/WebServer/Documents/scripts') in
/usr/local/php/php-4.3.0RC3/ext/standard/tests/aggregation/aggregation_info.php on line 2
004- [mixin] => Array
004+
005- (
005+ Fatal error: Cannot instantiate non-existent class: simple in
/usr/local/php/php-4.3.0RC3/ext/standard/tests/aggregation/aggregation_info.php on line 4
006- [methods] => Array
007- (
008- [0] => mix_it
009- )
010-
011- [properties] => Array
012- (
013- [0] => mix
014- )
015-
016- )
017-
018- )
================================================================================
================================================================================
/usr/local/php/php-4.3.0RC3/ext/standard/tests/aggregation/deaggregate.phpt
================================================================================
---- EXPECTED OUTPUT
I'm alive!
Array
(
[helper] => Array
(
[methods] => Array
(
[0] => do_this
[1] => do_that
[2] => just_another_method
)
[properties] => Array
(
[0] => my_prop
[1] => your_prop
[2] => our_prop
)
)
[mixin] => Array
(
[methods] => Array
(
[0] => mix_it
)
[properties] => Array
(
[0] => mix
)
)
)
Array
(
[mixin] => Array
(
[methods] => Array
(
[0] => mix_it
)
[properties] => Array
(
[0] => mix
)
)
)
bool(false)
---- ACTUAL OUTPUT
Warning: main(ext/standard/tests/aggregation/aggregate.lib) [/phpmanual/function.main.html]: failed
to create stream: No such file or directory in
/usr/local/php/php-4.3.0RC3/ext/standard/tests/aggregation/deaggregate.php on line 2
Warning: main() [/phpmanual/function.main.html]: Failed opening
'ext/standard/tests/aggregation/aggregate.lib' for inclusion
(include_path='/Library/WebServer/Documents/scripts') in
/usr/local/php/php-4.3.0RC3/ext/standard/tests/aggregation/deaggregate.php on line 2
Fatal error: Cannot instantiate non-existent class: simple in
/usr/local/php/php-4.3.0RC3/ext/standard/tests/aggregation/deaggregate.php on line 4
---- FAILED
================================================================================
001- I'm alive!
001+ Warning: main(ext/standard/tests/aggregation/aggregate.lib) [/phpmanual/function.main.html]:
failed to create stream: No such file or directory in
/usr/local/php/php-4.3.0RC3/ext/standard/tests/aggregation/deaggregate.php on line 2
002- Array
002+
003- (
003+ Warning: main() [/phpmanual/function.main.html]: Failed opening
'ext/standard/tests/aggregation/aggregate.lib' for inclusion
(include_path='/Library/WebServer/Documents/scripts') in
/usr/local/php/php-4.3.0RC3/ext/standard/tests/aggregation/deaggregate.php on line 2
004- [helper] => Array
004+
005- (
005+ Fatal error: Cannot instantiate non-existent class: simple in
/usr/local/php/php-4.3.0RC3/ext/standard/tests/aggregation/deaggregate.php on line 4
006- [methods] => Array
007- (
008- [0] => do_this
009- [1] => do_that
010- [2] => just_another_method
011- )
012-
013- [properties] => Array
014- (
015- [0] => my_prop
016- [1] => your_prop
017- [2] => our_prop
018- )
019-
020- )
021-
022- [mixin] => Array
023- (
024- [methods] => Array
025- (
026- [0] => mix_it
027- )
028-
029- [properties] => Array
030- (
031- [0] => mix
032- )
033-
034- )
035-
036- )
037- Array
038- (
039- [mixin] => Array
040- (
041- [methods] => Array
042- (
043- [0] => mix_it
044- )
045-
046- [properties] => Array
047- (
048- [0] => mix
049- )
050-
051- )
052-
053- )
054- bool(false)
================================================================================
================================================================================
/usr/local/php/php-4.3.0RC3/ext/standard/tests/array/001.phpt
================================================================================
---- EXPECTED OUTPUT
array(11) {
[0]=>
string(3) "PHP"
[1]=>
string(27) "PHP: Hypertext Preprocessor"
[2]=>
string(4) "Test"
["test"]=>
int(27)
[3]=>
string(4) "test"
["-1000"]=>
array(2) {
[0]=>
string(6) "banana"
[1]=>
string(6) "orange"
}
[4]=>
string(6) "monkey"
[5]=>
float(-0.33333333333333)
[6]=>
array(1) {
[0]=>
array(1) {
[0]=>
array(1) {
[0]=>
int(0)
}
}
}
[7]=>
array(1) {
[0]=>
array(1) {
[0]=>
array(1) {
[0]=>
int(0)
}
}
}
[8]=>
array(1) {
[0]=>
array(1) {
[0]=>
array(1) {
[0]=>
int(0)
}
}
}
}
-- Testing array_walk() --
int(0)
string(3) "PHP"
int(1)
string(27) "PHP: Hypertext Preprocessor"
int(2)
string(4) "Test"
string(4) "test"
int(27)
int(3)
string(4) "test"
string(5) "-1000"
array(2) {
[0]=>
string(6) "banana"
[1]=>
string(6) "orange"
}
int(4)
string(6) "monkey"
int(5)
float(-0.33333333333333)
int(6)
array(1) {
[0]=>
array(1) {
[0]=>
array(1) {
[0]=>
int(0)
}
}
}
int(7)
array(1) {
[0]=>
array(1) {
[0]=>
array(1) {
[0]=>
int(0)
}
}
}
int(8)
array(1) {
[0]=>
array(1) {
[0]=>
array(1) {
[0]=>
int(0)
}
}
}
---- ACTUAL OUTPUT
Warning: main(ext/standard/tests/array/data.inc) [/phpmanual/function.main.html]: failed to create
stream: No such file or directory in /usr/local/php/php-4.3.0RC3/ext/standard/tests/array/001.php on
line 2
Fatal error: main() [/phpmanual/function.main.html]: Failed opening required
'ext/standard/tests/array/data.inc'
(include_path='/Library/WebServer/Documents/scripts') in
/usr/local/php/php-4.3.0RC3/ext/standard/tests/array/001.php on line 2
---- FAILED
================================================================================
001- array(11) {
001+ Warning: main(ext/standard/tests/array/data.inc) [/phpmanual/function.main.html]: failed to
create stream: No such file or directory in
/usr/local/php/php-4.3.0RC3/ext/standard/tests/array/001.php on line 2
002- [0]=>
002+
003- string(3) "PHP"
003+ Fatal error: main() [/phpmanual/function.main.html]: Failed opening required
'ext/standard/tests/array/data.inc'
(include_path='/Library/WebServer/Documents/scripts') in
/usr/local/php/php-4.3.0RC3/ext/standard/tests/array/001.php on line 2
004- [1]=>
005- string(27) "PHP: Hypertext Preprocessor"
006- [2]=>
007- string(4) "Test"
008- ["test"]=>
009- int(27)
010- [3]=>
011- string(4) "test"
012- ["-1000"]=>
013- array(2) {
014- [0]=>
015- string(6) "banana"
016- [1]=>
017- string(6) "orange"
018- }
019- [4]=>
020- string(6) "monkey"
021- [5]=>
022- float(-0.33333333333333)
023- [6]=>
024- array(1) {
025- [0]=>
026- array(1) {
027- [0]=>
028- array(1) {
029- [0]=>
030- int(0)
031- }
032- }
033- }
034- [7]=>
035- array(1) {
036- [0]=>
037- array(1) {
038- [0]=>
039- array(1) {
040- [0]=>
041- int(0)
042- }
043- }
044- }
045- [8]=>
046- array(1) {
047- [0]=>
048- array(1) {
049- [0]=>
050- array(1) {
051- [0]=>
052- int(0)
053- }
054- }
055- }
056- }
057- -- Testing array_walk() --
058- int(0)
059- string(3) "PHP"
060- int(1)
061- string(27) "PHP: Hypertext Preprocessor"
062- int(2)
063- string(4) "Test"
064- string(4) "test"
065- int(27)
066- int(3)
067- string(4) "test"
068- string(5) "-1000"
069- array(2) {
070- [0]=>
071- string(6) "banana"
072- [1]=>
073- string(6) "orange"
074- }
075- int(4)
076- string(6) "monkey"
077- int(5)
078- float(-0.33333333333333)
079- int(6)
080- array(1) {
081- [0]=>
082- array(1) {
083- [0]=>
084- array(1) {
085- [0]=>
086- int(0)
087- }
088- }
089- }
090- int(7)
091- array(1) {
092- [0]=>
093- array(1) {
094- [0]=>
095- array(1) {
096- [0]=>
097- int(0)
098- }
099- }
100- }
101- int(8)
102- array(1) {
103- [0]=>
104- array(1) {
105- [0]=>
106- array(1) {
107- [0]=>
108- int(0)
109- }
110- }
111- }
================================================================================
================================================================================
/usr/local/php/php-4.3.0RC3/ext/standard/tests/array/002.phpt
================================================================================
---- EXPECTED OUTPUT
Unsorted data:
array(8) {
[0]=>
string(3) "PHP"
[17]=>
string(27) "PHP: Hypertext Preprocessor"
[5]=>
string(4) "Test"
["test"]=>
int(27)
[1000]=>
string(4) "test"
["-1000"]=>
array(2) {
[0]=>
string(6) "banana"
[1]=>
string(6) "orange"
}
[1001]=>
string(6) "monkey"
[16777216]=>
float(-0.33333333333333)
}
-- Testing arsort() --
No second argument:
array(8) {
["-1000"]=>
array(2) {
[0]=>
string(6) "banana"
[1]=>
string(6) "orange"
}
["test"]=>
int(27)
[1000]=>
string(4) "test"
[1001]=>
string(6) "monkey"
[5]=>
string(4) "Test"
[17]=>
string(27) "PHP: Hypertext Preprocessor"
[0]=>
string(3) "PHP"
[16777216]=>
float(-0.33333333333333)
}
Using SORT_REGULAR:
array(8) {
["-1000"]=>
array(2) {
[0]=>
string(6) "banana"
[1]=>
string(6) "orange"
}
["test"]=>
int(27)
[1000]=>
string(4) "test"
[1001]=>
string(6) "monkey"
[5]=>
string(4) "Test"
[17]=>
string(27) "PHP: Hypertext Preprocessor"
[0]=>
string(3) "PHP"
[16777216]=>
float(-0.33333333333333)
}
Using SORT_NUMERIC:
array(8) {
["test"]=>
int(27)
["-1000"]=>
array(2) {
[0]=>
string(6) "banana"
[1]=>
string(6) "orange"
}
[0]=>
string(3) "PHP"
[17]=>
string(27) "PHP: Hypertext Preprocessor"
[1001]=>
string(6) "monkey"
[5]=>
string(4) "Test"
[1000]=>
string(4) "test"
[16777216]=>
float(-0.33333333333333)
}
Using SORT_STRING
array(8) {
[1000]=>
string(4) "test"
[1001]=>
string(6) "monkey"
[5]=>
string(4) "Test"
[17]=>
string(27) "PHP: Hypertext Preprocessor"
[0]=>
string(3) "PHP"
["-1000"]=>
array(2) {
[0]=>
string(6) "banana"
[1]=>
string(6) "orange"
}
["test"]=>
int(27)
[16777216]=>
float(-0.33333333333333)
}
-- Testing asort() --
No second argument:
array(8) {
[16777216]=>
float(-0.33333333333333)
[0]=>
string(3) "PHP"
[17]=>
string(27) "PHP: Hypertext Preprocessor"
[5]=>
string(4) "Test"
[1001]=>
string(6) "monkey"
[1000]=>
string(4) "test"
["test"]=>
int(27)
["-1000"]=>
array(2) {
[0]=>
string(6) "banana"
[1]=>
string(6) "orange"
}
}
Using SORT_REGULAR:
array(8) {
[16777216]=>
float(-0.33333333333333)
[0]=>
string(3) "PHP"
[17]=>
string(27) "PHP: Hypertext Preprocessor"
[5]=>
string(4) "Test"
[1001]=>
string(6) "monkey"
[1000]=>
string(4) "test"
["test"]=>
int(27)
["-1000"]=>
array(2) {
[0]=>
string(6) "banana"
[1]=>
string(6) "orange"
}
}
Using SORT_NUMERIC:
array(8) {
[16777216]=>
float(-0.33333333333333)
[1001]=>
string(6) "monkey"
[1000]=>
string(4) "test"
[5]=>
string(4) "Test"
[17]=>
string(27) "PHP: Hypertext Preprocessor"
[0]=>
string(3) "PHP"
["-1000"]=>
array(2) {
[0]=>
string(6) "banana"
[1]=>
string(6) "orange"
}
["test"]=>
int(27)
}
Using SORT_STRING
array(8) {
[16777216]=>
float(-0.33333333333333)
["test"]=>
int(27)
["-1000"]=>
array(2) {
[0]=>
string(6) "banana"
[1]=>
string(6) "orange"
}
[0]=>
string(3) "PHP"
[17]=>
string(27) "PHP: Hypertext Preprocessor"
[5]=>
string(4) "Test"
[1001]=>
string(6) "monkey"
[1000]=>
string(4) "test"
}
-- Testing krsort() --
No second argument:
array(8) {
[16777216]=>
float(-0.33333333333333)
[1001]=>
string(6) "monkey"
[1000]=>
string(4) "test"
[17]=>
string(27) "PHP: Hypertext Preprocessor"
[5]=>
string(4) "Test"
["test"]=>
int(27)
[0]=>
string(3) "PHP"
["-1000"]=>
array(2) {
[0]=>
string(6) "banana"
[1]=>
string(6) "orange"
}
}
Using SORT_REGULAR:
array(8) {
[16777216]=>
float(-0.33333333333333)
[1001]=>
string(6) "monkey"
[1000]=>
string(4) "test"
[17]=>
string(27) "PHP: Hypertext Preprocessor"
[5]=>
string(4) "Test"
[0]=>
string(3) "PHP"
["test"]=>
int(27)
["-1000"]=>
array(2) {
[0]=>
string(6) "banana"
[1]=>
string(6) "orange"
}
}
Using SORT_NUMERIC:
array(8) {
[16777216]=>
float(-0.33333333333333)
[1001]=>
string(6) "monkey"
[1000]=>
string(4) "test"
[17]=>
string(27) "PHP: Hypertext Preprocessor"
[5]=>
string(4) "Test"
["test"]=>
int(27)
[0]=>
string(3) "PHP"
["-1000"]=>
array(2) {
[0]=>
string(6) "banana"
[1]=>
string(6) "orange"
}
}
Using SORT_STRING
array(8) {
["test"]=>
int(27)
[5]=>
string(4) "Test"
[17]=>
string(27) "PHP: Hypertext Preprocessor"
[16777216]=>
float(-0.33333333333333)
[1001]=>
string(6) "monkey"
[1000]=>
string(4) "test"
[0]=>
string(3) "PHP"
["-1000"]=>
array(2) {
[0]=>
string(6) "banana"
[1]=>
string(6) "orange"
}
}
-- Testing ksort() --
No second argument:
array(8) {
["-1000"]=>
array(2) {
[0]=>
string(6) "banana"
[1]=>
string(6) "orange"
}
[0]=>
string(3) "PHP"
["test"]=>
int(27)
[5]=>
string(4) "Test"
[17]=>
string(27) "PHP: Hypertext Preprocessor"
[1000]=>
string(4) "test"
[1001]=>
string(6) "monkey"
[16777216]=>
float(-0.33333333333333)
}
Using SORT_REGULAR:
array(8) {
["-1000"]=>
array(2) {
[0]=>
string(6) "banana"
[1]=>
string(6) "orange"
}
["test"]=>
int(27)
[0]=>
string(3) "PHP"
[5]=>
string(4) "Test"
[17]=>
string(27) "PHP: Hypertext Preprocessor"
[1000]=>
string(4) "test"
[1001]=>
string(6) "monkey"
[16777216]=>
float(-0.33333333333333)
}
Using SORT_NUMERIC:
array(8) {
["-1000"]=>
array(2) {
[0]=>
string(6) "banana"
[1]=>
string(6) "orange"
}
[0]=>
string(3) "PHP"
["test"]=>
int(27)
[5]=>
string(4) "Test"
[17]=>
string(27) "PHP: Hypertext Preprocessor"
[1000]=>
string(4) "test"
[1001]=>
string(6) "monkey"
[16777216]=>
float(-0.33333333333333)
}
Using SORT_STRING
array(8) {
["-1000"]=>
array(2) {
[0]=>
string(6) "banana"
[1]=>
string(6) "orange"
}
[0]=>
string(3) "PHP"
[1000]=>
string(4) "test"
[1001]=>
string(6) "monkey"
[16777216]=>
float(-0.33333333333333)
[17]=>
string(27) "PHP: Hypertext Preprocessor"
[5]=>
string(4) "Test"
["test"]=>
int(27)
}
-- Testing rsort() --
No second argument:
array(8) {
[0]=>
array(2) {
[0]=>
string(6) "banana"
[1]=>
string(6) "orange"
}
[1]=>
int(27)
[2]=>
string(4) "test"
[3]=>
string(6) "monkey"
[4]=>
string(4) "Test"
[5]=>
string(27) "PHP: Hypertext Preprocessor"
[6]=>
string(3) "PHP"
[7]=>
float(-0.33333333333333)
}
Using SORT_REGULAR:
array(8) {
[0]=>
array(2) {
[0]=>
string(6) "banana"
[1]=>
string(6) "orange"
}
[1]=>
int(27)
[2]=>
string(4) "test"
[3]=>
string(6) "monkey"
[4]=>
string(4) "Test"
[5]=>
string(27) "PHP: Hypertext Preprocessor"
[6]=>
string(3) "PHP"
[7]=>
float(-0.33333333333333)
}
Using SORT_NUMERIC:
array(8) {
[0]=>
int(27)
[1]=>
array(2) {
[0]=>
string(6) "banana"
[1]=>
string(6) "orange"
}
[2]=>
string(3) "PHP"
[3]=>
string(27) "PHP: Hypertext Preprocessor"
[4]=>
string(6) "monkey"
[5]=>
string(4) "Test"
[6]=>
string(4) "test"
[7]=>
float(-0.33333333333333)
}
Using SORT_STRING
array(8) {
[0]=>
string(4) "test"
[1]=>
string(6) "monkey"
[2]=>
string(4) "Test"
[3]=>
string(27) "PHP: Hypertext Preprocessor"
[4]=>
string(3) "PHP"
[5]=>
array(2) {
[0]=>
string(6) "banana"
[1]=>
string(6) "orange"
}
[6]=>
int(27)
[7]=>
float(-0.33333333333333)
}
-- Testing sort() --
No second argument:
array(8) {
[0]=>
float(-0.33333333333333)
[1]=>
string(3) "PHP"
[2]=>
string(27) "PHP: Hypertext Preprocessor"
[3]=>
string(4) "Test"
[4]=>
string(6) "monkey"
[5]=>
string(4) "test"
[6]=>
int(27)
[7]=>
array(2) {
[0]=>
string(6) "banana"
[1]=>
string(6) "orange"
}
}
Using SORT_REGULAR:
array(8) {
[0]=>
float(-0.33333333333333)
[1]=>
string(3) "PHP"
[2]=>
string(27) "PHP: Hypertext Preprocessor"
[3]=>
string(4) "Test"
[4]=>
string(6) "monkey"
[5]=>
string(4) "test"
[6]=>
int(27)
[7]=>
array(2) {
[0]=>
string(6) "banana"
[1]=>
string(6) "orange"
}
}
Using SORT_NUMERIC:
array(8) {
[0]=>
float(-0.33333333333333)
[1]=>
string(6) "monkey"
[2]=>
string(4) "test"
[3]=>
string(4) "Test"
[4]=>
string(27) "PHP: Hypertext Preprocessor"
[5]=>
string(3) "PHP"
[6]=>
array(2) {
[0]=>
string(6) "banana"
[1]=>
string(6) "orange"
}
[7]=>
int(27)
}
Using SORT_STRING
array(8) {
[0]=>
float(-0.33333333333333)
[1]=>
int(27)
[2]=>
array(2) {
[0]=>
string(6) "banana"
[1]=>
string(6) "orange"
}
[3]=>
string(3) "PHP"
[4]=>
string(27) "PHP: Hypertext Preprocessor"
[5]=>
string(4) "Test"
[6]=>
string(6) "monkey"
[7]=>
string(4) "test"
}
---- ACTUAL OUTPUT
Warning: main(ext/standard/tests/array/data.inc) [/phpmanual/function.main.html]: failed to create
stream: No such file or directory in /usr/local/php/php-4.3.0RC3/ext/standard/tests/array/002.php on
line 2
Fatal error: main() [/phpmanual/function.main.html]: Failed opening required
'ext/standard/tests/array/data.inc'
(include_path='/Library/WebServer/Documents/scripts') in
/usr/local/php/php-4.3.0RC3/ext/standard/tests/array/002.php on line 2
---- FAILED
================================================================================
001- Unsorted data:
001+ Warning: main(ext/standard/tests/array/data.inc) [/phpmanual/function.main.html]: failed to
create stream: No such file or directory in
/usr/local/php/php-4.3.0RC3/ext/standard/tests/array/002.php on line 2
002- array(8) {
002+
003- [0]=>
003+ Fatal error: main() [/phpmanual/function.main.html]: Failed opening required
'ext/standard/tests/array/data.inc'
(include_path='/Library/WebServer/Documents/scripts') in
/usr/local/php/php-4.3.0RC3/ext/standard/tests/array/002.php on line 2
004- string(3) "PHP"
005- [17]=>
006- string(27) "PHP: Hypertext Preprocessor"
007- [5]=>
008- string(4) "Test"
009- ["test"]=>
010- int(27)
011- [1000]=>
012- string(4) "test"
013- ["-1000"]=>
014- array(2) {
015- [0]=>
016- string(6) "banana"
017- [1]=>
018- string(6) "orange"
019- }
020- [1001]=>
021- string(6) "monkey"
022- [16777216]=>
023- float(-0.33333333333333)
024- }
025-
026- -- Testing arsort() --
027- No second argument:
028- array(8) {
029- ["-1000"]=>
030- array(2) {
031- [0]=>
032- string(6) "banana"
033- [1]=>
034- string(6) "orange"
035- }
036- ["test"]=>
037- int(27)
038- [1000]=>
039- string(4) "test"
040- [1001]=>
041- string(6) "monkey"
042- [5]=>
043- string(4) "Test"
044- [17]=>
045- string(27) "PHP: Hypertext Preprocessor"
046- [0]=>
047- string(3) "PHP"
048- [16777216]=>
049- float(-0.33333333333333)
050- }
051- Using SORT_REGULAR:
052- array(8) {
053- ["-1000"]=>
054- array(2) {
055- [0]=>
056- string(6) "banana"
057- [1]=>
058- string(6) "orange"
059- }
060- ["test"]=>
061- int(27)
062- [1000]=>
063- string(4) "test"
064- [1001]=>
065- string(6) "monkey"
066- [5]=>
067- string(4) "Test"
068- [17]=>
069- string(27) "PHP: Hypertext Preprocessor"
070- [0]=>
071- string(3) "PHP"
072- [16777216]=>
073- float(-0.33333333333333)
074- }
075- Using SORT_NUMERIC:
076- array(8) {
077- ["test"]=>
078- int(27)
079- ["-1000"]=>
080- array(2) {
081- [0]=>
082- string(6) "banana"
083- [1]=>
084- string(6) "orange"
085- }
086- [0]=>
087- string(3) "PHP"
088- [17]=>
089- string(27) "PHP: Hypertext Preprocessor"
090- [1001]=>
091- string(6) "monkey"
092- [5]=>
093- string(4) "Test"
094- [1000]=>
095- string(4) "test"
096- [16777216]=>
097- float(-0.33333333333333)
098- }
099- Using SORT_STRING
100- array(8) {
101- [1000]=>
102- string(4) "test"
103- [1001]=>
104- string(6) "monkey"
105- [5]=>
106- string(4) "Test"
107- [17]=>
108- string(27) "PHP: Hypertext Preprocessor"
109- [0]=>
110- string(3) "PHP"
111- ["-1000"]=>
112- array(2) {
113- [0]=>
114- string(6) "banana"
115- [1]=>
116- string(6) "orange"
117- }
118- ["test"]=>
119- int(27)
120- [16777216]=>
121- float(-0.33333333333333)
122- }
123-
124- -- Testing asort() --
125- No second argument:
126- array(8) {
127- [16777216]=>
128- float(-0.33333333333333)
129- [0]=>
130- string(3) "PHP"
131- [17]=>
132- string(27) "PHP: Hypertext Preprocessor"
133- [5]=>
134- string(4) "Test"
135- [1001]=>
136- string(6) "monkey"
137- [1000]=>
138- string(4) "test"
139- ["test"]=>
140- int(27)
141- ["-1000"]=>
142- array(2) {
143- [0]=>
144- string(6) "banana"
145- [1]=>
146- string(6) "orange"
147- }
148- }
149- Using SORT_REGULAR:
150- array(8) {
151- [16777216]=>
152- float(-0.33333333333333)
153- [0]=>
154- string(3) "PHP"
155- [17]=>
156- string(27) "PHP: Hypertext Preprocessor"
157- [5]=>
158- string(4) "Test"
159- [1001]=>
160- string(6) "monkey"
161- [1000]=>
162- string(4) "test"
163- ["test"]=>
164- int(27)
165- ["-1000"]=>
166- array(2) {
167- [0]=>
168- string(6) "banana"
169- [1]=>
170- string(6) "orange"
171- }
172- }
173- Using SORT_NUMERIC:
174- array(8) {
175- [16777216]=>
176- float(-0.33333333333333)
177- [1001]=>
178- string(6) "monkey"
179- [1000]=>
180- string(4) "test"
181- [5]=>
182- string(4) "Test"
183- [17]=>
184- string(27) "PHP: Hypertext Preprocessor"
185- [0]=>
186- string(3) "PHP"
187- ["-1000"]=>
188- array(2) {
189- [0]=>
190- string(6) "banana"
191- [1]=>
192- string(6) "orange"
193- }
194- ["test"]=>
195- int(27)
196- }
197- Using SORT_STRING
198- array(8) {
199- [16777216]=>
200- float(-0.33333333333333)
201- ["test"]=>
202- int(27)
203- ["-1000"]=>
204- array(2) {
205- [0]=>
206- string(6) "banana"
207- [1]=>
208- string(6) "orange"
209- }
210- [0]=>
211- string(3) "PHP"
212- [17]=>
213- string(27) "PHP: Hypertext Preprocessor"
214- [5]=>
215- string(4) "Test"
216- [1001]=>
217- string(6) "monkey"
218- [1000]=>
219- string(4) "test"
220- }
221-
222- -- Testing krsort() --
223- No second argument:
224- array(8) {
225- [16777216]=>
226- float(-0.33333333333333)
227- [1001]=>
228- string(6) "monkey"
229- [1000]=>
230- string(4) "test"
231- [17]=>
232- string(27) "PHP: Hypertext Preprocessor"
233- [5]=>
234- string(4) "Test"
235- ["test"]=>
236- int(27)
237- [0]=>
238- string(3) "PHP"
239- ["-1000"]=>
240- array(2) {
241- [0]=>
242- string(6) "banana"
243- [1]=>
244- string(6) "orange"
245- }
246- }
247- Using SORT_REGULAR:
248- array(8) {
249- [16777216]=>
250- float(-0.33333333333333)
251- [1001]=>
252- string(6) "monkey"
253- [1000]=>
254- string(4) "test"
255- [17]=>
256- string(27) "PHP: Hypertext Preprocessor"
257- [5]=>
258- string(4) "Test"
259- [0]=>
260- string(3) "PHP"
261- ["test"]=>
262- int(27)
263- ["-1000"]=>
264- array(2) {
265- [0]=>
266- string(6) "banana"
267- [1]=>
268- string(6) "orange"
269- }
270- }
271- Using SORT_NUMERIC:
272- array(8) {
273- [16777216]=>
274- float(-0.33333333333333)
275- [1001]=>
276- string(6) "monkey"
277- [1000]=>
278- string(4) "test"
279- [17]=>
280- string(27) "PHP: Hypertext Preprocessor"
281- [5]=>
282- string(4) "Test"
283- ["test"]=>
284- int(27)
285- [0]=>
286- string(3) "PHP"
287- ["-1000"]=>
288- array(2) {
289- [0]=>
290- string(6) "banana"
291- [1]=>
292- string(6) "orange"
293- }
294- }
295- Using SORT_STRING
296- array(8) {
297- ["test"]=>
298- int(27)
299- [5]=>
300- string(4) "Test"
301- [17]=>
302- string(27) "PHP: Hypertext Preprocessor"
303- [16777216]=>
304- float(-0.33333333333333)
305- [1001]=>
306- string(6) "monkey"
307- [1000]=>
308- string(4) "test"
309- [0]=>
310- string(3) "PHP"
311- ["-1000"]=>
312- array(2) {
313- [0]=>
314- string(6) "banana"
315- [1]=>
316- string(6) "orange"
317- }
318- }
319-
320- -- Testing ksort() --
321- No second argument:
322- array(8) {
323- ["-1000"]=>
324- array(2) {
325- [0]=>
326- string(6) "banana"
327- [1]=>
328- string(6) "orange"
329- }
330- [0]=>
331- string(3) "PHP"
332- ["test"]=>
333- int(27)
334- [5]=>
335- string(4) "Test"
336- [17]=>
337- string(27) "PHP: Hypertext Preprocessor"
338- [1000]=>
339- string(4) "test"
340- [1001]=>
341- string(6) "monkey"
342- [16777216]=>
343- float(-0.33333333333333)
344- }
345- Using SORT_REGULAR:
346- array(8) {
347- ["-1000"]=>
348- array(2) {
349- [0]=>
350- string(6) "banana"
351- [1]=>
352- string(6) "orange"
353- }
354- ["test"]=>
355- int(27)
356- [0]=>
357- string(3) "PHP"
358- [5]=>
359- string(4) "Test"
360- [17]=>
361- string(27) "PHP: Hypertext Preprocessor"
362- [1000]=>
363- string(4) "test"
364- [1001]=>
365- string(6) "monkey"
366- [16777216]=>
367- float(-0.33333333333333)
368- }
369- Using SORT_NUMERIC:
370- array(8) {
371- ["-1000"]=>
372- array(2) {
373- [0]=>
374- string(6) "banana"
375- [1]=>
376- string(6) "orange"
377- }
378- [0]=>
379- string(3) "PHP"
380- ["test"]=>
381- int(27)
382- [5]=>
383- string(4) "Test"
384- [17]=>
385- string(27) "PHP: Hypertext Preprocessor"
386- [1000]=>
387- string(4) "test"
388- [1001]=>
389- string(6) "monkey"
390- [16777216]=>
391- float(-0.33333333333333)
392- }
393- Using SORT_STRING
394- array(8) {
395- ["-1000"]=>
396- array(2) {
397- [0]=>
398- string(6) "banana"
399- [1]=>
400- string(6) "orange"
401- }
402- [0]=>
403- string(3) "PHP"
404- [1000]=>
405- string(4) "test"
406- [1001]=>
407- string(6) "monkey"
408- [16777216]=>
409- float(-0.33333333333333)
410- [17]=>
411- string(27) "PHP: Hypertext Preprocessor"
412- [5]=>
413- string(4) "Test"
414- ["test"]=>
415- int(27)
416- }
417-
418- -- Testing rsort() --
419- No second argument:
420- array(8) {
421- [0]=>
422- array(2) {
423- [0]=>
424- string(6) "banana"
425- [1]=>
426- string(6) "orange"
427- }
428- [1]=>
429- int(27)
430- [2]=>
431- string(4) "test"
432- [3]=>
433- string(6) "monkey"
434- [4]=>
435- string(4) "Test"
436- [5]=>
437- string(27) "PHP: Hypertext Preprocessor"
438- [6]=>
439- string(3) "PHP"
440- [7]=>
441- float(-0.33333333333333)
442- }
443- Using SORT_REGULAR:
444- array(8) {
445- [0]=>
446- array(2) {
447- [0]=>
448- string(6) "banana"
449- [1]=>
450- string(6) "orange"
451- }
452- [1]=>
453- int(27)
454- [2]=>
455- string(4) "test"
456- [3]=>
457- string(6) "monkey"
458- [4]=>
459- string(4) "Test"
460- [5]=>
461- string(27) "PHP: Hypertext Preprocessor"
462- [6]=>
463- string(3) "PHP"
464- [7]=>
465- float(-0.33333333333333)
466- }
467- Using SORT_NUMERIC:
468- array(8) {
469- [0]=>
470- int(27)
471- [1]=>
472- array(2) {
473- [0]=>
474- string(6) "banana"
475- [1]=>
476- string(6) "orange"
477- }
478- [2]=>
479- string(3) "PHP"
480- [3]=>
481- string(27) "PHP: Hypertext Preprocessor"
482- [4]=>
483- string(6) "monkey"
484- [5]=>
485- string(4) "Test"
486- [6]=>
487- string(4) "test"
488- [7]=>
489- float(-0.33333333333333)
490- }
491- Using SORT_STRING
492- array(8) {
493- [0]=>
494- string(4) "test"
495- [1]=>
496- string(6) "monkey"
497- [2]=>
498- string(4) "Test"
499- [3]=>
500- string(27) "PHP: Hypertext Preprocessor"
501- [4]=>
502- string(3) "PHP"
503- [5]=>
504- array(2) {
505- [0]=>
506- string(6) "banana"
507- [1]=>
508- string(6) "orange"
509- }
510- [6]=>
511- int(27)
512- [7]=>
513- float(-0.33333333333333)
514- }
515-
516- -- Testing sort() --
517- No second argument:
518- array(8) {
519- [0]=>
520- float(-0.33333333333333)
521- [1]=>
522- string(3) "PHP"
523- [2]=>
524- string(27) "PHP: Hypertext Preprocessor"
525- [3]=>
526- string(4) "Test"
527- [4]=>
528- string(6) "monkey"
529- [5]=>
530- string(4) "test"
531- [6]=>
532- int(27)
533- [7]=>
534- array(2) {
535- [0]=>
536- string(6) "banana"
537- [1]=>
538- string(6) "orange"
539- }
540- }
541- Using SORT_REGULAR:
542- array(8) {
543- [0]=>
544- float(-0.33333333333333)
545- [1]=>
546- string(3) "PHP"
547- [2]=>
548- string(27) "PHP: Hypertext Preprocessor"
549- [3]=>
550- string(4) "Test"
551- [4]=>
552- string(6) "monkey"
553- [5]=>
554- string(4) "test"
555- [6]=>
556- int(27)
557- [7]=>
558- array(2) {
559- [0]=>
560- string(6) "banana"
561- [1]=>
562- string(6) "orange"
563- }
564- }
565- Using SORT_NUMERIC:
566- array(8) {
567- [0]=>
568- float(-0.33333333333333)
569- [1]=>
570- string(6) "monkey"
571- [2]=>
572- string(4) "test"
573- [3]=>
574- string(4) "Test"
575- [4]=>
576- string(27) "PHP: Hypertext Preprocessor"
577- [5]=>
578- string(3) "PHP"
579- [6]=>
580- array(2) {
581- [0]=>
582- string(6) "banana"
583- [1]=>
584- string(6) "orange"
585- }
586- [7]=>
587- int(27)
588- }
589- Using SORT_STRING
590- array(8) {
591- [0]=>
592- float(-0.33333333333333)
593- [1]=>
594- int(27)
595- [2]=>
596- array(2) {
597- [0]=>
598- string(6) "banana"
599- [1]=>
600- string(6) "orange"
601- }
602- [3]=>
603- string(3) "PHP"
604- [4]=>
605- string(27) "PHP: Hypertext Preprocessor"
606- [5]=>
607- string(4) "Test"
608- [6]=>
609- string(6) "monkey"
610- [7]=>
611- string(4) "test"
612- }
================================================================================
================================================================================
/usr/local/php/php-4.3.0RC3/ext/standard/tests/array/003.phpt
================================================================================
---- EXPECTED OUTPUT
-- Testing uasort() --
array(8) {
[16777216]=>
float(-0.33333333333333)
["-1000"]=>
array(2) {
[0]=>
string(6) "banana"
[1]=>
string(6) "orange"
}
["test"]=>
int(27)
[0]=>
string(3) "PHP"
[17]=>
string(27) "PHP: Hypertext Preprocessor"
[5]=>
string(4) "Test"
[1001]=>
string(6) "monkey"
[1000]=>
string(4) "test"
}
-- Testing uksort() --
array(8) {
["-1000"]=>
array(2) {
[0]=>
string(6) "banana"
[1]=>
string(6) "orange"
}
[0]=>
string(3) "PHP"
[1000]=>
string(4) "test"
[1001]=>
string(6) "monkey"
[16777216]=>
float(-0.33333333333333)
[17]=>
string(27) "PHP: Hypertext Preprocessor"
[5]=>
string(4) "Test"
["test"]=>
int(27)
}
-- Testing usort() --
array(8) {
[0]=>
float(-0.33333333333333)
[1]=>
array(2) {
[0]=>
string(6) "banana"
[1]=>
string(6) "orange"
}
[2]=>
int(27)
[3]=>
string(3) "PHP"
[4]=>
string(27) "PHP: Hypertext Preprocessor"
[5]=>
string(4) "Test"
[6]=>
string(6) "monkey"
[7]=>
string(4) "test"
}
---- ACTUAL OUTPUT
Warning: main(ext/standard/tests/array/data.inc) [/phpmanual/function.main.html]: failed to create
stream: No such file or directory in /usr/local/php/php-4.3.0RC3/ext/standard/tests/array/003.php on
line 2
Fatal error: main() [/phpmanual/function.main.html]: Failed opening required
'ext/standard/tests/array/data.inc'
(include_path='/Library/WebServer/Documents/scripts') in
/usr/local/php/php-4.3.0RC3/ext/standard/tests/array/003.php on line 2
---- FAILED
================================================================================
001- -- Testing uasort() --
001+ Warning: main(ext/standard/tests/array/data.inc) [/phpmanual/function.main.html]: failed to
create stream: No such file or directory in
/usr/local/php/php-4.3.0RC3/ext/standard/tests/array/003.php on line 2
002- array(8) {
002+
003- [16777216]=>
003+ Fatal error: main() [/phpmanual/function.main.html]: Failed opening required
'ext/standard/tests/array/data.inc'
(include_path='/Library/WebServer/Documents/scripts') in
/usr/local/php/php-4.3.0RC3/ext/standard/tests/array/003.php on line 2
004- float(-0.33333333333333)
005- ["-1000"]=>
006- array(2) {
007- [0]=>
008- string(6) "banana"
009- [1]=>
010- string(6) "orange"
011- }
012- ["test"]=>
013- int(27)
014- [0]=>
015- string(3) "PHP"
016- [17]=>
017- string(27) "PHP: Hypertext Preprocessor"
018- [5]=>
019- string(4) "Test"
020- [1001]=>
021- string(6) "monkey"
022- [1000]=>
023- string(4) "test"
024- }
025-
026- -- Testing uksort() --
027- array(8) {
028- ["-1000"]=>
029- array(2) {
030- [0]=>
031- string(6) "banana"
032- [1]=>
033- string(6) "orange"
034- }
035- [0]=>
036- string(3) "PHP"
037- [1000]=>
038- string(4) "test"
039- [1001]=>
040- string(6) "monkey"
041- [16777216]=>
042- float(-0.33333333333333)
043- [17]=>
044- string(27) "PHP: Hypertext Preprocessor"
045- [5]=>
046- string(4) "Test"
047- ["test"]=>
048- int(27)
049- }
050-
051- -- Testing usort() --
052- array(8) {
053- [0]=>
054- float(-0.33333333333333)
055- [1]=>
056- array(2) {
057- [0]=>
058- string(6) "banana"
059- [1]=>
060- string(6) "orange"
061- }
062- [2]=>
063- int(27)
064- [3]=>
065- string(3) "PHP"
066- [4]=>
067- string(27) "PHP: Hypertext Preprocessor"
068- [5]=>
069- string(4) "Test"
070- [6]=>
071- string(6) "monkey"
072- [7]=>
073- string(4) "test"
074- }
================================================================================
================================================================================
/usr/local/php/php-4.3.0RC3/ext/standard/tests/array/array_search.phpt
================================================================================
---- EXPECTED OUTPUT
OK
---- ACTUAL OUTPUT
Warning: main(tests/quicktester.inc) [/phpmanual/function.main.html]: failed to create stream: No
such file or directory in /usr/local/php/php-4.3.0RC3/ext/standard/tests/array/array_search.php on
line 17
Warning: main() [/phpmanual/function.main.html]: Failed opening 'tests/quicktester.inc'
for inclusion (include_path='/Library/WebServer/Documents/scripts') in
/usr/local/php/php-4.3.0RC3/ext/standard/tests/array/array_search.php on line 17
---- FAILED
================================================================================
001- OK
001+ Warning: main(tests/quicktester.inc) [/phpmanual/function.main.html]: failed to create stream:
No such file or directory in /usr/local/php/php-4.3.0RC3/ext/standard/tests/array/array_search.php
on line 17
002+
003+ Warning: main() [/phpmanual/function.main.html]: Failed opening
'tests/quicktester.inc' for inclusion
(include_path='/Library/WebServer/Documents/scripts') in
/usr/local/php/php-4.3.0RC3/ext/standard/tests/array/array_search.php on line 17
================================================================================
================================================================================
/usr/local/php/php-4.3.0RC3/ext/standard/tests/file/001.phpt
================================================================================
---- EXPECTED OUTPUT
test.file does not exist
test.file exists
test.link exists
test.file is not a symlink
test.link is a symlink
test.file exists
test.link lstat and stat differ at element 1
test.link lstat and stat differ at element 2
test.link lstat and stat differ at element 7
test.link lstat and stat differ at element 8
test.link lstat and stat differ at element 9
test.link lstat and stat differ at element 10
test.file is file
test.link is link
test.file permissions are 0744
test.file size is 0
test.file is writeable
test.file is readable
test.file is executable
test.file is a regular file
test.link is a regular file
test.link is not a directory
../file is a directory
test.file is not a directory
test.file does not exist
test.file does not exist
---- ACTUAL OUTPUT
test.file does not exist
test.file exists
test.link exists
test.file is not a symlink
test.link is a symlink
test.file exists
test.link lstat and stat differ at element 1
test.link lstat and stat differ at element 2
test.link lstat and stat differ at element 4
test.link lstat and stat differ at element 7
test.link lstat and stat differ at element 8
test.link lstat and stat differ at element 9
test.file is file
test.link is link
test.file permissions are 0744
test.file size is 0
test.file is writeable
test.file is readable
test.file is executable
test.file is a regular file
test.link is a regular file
test.link is not a directory
../file is a directory
test.file is not a directory
test.file does not exist
test.file does not exist
---- FAILED
================================================================================
009- test.link lstat and stat differ at element 7
009+ test.link lstat and stat differ at element 4
010- test.link lstat and stat differ at element 8
010+ test.link lstat and stat differ at element 7
011- test.link lstat and stat differ at element 9
011+ test.link lstat and stat differ at element 8
012- test.link lstat and stat differ at element 10
012+ test.link lstat and stat differ at element 9
================================================================================
================================================================================
/usr/local/php/php-4.3.0RC3/ext/standard/tests/general_functions/getopt.phpt
================================================================================
---- EXPECTED OUTPUT
array(5) {
["v"]=>
bool(false)
["h"]=>
bool(false)
["d"]=>
string(4) "test"
["m"]=>
string(4) "1234"
["t"]=>
bool(false)
}
---- ACTUAL OUTPUT
array(0) {
}
---- FAILED
================================================================================
001- array(5) {
001+ array(0) {
002- ["v"]=>
002+ }
003- bool(false)
004- ["h"]=>
005- bool(false)
006- ["d"]=>
007- string(4) "test"
008- ["m"]=>
009- string(4) "1234"
010- ["t"]=>
011- bool(false)
012- }
================================================================================
================================================================================
/usr/local/php/php-4.3.0RC3/ext/standard/tests/math/abs.phpt
================================================================================
---- EXPECTED OUTPUT
1,1,0,0
OK
---- ACTUAL OUTPUT
1,1,0,0
Warning: main(tests/quicktester.inc) [/phpmanual/function.main.html]: failed to create stream: No
such file or directory in /usr/local/php/php-4.3.0RC3/ext/standard/tests/math/abs.php on line 18
Warning: main() [/phpmanual/function.main.html]: Failed opening 'tests/quicktester.inc'
for inclusion (include_path='/Library/WebServer/Documents/scripts') in
/usr/local/php/php-4.3.0RC3/ext/standard/tests/math/abs.php on line 18
---- FAILED
================================================================================
002- OK
002+
003+ Warning: main(tests/quicktester.inc) [/phpmanual/function.main.html]: failed to create stream:
No such file or directory in /usr/local/php/php-4.3.0RC3/ext/standard/tests/math/abs.php on line 18
004+
005+ Warning: main() [/phpmanual/function.main.html]: Failed opening
'tests/quicktester.inc' for inclusion
(include_path='/Library/WebServer/Documents/scripts') in
/usr/local/php/php-4.3.0RC3/ext/standard/tests/math/abs.php on line 18
================================================================================
================================================================================
/usr/local/php/php-4.3.0RC3/ext/standard/tests/math/pow.phpt
================================================================================
---- EXPECTED OUTPUT
1,1,0,0
On failure, please mail result to php-dev@lists.php.net
OK
---- ACTUAL OUTPUT
1,1,0,0
On failure, please mail result to php-dev@lists.php.net
Warning: main(tests/quicktester.inc) [/phpmanual/function.main.html]: failed to create stream: No
such file or directory in /usr/local/php/php-4.3.0RC3/ext/standard/tests/math/pow.php on line 141
Warning: main() [/phpmanual/function.main.html]: Failed opening 'tests/quicktester.inc'
for inclusion (include_path='/Library/WebServer/Documents/scripts') in
/usr/local/php/php-4.3.0RC3/ext/standard/tests/math/pow.php on line 141
---- FAILED
================================================================================
003- OK
003+
004+ Warning: main(tests/quicktester.inc) [/phpmanual/function.main.html]: failed to create stream:
No such file or directory in /usr/local/php/php-4.3.0RC3/ext/standard/tests/math/pow.php on line 141
005+
006+ Warning: main() [/phpmanual/function.main.html]: Failed opening
'tests/quicktester.inc' for inclusion
(include_path='/Library/WebServer/Documents/scripts') in
/usr/local/php/php-4.3.0RC3/ext/standard/tests/math/pow.php on line 141
================================================================================
================================================================================
/usr/local/php/php-4.3.0RC3/ext/standard/tests/math/round.phpt
================================================================================
---- EXPECTED OUTPUT
1,1,0,0
OK
---- ACTUAL OUTPUT
1,1,0,0
Warning: main(tests/quicktester.inc) [/phpmanual/function.main.html]: failed to create stream: No
such file or directory in /usr/local/php/php-4.3.0RC3/ext/standard/tests/math/round.php on line 31
Warning: main() [/phpmanual/function.main.html]: Failed opening 'tests/quicktester.inc'
for inclusion (include_path='/Library/WebServer/Documents/scripts') in
/usr/local/php/php-4.3.0RC3/ext/standard/tests/math/round.php on line 31
---- FAILED
================================================================================
002- OK
002+
003+ Warning: main(tests/quicktester.inc) [/phpmanual/function.main.html]: failed to create stream:
No such file or directory in /usr/local/php/php-4.3.0RC3/ext/standard/tests/math/round.php on line
31
004+
005+ Warning: main() [/phpmanual/function.main.html]: Failed opening
'tests/quicktester.inc' for inclusion
(include_path='/Library/WebServer/Documents/scripts') in
/usr/local/php/php-4.3.0RC3/ext/standard/tests/math/round.php on line 31
================================================================================
================================================================================
/usr/local/php/php-4.3.0RC3/ext/standard/tests/strings/trim.phpt
================================================================================
---- EXPECTED OUTPUT
OK
---- ACTUAL OUTPUT
Warning: main(tests/quicktester.inc) [/phpmanual/function.main.html]: failed to create stream: No
such file or directory in /usr/local/php/php-4.3.0RC3/ext/standard/tests/strings/trim.php on line 21
Warning: main() [/phpmanual/function.main.html]: Failed opening 'tests/quicktester.inc'
for inclusion (include_path='/Library/WebServer/Documents/scripts') in
/usr/local/php/php-4.3.0RC3/ext/standard/tests/strings/trim.php on line 21
---- FAILED
================================================================================
001- OK
001+ Warning: main(tests/quicktester.inc) [/phpmanual/function.main.html]: failed to create stream:
No such file or directory in /usr/local/php/php-4.3.0RC3/ext/standard/tests/strings/trim.php on line
21
002+
003+ Warning: main() [/phpmanual/function.main.html]: Failed opening
'tests/quicktester.inc' for inclusion
(include_path='/Library/WebServer/Documents/scripts') in
/usr/local/php/php-4.3.0RC3/ext/standard/tests/strings/trim.php on line 21
================================================================================
================================================================================
/usr/local/php/php-4.3.0RC3/ext/standard/tests/strings/wordwrap.phpt
================================================================================
---- EXPECTED OUTPUT
OK
---- ACTUAL OUTPUT
Warning: main(tests/quicktester.inc) [/phpmanual/function.main.html]: failed to create stream: No
such file or directory in /usr/local/php/php-4.3.0RC3/ext/standard/tests/strings/wordwrap.php on
line 29
Warning: main() [/phpmanual/function.main.html]: Failed opening 'tests/quicktester.inc'
for inclusion (include_path='/Library/WebServer/Documents/scripts') in
/usr/local/php/php-4.3.0RC3/ext/standard/tests/strings/wordwrap.php on line 29
---- FAILED
================================================================================
001- OK
001+ Warning: main(tests/quicktester.inc) [/phpmanual/function.main.html]: failed to create stream:
No such file or directory in /usr/local/php/php-4.3.0RC3/ext/standard/tests/strings/wordwrap.php on
line 29
002+
003+ Warning: main() [/phpmanual/function.main.html]: Failed opening
'tests/quicktester.inc' for inclusion
(include_path='/Library/WebServer/Documents/scripts') in
/usr/local/php/php-4.3.0RC3/ext/standard/tests/strings/wordwrap.php on line 29
================================================================================
================================================================================
BUILD ENVIRONMENT
================================================================================
OS:
Darwin
Automake:
automake (GNU automake) 1.6.1
Written by Tom Tromey <tromey@redhat.com>.
Copyright 2002 Free Software Foundation, Inc.
This is free software; see the source for copying conditions. There is NO
warranty; not even for MERCHANTABILITY or FITNESS FOR A PARTICULAR PURPOSE.
Autoconf:
autoconf (GNU Autoconf) 2.52
Written by David J. MacKenzie.
Copyright 1992, 1993, 1994, 1996, 1999, 2000, 2001
Free Software Foundation, Inc.
This is free software; see the source for copying conditions. There is NO
warranty; not even for MERCHANTABILITY or FITNESS FOR A PARTICULAR PURPOSE.
Libtool:
Compiler:
Reading specs from /usr/libexec/gcc/darwin/ppc/3.1/specs
Thread model: posix
Apple Computer, Inc. GCC version 1151, based on gcc version 3.1 20020420 (prerelease)
Bison:
GNU Bison version 1.28
User's E-mail: yes
================================================================================
PHPINFO
================================================================================
phpinfo()
PHP Version => 4.3.0RC3
System => Darwin Macintosh 6.2 Darwin Kernel Version 6.2: Tue Nov 5 22:00:03 PST 2002;
root:xnu/xnu-344.12.2.obj~1/RELEASE_PPC Power Macintosh
Build Date => Dec 11 2002 20:00:50
Configure Command => './configure' '--with-gd'
'--with-png-dir=/usr/local' '--with-zlib-dir=/usr'
'--with-jpeg-dir=/usr/local' '--with-apxs' '--with-mysql'
'--enable-mbstring' '--disable-short-tags' '--enable-exif'
Server API => Command Line Interface
Virtual Directory Support => disabled
Configuration File (php.ini) Path => /usr/local/lib/php.ini
PHP API => 20020918
PHP Extension => 20020429
Zend Extension => 20021010
Debug Build => no
Thread Safety => disabled
Registered PHP Streams => php, http, ftp, compress.zlib
This program makes use of the Zend Scripting Language Engine:
Zend Engine v1.3.0, Copyright (c) 1998-2002 Zend Technologies
_______________________________________________________________________
Configuration
PHP Core
Directive => Local Value => Master Value
allow_call_time_pass_reference => Off => Off
allow_url_fopen => On => On
always_populate_raw_post_data => Off => Off
arg_separator.input => & => &
arg_separator.output => & => &
asp_tags => Off => Off
auto_append_file => no value => no value
auto_prepend_file => no value => no value
browscap => no value => no value
default_charset => no value => no value
default_mimetype => text/html => text/html
define_syslog_variables => Off => Off
disable_functions => no value => no value
display_errors => Off => Off
display_startup_errors => Off => Off
doc_root => /Library/WebServer/Documents => /Library/WebServer/Documents
docref_ext => no value => no value
docref_root => http://www.php.net/ => http://www.php.net/
enable_dl => On => On
error_append_string => no value => no value
error_log => /var/log/httpd/php-errors.txt => /var/log/httpd/php-errors.txt
error_prepend_string => no value => no value
error_reporting => 2039 => 2039
expose_php => On => On
extension_dir => ./ => ./
file_uploads => On => On
gpc_order => GPC => GPC
highlight.bg => #FFFFFF => #FFFFFF
highlight.comment => #FF8000 => #FF8000
highlight.default => #0000BB => #0000BB
highlight.html => #000000 => #000000
highlight.keyword => #007700 => #007700
highlight.string => #DD0000 => #DD0000
html_errors => Off => On
ignore_repeated_errors => Off => Off
ignore_repeated_source => Off => Off
ignore_user_abort => Off => Off
implicit_flush => On => Off
include_path => /Library/WebServer/Documents/scripts => /Library/WebServer/Documents/scripts
log_errors => On => On
log_errors_max_len => 1024 => 1024
magic_quotes_gpc => Off => Off
magic_quotes_runtime => Off => Off
magic_quotes_sybase => Off => Off
max_execution_time => 0 => 600000
max_input_time => -1 => -1
open_basedir => no value => no value
output_buffering => no value => no value
output_handler => no value => no value
post_max_size => 8M => 8M
precision => 14 => 14
register_argc_argv => On => Off
register_globals => Off => Off
report_memleaks => On => On
safe_mode => Off => Off
safe_mode_exec_dir => no value => no value
safe_mode_gid => Off => Off
safe_mode_include_dir => no value => no value
sendmail_from => me@localhost.com => me@localhost.com
sendmail_path => /usr/sbin/sendmail -t -i => /usr/sbin/sendmail -t -i
short_open_tag => Off => Off
SMTP => localhost => localhost
smtp_port => 25 => 25
sql.safe_mode => Off => Off
track_errors => Off => Off
unserialize_callback_func => no value => no value
upload_max_filesize => 4M => 4M
upload_tmp_dir => no value => no value
user_dir => no value => no value
variables_order => GPCS => GPCS
xmlrpc_error_number => 0 => 0
xmlrpc_errors => Off => Off
y2k_compliance => Off => Off
ctype
ctype functions => enabled
exif
EXIF Support => enabled
EXIF Version => 1.4 $Id: exif.c,v 1.118.2.6 2002/12/10 18:01:33 iliaa Exp $
Supported EXIF Version => 0220
Supported filetypes => JPEG,TIFF
gd
GD Support => enabled
GD Version => bundled (2.0 compatible)
GIF Read Support => enabled
JPG Support => enabled
PNG Support => enabled
WBMP Support => enabled
mbstring
Multibyte Support => enabled
Japanese support => enabled
Directive => Local Value => Master Value
mbstring.detect_order => no value => no value
mbstring.encoding_translation => Off => Off
mbstring.func_overload => 0 => 0
mbstring.http_input => pass => pass
mbstring.http_output => pass => pass
mbstring.internal_encoding => none => none
mbstring.language => neutral => neutral
mbstring.substitute_character => no value => no value
mysql
MySQL Support => enabled
Active Persistent Links => 0
Active Links => 0
Client API version => 3.23.49
MYSQL_MODULE_TYPE => builtin
MYSQL_SOCKET => /Private/tmp/mysql.sock
MYSQL_INCLUDE => MYSQL_LIBS =>
Directive => Local Value => Master Value
mysql.allow_persistent => On => On
mysql.connect_timeout => -1 => -1
mysql.default_host => no value => no value
mysql.default_password => no value => no value
mysql.default_port => no value => no value
mysql.default_socket => no value => no value
mysql.default_user => no value => no value
mysql.max_links => Unlimited => Unlimited
mysql.max_persistent => Unlimited => Unlimited
mysql.trace_mode => Off => Off
overload
User-Space Object Overloading Support => enabled
pcre
PCRE (Perl Compatible Regular Expressions) Support => enabled
PCRE Library Version => 3.92 11-Sep-2002
posix
Revision => $Revision: 1.51 $
session
Session Support => enabled
Registered save handlers => files user
Directive => Local Value => Master Value
session.auto_start => Off => Off
session.bug_compat_42 => On => On
session.bug_compat_warn => On => On
session.cache_expire => 180 => 180
session.cache_limiter => nocache => nocache
session.cookie_domain => no value => no value
session.cookie_lifetime => 0 => 0
session.cookie_path => / => /
session.cookie_secure => Off => Off
session.entropy_file => no value => no value
session.entropy_length => 0 => 0
session.gc_dividend => 100 => 100
session.gc_maxlifetime => 1440 => 1440
session.gc_probability => 1 => 1
session.name => PHPSESSID => PHPSESSID
session.referer_check => no value => no value
session.save_handler => files => files
session.save_path => /tmp => /tmp
session.serialize_handler => php => php
session.use_cookies => On => On
session.use_only_cookies => Off => Off
session.use_trans_sid => On => On
standard
Regex Library => Bundled library enabled
Dynamic Library Support => enabled
Path to sendmail => /usr/sbin/sendmail -t -i
Directive => Local Value => Master Value
assert.active => 1 => 1
assert.bail => 0 => 0
assert.callback => no value => no value
assert.quiet_eval => 0 => 0
assert.warning => 1 => 1
auto_detect_line_endings => 0 => 0
default_socket_timeout => 60 => 60
safe_mode_allowed_env_vars => PHP_ => PHP_
safe_mode_protected_env_vars => LD_LIBRARY_PATH => LD_LIBRARY_PATH
url_rewriter.tags => a=href,area=href,frame=src,input=src,form=fakeentry =>
a=href,area=href,frame=src,input=src,form=fakeentry
user_agent => no value => no value
tokenizer
Tokenizer Support => enabled
xml
XML Support => active
XML Namespace Support => active
EXPAT Version => 1.95.2
zlib
ZLib Support => enabled
Compiled Version => 1.1.3
Linked Version => 1.1.3
Directive => Local Value => Master Value
zlib.output_compression => Off => Off
zlib.output_compression_level => -1 => -1
zlib.output_handler => no value => no value
Additional Modules
Module Name
Environment
Variable => Value
PWD => /usr/local/php/php-4.3.0RC3
MAKEFLAGS => VENDOR => apple
MFLAGS => REDIRECT_STATUS => TEST_PHP_EXECUTABLE =>
/usr/local/php/php-4.3.0RC3/sapi/cli/php
CC => gcc
SUDO_GID => 20
USER => root
MACHTYPE => powerpc
SCRIPT_FILENAME => MAIL => /var/mail/sage
PATH_TRANSLATED => SUDO_UID => 501
QUERY_STRING => CONTENT_LENGTH => HOST => Macintosh
MAKELEVEL => 1
SSH_CLIENT => 67.38.163.153 61009 22
SHLVL => 4
LOGNAME => root
GROUP => staff
_ => /usr/local/php/php-4.3.0RC3/sapi/cli/php
SUDO_COMMAND => /bin/tcsh
REQUEST_METHOD => SHELL => /bin/sh
HOSTTYPE => macintosh
TEST_PHP_SRCDIR => /usr/local/php/php-4.3.0RC3
OSTYPE => darwin
TERM => vt100
HOME => /Users/sage
PATH => /bin:/sbin:/usr/bin:/usr/sbin
SUDO_USER => sage
SSH_TTY => /dev/ttyp1
CONTENT_TYPE =>
PHP Variables
Variable => Value
_SERVER["PWD"] => /usr/local/php/php-4.3.0RC3
_SERVER["MAKEFLAGS"] =>
_SERVER["VENDOR"] => apple
_SERVER["MFLAGS"] =>
_SERVER["REDIRECT_STATUS"] =>
_SERVER["TEST_PHP_EXECUTABLE"] => /usr/local/php/php-4.3.0RC3/sapi/cli/php
_SERVER["CC"] => gcc
_SERVER["SUDO_GID"] => 20
_SERVER["USER"] => root
_SERVER["MACHTYPE"] => powerpc
_SERVER["SCRIPT_FILENAME"] =>
_SERVER["MAIL"] => /var/mail/sage
_SERVER["PATH_TRANSLATED"] =>
_SERVER["SUDO_UID"] => 501
_SERVER["QUERY_STRING"] =>
_SERVER["CONTENT_LENGTH"] =>
_SERVER["HOST"] => Macintosh
_SERVER["MAKELEVEL"] => 1
_SERVER["SSH_CLIENT"] => 67.38.163.153 61009 22
_SERVER["SHLVL"] => 4
_SERVER["LOGNAME"] => root
_SERVER["GROUP"] => staff
_SERVER["_"] => /usr/local/php/php-4.3.0RC3/sapi/cli/php
_SERVER["SUDO_COMMAND"] => /bin/tcsh
_SERVER["REQUEST_METHOD"] =>
_SERVER["SHELL"] => /bin/sh
_SERVER["HOSTTYPE"] => macintosh
_SERVER["TEST_PHP_SRCDIR"] => /usr/local/php/php-4.3.0RC3
_SERVER["OSTYPE"] => darwin
_SERVER["TERM"] => vt100
_SERVER["HOME"] => /Users/sage
_SERVER["PATH"] => /bin:/sbin:/usr/bin:/usr/sbin
_SERVER["SUDO_USER"] => sage
_SERVER["SSH_TTY"] => /dev/ttyp1
_SERVER["CONTENT_TYPE"] =>
_SERVER["PHP_SELF"] =>
_SERVER["SCRIPT_NAME"] =>
_SERVER["DOCUMENT_ROOT"] =>
_SERVER["argv"] => Array
(
)
_SERVER["argc"] => 0
PHP License
This program is free software; you can redistribute it and/or modify
it under the terms of the PHP License as published by the PHP Group
and included in the distribution in the file: LICENSE
This program is distributed in the hope that it will be useful,
but WITHOUT ANY WARRANTY; without even the implied warranty of
MERCHANTABILITY or FITNESS FOR A PARTICULAR PURPOSE.
If you did not receive a copy of the PHP license, or have any
questions about PHP licensing, please contact license@php.net.