Test results
| From: | noreply@php.net | Date: | Thu, 12 Dec 2002 04:00:35 +0000 |
| Subject: | Test results | ||
| Groups: | php.qa | ||
| Request: | Send a blank email to php-qa+get-7191@lists.php.net to get a copy of this message | ||
=====================================================================
FAILED TEST SUMMARY
---------------------------------------------------------------------
Locale settings affecting float parsing [tests/lang/034.phpt]
String functions [tests/strings/001.phpt]
Bug #20087 (Assertion failure) [ext/mbstring/tests/bug20087.phpt]
mb_strtoupper() / mb_strtolower() [ext/mbstring/tests/casefold.phpt]
mb_convert_encoding() [ext/mbstring/tests/mb_convert_encoding.phpt]
mb_convert_variables() [ext/mbstring/tests/mb_convert_variables.phpt]
mb_detect_encoding() [ext/mbstring/tests/mb_detect_encoding.phpt]
mb_detect_order() [ext/mbstring/tests/mb_detect_order.phpt]
mb_ereg() [ext/mbstring/tests/mb_ereg.phpt]
mb_http_output() [ext/mbstring/tests/mb_http_output.phpt]
mb_internal_encoding() [ext/mbstring/tests/mb_internal_encoding.phpt]
mb_preferred_mime_name() [ext/mbstring/tests/mb_preferred_mime_name.phpt]
mb_send_mail() test 4 (lang=German) [ext/mbstring/tests/mb_send_mail04.phpt]
mb_split() [ext/mbstring/tests/mb_split.phpt]
mb_strcut() [ext/mbstring/tests/mb_strcut.phpt]
mb_strimwidth() [ext/mbstring/tests/mb_strimwidth.phpt]
mb_strlen() [ext/mbstring/tests/mb_strlen.phpt]
mb_strpos() [ext/mbstring/tests/mb_strpos.phpt]
mb_strwidth() [ext/mbstring/tests/mb_strwidth.phpt]
mb_substitute_character() [ext/mbstring/tests/mb_substitute_character.phpt]
mb_substr() [ext/mbstring/tests/mb_substr.phpt]
File type functions [ext/standard/tests/file/001.phpt]
getopt [ext/standard/tests/general_functions/getopt.phpt]
htmlentities() test 1 (cp1252) [ext/standard/tests/strings/htmlentities01.phpt]
htmlentities() test 2 (setlocale / fr_FR.ISO-8859-15)
[ext/standard/tests/strings/htmlentities02.phpt]
htmlentities() test 3 (setlocale / de_DE.ISO-8859-1)
[ext/standard/tests/strings/htmlentities03.phpt]
htmlentities() test 5 (mbstring / cp1252) [ext/standard/tests/strings/htmlentities05.phpt]
htmlentities() test 6 (mbstring / ISO-8859-15) [ext/standard/tests/strings/htmlentities06.phpt]
htmlentities() test 7 (mbstring / ISO-8859-1) [ext/standard/tests/strings/htmlentities07.phpt]
htmlentities() test 8 (mbstring / EUC-JP) [ext/standard/tests/strings/htmlentities08.phpt]
htmlentities() test 10 (default_charset / cp1252) [ext/standard/tests/strings/htmlentities10.phpt]
htmlentities() test 11 (default_charset / ISO-8859-15)
[ext/standard/tests/strings/htmlentities11.phpt]
htmlentities() test 12 (default_charset / ISO-8859-1)
[ext/standard/tests/strings/htmlentities12.phpt]
htmlentities() test 13 (default_charset / EUC-JP) [ext/standard/tests/strings/htmlentities13.phpt]
Test strtoupper on non-ASCII characters [ext/standard/tests/strings/strtoupper.phpt]
trim(), rtrim() and ltrim() functions [ext/standard/tests/strings/trim.phpt]
UTF-8<->ISO Latin 1 encoding/decoding test [ext/xml/tests/xml006.phpt]
=====================================================================
================================================================================
/Users/kazu/src/php-4.3.0RC3/tests/lang/034.phpt
================================================================================
---- EXPECTED OUTPUT
3,14
---- ACTUAL OUTPUT
3.14
---- FAILED
================================================================================
001- 3,14
001+ 3.14
================================================================================
================================================================================
/Users/kazu/src/php-4.3.0RC3/tests/strings/001.phpt
================================================================================
---- EXPECTED OUTPUT
Testing strtok: passed
Testing strstr: passed
Testing strrchr: passed
Testing strtoupper: passed
Testing strtolower: passed
Testing substr: passed
Testing rawurlencode: passed
Testing rawurldecode: passed
Testing urlencode: passed
Testing urldecode: passed
Testing quotemeta: passed
Testing ufirst: passed
Testing strtr: passed
Testing addslashes: passed
Testing stripslashes: passed
Testing uniqid: passed
---- ACTUAL OUTPUT
Testing strtok: passed
Testing strstr: passed
Testing strrchr: passed
Testing strtoupper: passed
Testing strtolower: passed
Testing substr: passed
Testing rawurlencode: failed!
Testing rawurldecode: failed!
Testing urlencode: failed!
Testing urldecode: failed!
Testing quotemeta: passed
Testing ufirst: passed
Testing strtr: passed
Testing addslashes: passed
Testing stripslashes: passed
Testing uniqid: passed
---- FAILED
================================================================================
007- Testing rawurlencode: passed
007+ Testing rawurlencode: failed!
008- Testing rawurldecode: passed
008+ Testing rawurldecode: failed!
009- Testing urlencode: passed
009+ Testing urlencode: failed!
010- Testing urldecode: passed
010+ Testing urldecode: failed!
================================================================================
================================================================================
/Users/kazu/src/php-4.3.0RC3/ext/mbstring/tests/bug20087.phpt
================================================================================
---- EXPECTED OUTPUT
bool(true)
string(0) ""
bool(true)
string(3) "moo"
---- ACTUAL OUTPUT
Parse error: parse error, expecting `')'' in
/Users/kazu/src/php-4.3.0RC3/ext/mbstring/tests/common.inc on line 38
bool(true)
string(0) ""
bool(true)
string(3) "moo"
---- FAILED
================================================================================
001- bool(true)
001+ Parse error: parse error, expecting `')'' in
/Users/kazu/src/php-4.3.0RC3/ext/mbstring/tests/common.inc on line 38
002- string(0) ""
002+ bool(true)
003- bool(true)
003+ string(0) ""
004- string(3) "moo"
004+ bool(true)
005+ string(3) "moo"
================================================================================
================================================================================
/Users/kazu/src/php-4.3.0RC3/ext/mbstring/tests/casefold.phpt
================================================================================
---- EXPECTED OUTPUT
abcdefghijklmnopqrstuvwxyz
ABCDEFGHIJKLMNOPQRSTUVWXYZ
ÄËÏ
Äëï
---- ACTUAL OUTPUT
abcdefghijklmnopqrstuvwxyz
ABCDEFGHIJKLMNOPQRSTUVWXYZ
ÄËÏ\NÄëï\N
---- FAILED
================================================================================
003- ÄËÏ
003+ ÄËÏ\NÄëï\N
004- Äëï
================================================================================
================================================================================
/Users/kazu/src/php-4.3.0RC3/ext/mbstring/tests/mb_convert_encoding.phpt
================================================================================
---- EXPECTED OUTPUT
== BASIC TEST ==
EUC-JP: ÆüËÜ¸ì¥Æ¥¥¹¥È¤Ç¤¹¡£01234£µ£¶£·£¸£¹¡£
EUC-JP: ÆüËÜ¸ì¥Æ¥¥¹¥È¤Ç¤¹¡£01234£µ£¶£·£¸£¹¡£
SJIS: k/qWe4zqg2WDTINYg2eCxYK3gUIwMTIzNIJUglWCVoJXgliBQg==
JIS: GyRCRnxLXDhsJUYlLSU5JUgkRyQ5ISMbKEIwMTIzNBskQiM1IzYjNyM4IzkhIxsoQg==
== STRING ENCODING LIST ==
EUC-JP: ÆüËÜ¸ì¥Æ¥¥¹¥È¤Ç¤¹¡£01234£µ£¶£·£¸£¹¡£
SJIS: k/qWe4zqg2WDTINYg2eCxYK3gUIwMTIzNIJUglWCVoJXgliBQg==
JIS: GyRCRnxLXDhsJUYlLSU5JUgkRyQ5ISMbKEIwMTIzNBskQiM1IzYjNyM4IzkhIxsoQg==
== ARRAY ENCODING LIST ==
EUC-JP: ÆüËÜ¸ì¥Æ¥¥¹¥È¤Ç¤¹¡£01234£µ£¶£·£¸£¹¡£
SJIS: k/qWe4zqg2WDTINYg2eCxYK3gUIwMTIzNIJUglWCVoJXgliBQg==
JIS: GyRCRnxLXDhsJUYlLSU5JUgkRyQ5ISMbKEIwMTIzNBskQiM1IzYjNyM4IzkhIxsoQg==
== DETECT ORDER ==
EUC-JP: ÆüËÜ¸ì¥Æ¥¥¹¥È¤Ç¤¹¡£01234£µ£¶£·£¸£¹¡£
SJIS: k/qWe4zqg2WDTINYg2eCxYK3gUIwMTIzNIJUglWCVoJXgliBQg==
JIS: GyRCRnxLXDhsJUYlLSU5JUgkRyQ5ISMbKEIwMTIzNBskQiM1IzYjNyM4IzkhIxsoQg==
== INVALID PARAMETER ==
INT: 1234
EUC-JP:
ERR: Warning
BAD:
ERR: Warning
MP:
---- ACTUAL OUTPUT
Parse error: parse error, expecting `')'' in
/Users/kazu/src/php-4.3.0RC3/ext/mbstring/tests/common.inc on line 38
== BASIC TEST ==
EUC-JP: ÆüËÜ¸ì¥Æ¥¥¹¥È¤Ç¤¹¡£01234£µ£¶£·£¸£¹¡£
EUC-JP: ÆüËÜ¸ì¥Æ¥¥¹¥È¤Ç¤¹¡£01234£µ£¶£·£¸£¹¡£
SJIS: k/qWe4zqg2WDTINYg2eCxYK3gUIwMTIzNIJUglWCVoJXgliBQg==
JIS: GyRCRnxLXDhsJUYlLSU5JUgkRyQ5ISMbKEIwMTIzNBskQiM1IzYjNyM4IzkhIxsoQg==
== STRING ENCODING LIST ==
EUC-JP: ÆüËÜ¸ì¥Æ¥¥¹¥È¤Ç¤¹¡£01234£µ£¶£·£¸£¹¡£
SJIS: k/qWe4zqg2WDTINYg2eCxYK3gUIwMTIzNIJUglWCVoJXgliBQg==
JIS: GyRCRnxLXDhsJUYlLSU5JUgkRyQ5ISMbKEIwMTIzNBskQiM1IzYjNyM4IzkhIxsoQg==
== ARRAY ENCODING LIST ==
EUC-JP: ÆüËÜ¸ì¥Æ¥¥¹¥È¤Ç¤¹¡£01234£µ£¶£·£¸£¹¡£
SJIS: k/qWe4zqg2WDTINYg2eCxYK3gUIwMTIzNIJUglWCVoJXgliBQg==
JIS: GyRCRnxLXDhsJUYlLSU5JUgkRyQ5ISMbKEIwMTIzNBskQiM1IzYjNyM4IzkhIxsoQg==
== DETECT ORDER ==
EUC-JP: ÆüËÜ¸ì¥Æ¥¥¹¥È¤Ç¤¹¡£01234£µ£¶£·£¸£¹¡£
SJIS: k/qWe4zqg2WDTINYg2eCxYK3gUIwMTIzNIJUglWCVoJXgliBQg==
JIS: GyRCRnxLXDhsJUYlLSU5JUgkRyQ5ISMbKEIwMTIzNBskQiM1IzYjNyM4IzkhIxsoQg==
== INVALID PARAMETER ==
INT: 1234
EUC-JP:
Warning: mb_convert_encoding() [/phpmanual/function.mb-convert-encoding.html]: Unknown encoding
"BAD" in /Users/kazu/src/php-4.3.0RC3/ext/mbstring/tests/mb_convert_encoding.php on line
94
BAD:
Warning: Wrong parameter count for mb_convert_encoding() in
/Users/kazu/src/php-4.3.0RC3/ext/mbstring/tests/mb_convert_encoding.php on line 98
MP:
---- FAILED
================================================================================
001- == BASIC TEST ==
001+ Parse error: parse error, expecting `')'' in
/Users/kazu/src/php-4.3.0RC3/ext/mbstring/tests/common.inc on line 38
002- EUC-JP: ÆüËÜ¸ì¥Æ¥¥¹¥È¤Ç¤¹¡£01234£µ£¶£·£¸£¹¡£
002+ == BASIC TEST ==
004- SJIS: k/qWe4zqg2WDTINYg2eCxYK3gUIwMTIzNIJUglWCVoJXgliBQg==
004+ EUC-JP: ÆüËÜ¸ì¥Æ¥¥¹¥È¤Ç¤¹¡£01234£µ£¶£·£¸£¹¡£
005- JIS: GyRCRnxLXDhsJUYlLSU5JUgkRyQ5ISMbKEIwMTIzNBskQiM1IzYjNyM4IzkhIxsoQg==
005+ SJIS: k/qWe4zqg2WDTINYg2eCxYK3gUIwMTIzNIJUglWCVoJXgliBQg==
006- == STRING ENCODING LIST ==
006+ JIS: GyRCRnxLXDhsJUYlLSU5JUgkRyQ5ISMbKEIwMTIzNBskQiM1IzYjNyM4IzkhIxsoQg==
007- EUC-JP: ÆüËÜ¸ì¥Æ¥¥¹¥È¤Ç¤¹¡£01234£µ£¶£·£¸£¹¡£
007+ == STRING ENCODING LIST ==
008- SJIS: k/qWe4zqg2WDTINYg2eCxYK3gUIwMTIzNIJUglWCVoJXgliBQg==
008+ EUC-JP: ÆüËÜ¸ì¥Æ¥¥¹¥È¤Ç¤¹¡£01234£µ£¶£·£¸£¹¡£
009- JIS: GyRCRnxLXDhsJUYlLSU5JUgkRyQ5ISMbKEIwMTIzNBskQiM1IzYjNyM4IzkhIxsoQg==
009+ SJIS: k/qWe4zqg2WDTINYg2eCxYK3gUIwMTIzNIJUglWCVoJXgliBQg==
010- == ARRAY ENCODING LIST ==
010+ JIS: GyRCRnxLXDhsJUYlLSU5JUgkRyQ5ISMbKEIwMTIzNBskQiM1IzYjNyM4IzkhIxsoQg==
011- EUC-JP: ÆüËÜ¸ì¥Æ¥¥¹¥È¤Ç¤¹¡£01234£µ£¶£·£¸£¹¡£
011+ == ARRAY ENCODING LIST ==
012- SJIS: k/qWe4zqg2WDTINYg2eCxYK3gUIwMTIzNIJUglWCVoJXgliBQg==
012+ EUC-JP: ÆüËÜ¸ì¥Æ¥¥¹¥È¤Ç¤¹¡£01234£µ£¶£·£¸£¹¡£
013- JIS: GyRCRnxLXDhsJUYlLSU5JUgkRyQ5ISMbKEIwMTIzNBskQiM1IzYjNyM4IzkhIxsoQg==
013+ SJIS: k/qWe4zqg2WDTINYg2eCxYK3gUIwMTIzNIJUglWCVoJXgliBQg==
014- == DETECT ORDER ==
014+ JIS: GyRCRnxLXDhsJUYlLSU5JUgkRyQ5ISMbKEIwMTIzNBskQiM1IzYjNyM4IzkhIxsoQg==
015- EUC-JP: ÆüËÜ¸ì¥Æ¥¥¹¥È¤Ç¤¹¡£01234£µ£¶£·£¸£¹¡£
015+ == DETECT ORDER ==
016- SJIS: k/qWe4zqg2WDTINYg2eCxYK3gUIwMTIzNIJUglWCVoJXgliBQg==
016+ EUC-JP: ÆüËÜ¸ì¥Æ¥¥¹¥È¤Ç¤¹¡£01234£µ£¶£·£¸£¹¡£
017- JIS: GyRCRnxLXDhsJUYlLSU5JUgkRyQ5ISMbKEIwMTIzNBskQiM1IzYjNyM4IzkhIxsoQg==
017+ SJIS: k/qWe4zqg2WDTINYg2eCxYK3gUIwMTIzNIJUglWCVoJXgliBQg==
018- == INVALID PARAMETER ==
018+ JIS: GyRCRnxLXDhsJUYlLSU5JUgkRyQ5ISMbKEIwMTIzNBskQiM1IzYjNyM4IzkhIxsoQg==
019- INT: 1234
019+ == INVALID PARAMETER ==
020- EUC-JP:
020+ INT: 1234
021- ERR: Warning
021+ EUC-JP:
022- BAD:
022+
023- ERR: Warning
023+ Warning: mb_convert_encoding() [/phpmanual/function.mb-convert-encoding.html]: Unknown encoding
"BAD" in /Users/kazu/src/php-4.3.0RC3/ext/mbstring/tests/mb_convert_encoding.php on line
94
024- MP:
024+ BAD:
025+
026+ Warning: Wrong parameter count for mb_convert_encoding() in
/Users/kazu/src/php-4.3.0RC3/ext/mbstring/tests/mb_convert_encoding.php on line 98
027+ MP:
================================================================================
================================================================================
/Users/kazu/src/php-4.3.0RC3/ext/mbstring/tests/mb_convert_variables.phpt
================================================================================
---- EXPECTED OUTPUT
== SCALER TEST ==
SJIS
ÆüËÜ¸ì¥Æ¥¥¹¥È¤Ç¤¹¡£01234£µ£¶£·£¸£¹¡£
JIS
ÆüËÜ¸ì¥Æ¥¥¹¥È¤Ç¤¹¡£01234£µ£¶£·£¸£¹¡£
EUC-JP
k/qWe4zqg2WDTINYg2eCxYK3gUIwMTIzNIJUglWCVoJXgliBQg==
EUC-JP
GyRCRnxLXDhsJUYlLSU5JUgkRyQ5ISMbKEIwMTIzNBskQiM1IzYjNyM4IzkhIxsoQg==
EUC-JP
ÆüËÜ¸ì¥Æ¥¥¹¥È¤Ç¤¹¡£01234£µ£¶£·£¸£¹¡£ÆüËÜ¸ì¥Æ¥¥¹¥È¤Ç¤¹¡£01234£µ£¶£·£¸£¹¡£ÆüËÜ¸ì¥Æ¥¥¹¥È¤Ç¤¹¡£01234£µ£¶£·£¸£¹¡£
== ARRAY TEST ==
EUC-JP
ÆüËÜ¸ì¥Æ¥¥¹¥È¤Ç¤¹¡£01234£µ£¶£·£¸£¹¡£ÆüËÜ¸ì¥Æ¥¥¹¥È¤Ç¤¹¡£01234£µ£¶£·£¸£¹¡£ÆüËÜ¸ì¥Æ¥¥¹¥È¤Ç¤¹¡£01234£µ£¶£·£¸£¹¡£
EUC-JP
ÆüËÜ¸ì¥Æ¥¥¹¥È¤Ç¤¹¡£01234£µ£¶£·£¸£¹¡£ÆüËÜ¸ì¥Æ¥¥¹¥È¤Ç¤¹¡£01234£µ£¶£·£¸£¹¡£ÆüËÜ¸ì¥Æ¥¥¹¥È¤Ç¤¹¡£01234£µ£¶£·£¸£¹¡£
== OBJECT TEST ==
EUC-JP
ÆüËÜ¸ì¥Æ¥¥¹¥È¤Ç¤¹¡£01234£µ£¶£·£¸£¹¡£ÆüËÜ¸ì¥Æ¥¥¹¥È¤Ç¤¹¡£01234£µ£¶£·£¸£¹¡£ÆüËÜ¸ì¥Æ¥¥¹¥È¤Ç¤¹¡£01234£µ£¶£·£¸£¹¡£
EUC-JP
ÆüËÜ¸ì¥Æ¥¥¹¥È¤Ç¤¹¡£01234£µ£¶£·£¸£¹¡£ÆüËÜ¸ì¥Æ¥¥¹¥È¤Ç¤¹¡£01234£µ£¶£·£¸£¹¡£ÆüËÜ¸ì¥Æ¥¥¹¥È¤Ç¤¹¡£01234£µ£¶£·£¸£¹¡£
== SCALER, ARRAY AND OBJECT TEST ==
EUC-JP
ÆüËÜ¸ì¥Æ¥¥¹¥È¤Ç¤¹¡£01234£µ£¶£·£¸£¹¡£ÆüËÜ¸ì¥Æ¥¥¹¥È¤Ç¤¹¡£01234£µ£¶£·£¸£¹¡£ÆüËÜ¸ì¥Æ¥¥¹¥È¤Ç¤¹¡£01234£µ£¶£·£¸£¹¡£
ÆüËÜ¸ì¥Æ¥¥¹¥È¤Ç¤¹¡£01234£µ£¶£·£¸£¹¡£ÆüËÜ¸ì¥Æ¥¥¹¥È¤Ç¤¹¡£01234£µ£¶£·£¸£¹¡£ÆüËÜ¸ì¥Æ¥¥¹¥È¤Ç¤¹¡£01234£µ£¶£·£¸£¹¡£
ÆüËÜ¸ì¥Æ¥¥¹¥È¤Ç¤¹¡£01234£µ£¶£·£¸£¹¡£ÆüËÜ¸ì¥Æ¥¥¹¥È¤Ç¤¹¡£01234£µ£¶£·£¸£¹¡£ÆüËÜ¸ì¥Æ¥¥¹¥È¤Ç¤¹¡£01234£µ£¶£·£¸£¹¡£
---- ACTUAL OUTPUT
Parse error: parse error, expecting `')'' in
/Users/kazu/src/php-4.3.0RC3/ext/mbstring/tests/common.inc on line 38
== SCALER TEST ==
SJIS
ÆüËÜ¸ì¥Æ¥¥¹¥È¤Ç¤¹¡£01234£µ£¶£·£¸£¹¡£
JIS
ÆüËÜ¸ì¥Æ¥¥¹¥È¤Ç¤¹¡£01234£µ£¶£·£¸£¹¡£
EUC-JP
k/qWe4zqg2WDTINYg2eCxYK3gUIwMTIzNIJUglWCVoJXgliBQg==
EUC-JP
GyRCRnxLXDhsJUYlLSU5JUgkRyQ5ISMbKEIwMTIzNBskQiM1IzYjNyM4IzkhIxsoQg==
EUC-JP
ÆüËÜ¸ì¥Æ¥¥¹¥È¤Ç¤¹¡£01234£µ£¶£·£¸£¹¡£ÆüËÜ¸ì¥Æ¥¥¹¥È¤Ç¤¹¡£01234£µ£¶£·£¸£¹¡£ÆüËÜ¸ì¥Æ¥¥¹¥È¤Ç¤¹¡£01234£µ£¶£·£¸£¹¡£
== ARRAY TEST ==
EUC-JP
ÆüËÜ¸ì¥Æ¥¥¹¥È¤Ç¤¹¡£01234£µ£¶£·£¸£¹¡£ÆüËÜ¸ì¥Æ¥¥¹¥È¤Ç¤¹¡£01234£µ£¶£·£¸£¹¡£ÆüËÜ¸ì¥Æ¥¥¹¥È¤Ç¤¹¡£01234£µ£¶£·£¸£¹¡£
EUC-JP
ÆüËÜ¸ì¥Æ¥¥¹¥È¤Ç¤¹¡£01234£µ£¶£·£¸£¹¡£ÆüËÜ¸ì¥Æ¥¥¹¥È¤Ç¤¹¡£01234£µ£¶£·£¸£¹¡£ÆüËÜ¸ì¥Æ¥¥¹¥È¤Ç¤¹¡£01234£µ£¶£·£¸£¹¡£
== OBJECT TEST ==
EUC-JP
ÆüËÜ¸ì¥Æ¥¥¹¥È¤Ç¤¹¡£01234£µ£¶£·£¸£¹¡£ÆüËÜ¸ì¥Æ¥¥¹¥È¤Ç¤¹¡£01234£µ£¶£·£¸£¹¡£ÆüËÜ¸ì¥Æ¥¥¹¥È¤Ç¤¹¡£01234£µ£¶£·£¸£¹¡£
EUC-JP
ÆüËÜ¸ì¥Æ¥¥¹¥È¤Ç¤¹¡£01234£µ£¶£·£¸£¹¡£ÆüËÜ¸ì¥Æ¥¥¹¥È¤Ç¤¹¡£01234£µ£¶£·£¸£¹¡£ÆüËÜ¸ì¥Æ¥¥¹¥È¤Ç¤¹¡£01234£µ£¶£·£¸£¹¡£
== SCALER, ARRAY AND OBJECT TEST ==
EUC-JP
ÆüËÜ¸ì¥Æ¥¥¹¥È¤Ç¤¹¡£01234£µ£¶£·£¸£¹¡£ÆüËÜ¸ì¥Æ¥¥¹¥È¤Ç¤¹¡£01234£µ£¶£·£¸£¹¡£ÆüËÜ¸ì¥Æ¥¥¹¥È¤Ç¤¹¡£01234£µ£¶£·£¸£¹¡£
ÆüËÜ¸ì¥Æ¥¥¹¥È¤Ç¤¹¡£01234£µ£¶£·£¸£¹¡£ÆüËÜ¸ì¥Æ¥¥¹¥È¤Ç¤¹¡£01234£µ£¶£·£¸£¹¡£ÆüËÜ¸ì¥Æ¥¥¹¥È¤Ç¤¹¡£01234£µ£¶£·£¸£¹¡£
ÆüËÜ¸ì¥Æ¥¥¹¥È¤Ç¤¹¡£01234£µ£¶£·£¸£¹¡£ÆüËÜ¸ì¥Æ¥¥¹¥È¤Ç¤¹¡£01234£µ£¶£·£¸£¹¡£ÆüËÜ¸ì¥Æ¥¥¹¥È¤Ç¤¹¡£01234£µ£¶£·£¸£¹¡£
---- FAILED
================================================================================
001- == SCALER TEST ==
001+ Parse error: parse error, expecting `')'' in
/Users/kazu/src/php-4.3.0RC3/ext/mbstring/tests/common.inc on line 38
002- SJIS
002+ == SCALER TEST ==
003- ÆüËÜ¸ì¥Æ¥¥¹¥È¤Ç¤¹¡£01234£µ£¶£·£¸£¹¡£
003+ SJIS
004- JIS
004+ ÆüËÜ¸ì¥Æ¥¥¹¥È¤Ç¤¹¡£01234£µ£¶£·£¸£¹¡£
005- ÆüËÜ¸ì¥Æ¥¥¹¥È¤Ç¤¹¡£01234£µ£¶£·£¸£¹¡£
005+ JIS
006- EUC-JP
006+ ÆüËÜ¸ì¥Æ¥¥¹¥È¤Ç¤¹¡£01234£µ£¶£·£¸£¹¡£
007- k/qWe4zqg2WDTINYg2eCxYK3gUIwMTIzNIJUglWCVoJXgliBQg==
007+ EUC-JP
008- EUC-JP
008+ k/qWe4zqg2WDTINYg2eCxYK3gUIwMTIzNIJUglWCVoJXgliBQg==
009- GyRCRnxLXDhsJUYlLSU5JUgkRyQ5ISMbKEIwMTIzNBskQiM1IzYjNyM4IzkhIxsoQg==
009+ EUC-JP
010- EUC-JP
010+ GyRCRnxLXDhsJUYlLSU5JUgkRyQ5ISMbKEIwMTIzNBskQiM1IzYjNyM4IzkhIxsoQg==
011-
ÆüËÜ¸ì¥Æ¥¥¹¥È¤Ç¤¹¡£01234£µ£¶£·£¸£¹¡£ÆüËÜ¸ì¥Æ¥¥¹¥È¤Ç¤¹¡£01234£µ£¶£·£¸£¹¡£ÆüËÜ¸ì¥Æ¥¥¹¥È¤Ç¤¹¡£01234£µ£¶£·£¸£¹¡£
011+ EUC-JP
012- == ARRAY TEST ==
012+
ÆüËÜ¸ì¥Æ¥¥¹¥È¤Ç¤¹¡£01234£µ£¶£·£¸£¹¡£ÆüËÜ¸ì¥Æ¥¥¹¥È¤Ç¤¹¡£01234£µ£¶£·£¸£¹¡£ÆüËÜ¸ì¥Æ¥¥¹¥È¤Ç¤¹¡£01234£µ£¶£·£¸£¹¡£
013- EUC-JP
013+ == ARRAY TEST ==
014-
ÆüËÜ¸ì¥Æ¥¥¹¥È¤Ç¤¹¡£01234£µ£¶£·£¸£¹¡£ÆüËÜ¸ì¥Æ¥¥¹¥È¤Ç¤¹¡£01234£µ£¶£·£¸£¹¡£ÆüËÜ¸ì¥Æ¥¥¹¥È¤Ç¤¹¡£01234£µ£¶£·£¸£¹¡£
014+ EUC-JP
015- EUC-JP
015+
ÆüËÜ¸ì¥Æ¥¥¹¥È¤Ç¤¹¡£01234£µ£¶£·£¸£¹¡£ÆüËÜ¸ì¥Æ¥¥¹¥È¤Ç¤¹¡£01234£µ£¶£·£¸£¹¡£ÆüËÜ¸ì¥Æ¥¥¹¥È¤Ç¤¹¡£01234£µ£¶£·£¸£¹¡£
016-
ÆüËÜ¸ì¥Æ¥¥¹¥È¤Ç¤¹¡£01234£µ£¶£·£¸£¹¡£ÆüËÜ¸ì¥Æ¥¥¹¥È¤Ç¤¹¡£01234£µ£¶£·£¸£¹¡£ÆüËÜ¸ì¥Æ¥¥¹¥È¤Ç¤¹¡£01234£µ£¶£·£¸£¹¡£
016+ EUC-JP
017- == OBJECT TEST ==
017+
ÆüËÜ¸ì¥Æ¥¥¹¥È¤Ç¤¹¡£01234£µ£¶£·£¸£¹¡£ÆüËÜ¸ì¥Æ¥¥¹¥È¤Ç¤¹¡£01234£µ£¶£·£¸£¹¡£ÆüËÜ¸ì¥Æ¥¥¹¥È¤Ç¤¹¡£01234£µ£¶£·£¸£¹¡£
018- EUC-JP
018+ == OBJECT TEST ==
019-
ÆüËÜ¸ì¥Æ¥¥¹¥È¤Ç¤¹¡£01234£µ£¶£·£¸£¹¡£ÆüËÜ¸ì¥Æ¥¥¹¥È¤Ç¤¹¡£01234£µ£¶£·£¸£¹¡£ÆüËÜ¸ì¥Æ¥¥¹¥È¤Ç¤¹¡£01234£µ£¶£·£¸£¹¡£
019+ EUC-JP
020- EUC-JP
020+
ÆüËÜ¸ì¥Æ¥¥¹¥È¤Ç¤¹¡£01234£µ£¶£·£¸£¹¡£ÆüËÜ¸ì¥Æ¥¥¹¥È¤Ç¤¹¡£01234£µ£¶£·£¸£¹¡£ÆüËÜ¸ì¥Æ¥¥¹¥È¤Ç¤¹¡£01234£µ£¶£·£¸£¹¡£
021-
ÆüËÜ¸ì¥Æ¥¥¹¥È¤Ç¤¹¡£01234£µ£¶£·£¸£¹¡£ÆüËÜ¸ì¥Æ¥¥¹¥È¤Ç¤¹¡£01234£µ£¶£·£¸£¹¡£ÆüËÜ¸ì¥Æ¥¥¹¥È¤Ç¤¹¡£01234£µ£¶£·£¸£¹¡£
021+ EUC-JP
022- == SCALER, ARRAY AND OBJECT TEST ==
022+
ÆüËÜ¸ì¥Æ¥¥¹¥È¤Ç¤¹¡£01234£µ£¶£·£¸£¹¡£ÆüËÜ¸ì¥Æ¥¥¹¥È¤Ç¤¹¡£01234£µ£¶£·£¸£¹¡£ÆüËÜ¸ì¥Æ¥¥¹¥È¤Ç¤¹¡£01234£µ£¶£·£¸£¹¡£
023- EUC-JP
023+ == SCALER, ARRAY AND OBJECT TEST ==
024-
ÆüËÜ¸ì¥Æ¥¥¹¥È¤Ç¤¹¡£01234£µ£¶£·£¸£¹¡£ÆüËÜ¸ì¥Æ¥¥¹¥È¤Ç¤¹¡£01234£µ£¶£·£¸£¹¡£ÆüËÜ¸ì¥Æ¥¥¹¥È¤Ç¤¹¡£01234£µ£¶£·£¸£¹¡£
024+ EUC-JP
027+
ÆüËÜ¸ì¥Æ¥¥¹¥È¤Ç¤¹¡£01234£µ£¶£·£¸£¹¡£ÆüËÜ¸ì¥Æ¥¥¹¥È¤Ç¤¹¡£01234£µ£¶£·£¸£¹¡£ÆüËÜ¸ì¥Æ¥¥¹¥È¤Ç¤¹¡£01234£µ£¶£·£¸£¹¡£
================================================================================
================================================================================
/Users/kazu/src/php-4.3.0RC3/ext/mbstring/tests/mb_detect_encoding.phpt
================================================================================
---- EXPECTED OUTPUT
== BASIC TEST ==
SJIS: SJIS
JIS: JIS
EUC-JP: EUC-JP
EUC-JP: EUC-JP
== ARRAY ENCODING LIST ==
JIS: UTF-8
EUC-JP: EUC-JP
SJIS: SJIS
== DETECT ORDER ==
JIS: JIS
EUC-JP: EUC-JP
SJIS: SJIS
== INVALID PARAMETER ==
INT: EUC-JP
EUC-JP: EUC-JP
ERR: Warning
BAD: EUC-JP
ERR: Warning
MP:
---- ACTUAL OUTPUT
Parse error: parse error, expecting `')'' in
/Users/kazu/src/php-4.3.0RC3/ext/mbstring/tests/common.inc on line 38
== BASIC TEST ==
SJIS: SJIS
JIS: JIS
EUC-JP: EUC-JP
EUC-JP: EUC-JP
== ARRAY ENCODING LIST ==
JIS: UTF-8
EUC-JP: EUC-JP
SJIS: SJIS
== DETECT ORDER ==
JIS: JIS
EUC-JP: EUC-JP
SJIS: SJIS
== INVALID PARAMETER ==
INT: EUC-JP
EUC-JP: EUC-JP
Warning: mb_detect_encoding() [/phpmanual/function.mb-detect-encoding.html]: Illegal argument in
/Users/kazu/src/php-4.3.0RC3/ext/mbstring/tests/mb_detect_encoding.php on line 83
BAD: EUC-JP
Warning: Wrong parameter count for mb_detect_encoding() in
/Users/kazu/src/php-4.3.0RC3/ext/mbstring/tests/mb_detect_encoding.php on line 87
MP:
---- FAILED
================================================================================
001- == BASIC TEST ==
001+ Parse error: parse error, expecting `')'' in
/Users/kazu/src/php-4.3.0RC3/ext/mbstring/tests/common.inc on line 38
002- SJIS: SJIS
002+ == BASIC TEST ==
003- JIS: JIS
003+ SJIS: SJIS
004- EUC-JP: EUC-JP
004+ JIS: JIS
006- == ARRAY ENCODING LIST ==
006+ EUC-JP: EUC-JP
007- JIS: UTF-8
007+ == ARRAY ENCODING LIST ==
008- EUC-JP: EUC-JP
008+ JIS: UTF-8
009- SJIS: SJIS
009+ EUC-JP: EUC-JP
010- == DETECT ORDER ==
010+ SJIS: SJIS
011- JIS: JIS
011+ == DETECT ORDER ==
012- EUC-JP: EUC-JP
012+ JIS: JIS
013- SJIS: SJIS
013+ EUC-JP: EUC-JP
014- == INVALID PARAMETER ==
014+ SJIS: SJIS
015- INT: EUC-JP
015+ == INVALID PARAMETER ==
016- EUC-JP: EUC-JP
016+ INT: EUC-JP
017- ERR: Warning
017+ EUC-JP: EUC-JP
018- BAD: EUC-JP
018+
019- ERR: Warning
019+ Warning: mb_detect_encoding() [/phpmanual/function.mb-detect-encoding.html]: Illegal argument
in /Users/kazu/src/php-4.3.0RC3/ext/mbstring/tests/mb_detect_encoding.php on line 83
020- MP:
020+ BAD: EUC-JP
021+
022+ Warning: Wrong parameter count for mb_detect_encoding() in
/Users/kazu/src/php-4.3.0RC3/ext/mbstring/tests/mb_detect_encoding.php on line 87
023+ MP:
================================================================================
================================================================================
/Users/kazu/src/php-4.3.0RC3/ext/mbstring/tests/mb_detect_order.phpt
================================================================================
---- EXPECTED OUTPUT
OK_AUTO
ASCII, JIS, UTF-8, EUC-JP, SJIS
OK_STR
SJIS, EUC-JP, JIS, UTF-8
OK_ARRAY
ASCII, JIS, EUC-JP, UTF-8
== INVALID PARAMETER ==
OK_BAD_STR
ASCII, JIS, EUC-JP, UTF-8
OK_BAD_ARRAY
ASCII, JIS, EUC-JP, UTF-8
---- ACTUAL OUTPUT
Parse error: parse error, expecting `')'' in
/Users/kazu/src/php-4.3.0RC3/ext/mbstring/tests/common.inc on line 38
OK_AUTO
ASCII, JIS, UTF-8, EUC-JP, SJIS
OK_STR
SJIS, EUC-JP, JIS, UTF-8
OK_ARRAY
ASCII, JIS, EUC-JP, UTF-8
== INVALID PARAMETER ==
OK_BAD_STR
ASCII, JIS, EUC-JP, UTF-8
OK_BAD_ARRAY
ASCII, JIS, EUC-JP, UTF-8
---- FAILED
================================================================================
001- OK_AUTO
001+ Parse error: parse error, expecting `')'' in
/Users/kazu/src/php-4.3.0RC3/ext/mbstring/tests/common.inc on line 38
002- ASCII, JIS, UTF-8, EUC-JP, SJIS
002+ OK_AUTO
003- OK_STR
003+ ASCII, JIS, UTF-8, EUC-JP, SJIS
004- SJIS, EUC-JP, JIS, UTF-8
004+ OK_STR
005- OK_ARRAY
005+ SJIS, EUC-JP, JIS, UTF-8
006- ASCII, JIS, EUC-JP, UTF-8
006+ OK_ARRAY
007- == INVALID PARAMETER ==
007+ ASCII, JIS, EUC-JP, UTF-8
008- OK_BAD_STR
008+ == INVALID PARAMETER ==
009- ASCII, JIS, EUC-JP, UTF-8
009+ OK_BAD_STR
010- OK_BAD_ARRAY
010+ ASCII, JIS, EUC-JP, UTF-8
011- ASCII, JIS, EUC-JP, UTF-8
011+ OK_BAD_ARRAY
012+ ASCII, JIS, EUC-JP, UTF-8
================================================================================
================================================================================
/Users/kazu/src/php-4.3.0RC3/ext/mbstring/tests/mb_ereg.phpt
================================================================================
---- EXPECTED OUTPUT
(15)abc def ghi jkl def ghi jkl
(27)£á£â£ã ¤¢¤ª¤¤ ¤«¤³¤Ê ¤ï¤ñ¤ó £á£â£ã ¤¢¤ª¤¤ ¤« ¤³¤Ê
¤ï¤ñ¤ó
(27)£í£ú£ø£æ£ð ¤¦¤ª¤« ¤¤« ¤ò¤ð £í£ú£ø£æ£ð ¤¦¤ª¤« ¤¤«
¤ò¤ð
(15)abc def ghi jkl def ghi jkl
(27)£á£â£ã ¤¢¤ª¤¤ ¤«¤³¤Ê ¤ï¤ñ¤ó £á£â£ã ¤¢¤ª¤¤ ¤« ¤³¤Ê
¤ï¤ñ¤ó
(27)£í£ú£ø£æ£ð ¤¦¤ª¤« ¤¤« ¤ò¤ð £í£ú£ø£æ£ð ¤¦¤ª¤« ¤¤«
¤ò¤ð
(15)abc def ghi jkl def ghi jkl
(27)£á£â£ã ¤¢¤ª¤¤ ¤«¤³¤Ê ¤ï¤ñ¤ó £á£â£ã ¤¢¤ª¤¤ ¤« ¤³¤Ê
¤ï¤ñ¤ó
(27)£í£ú£ø£æ£ð ¤¦¤ª¤« ¤¤« ¤ò¤ð £í£ú£ø£æ£ð ¤¦¤ª¤« ¤¤«
¤ò¤ð
(15)abc def ghi jkl def ghi jkl
(39)£á£â£ã ¤¢¤ª¤¤ ¤«¤³¤Ê ¤ï¤ñ¤ó £á£â£ã ¤¢¤ª¤¤ ¤« ¤³¤Ê
¤ï¤ñ¤ó
(39)£í£ú£ø£æ£ð ¤¦¤ª¤« ¤¤« ¤ò¤ð £í£ú£ø£æ£ð ¤¦¤ª¤« ¤¤«
¤ò¤ð
---- ACTUAL OUTPUT
Parse error: parse error in /Users/kazu/src/php-4.3.0RC3/ext/mbstring/tests/mb_ereg.php on line 17
---- FAILED
================================================================================
001- (15)abc def ghi jkl def ghi jkl
001+ Parse error: parse error in /Users/kazu/src/php-4.3.0RC3/ext/mbstring/tests/mb_ereg.php on line
17
002- (27)£á£â£ã ¤¢¤ª¤¤ ¤«¤³¤Ê ¤ï¤ñ¤ó £á£â£ã ¤¢¤ª¤¤ ¤« ¤³¤Ê
¤ï¤ñ¤ó
003- (27)£í£ú£ø£æ£ð ¤¦¤ª¤« ¤¤« ¤ò¤ð £í£ú£ø£æ£ð ¤¦¤ª¤«
¤¤« ¤ò¤ð
004- (15)abc def ghi jkl def ghi jkl
005- (27)£á£â£ã ¤¢¤ª¤¤ ¤«¤³¤Ê ¤ï¤ñ¤ó £á£â£ã ¤¢¤ª¤¤ ¤« ¤³¤Ê
¤ï¤ñ¤ó
006- (27)£í£ú£ø£æ£ð ¤¦¤ª¤« ¤¤« ¤ò¤ð £í£ú£ø£æ£ð ¤¦¤ª¤«
¤¤« ¤ò¤ð
007- (15)abc def ghi jkl def ghi jkl
008- (27)£á£â£ã ¤¢¤ª¤¤ ¤«¤³¤Ê ¤ï¤ñ¤ó £á£â£ã ¤¢¤ª¤¤ ¤« ¤³¤Ê
¤ï¤ñ¤ó
009- (27)£í£ú£ø£æ£ð ¤¦¤ª¤« ¤¤« ¤ò¤ð £í£ú£ø£æ£ð ¤¦¤ª¤«
¤¤« ¤ò¤ð
010- (15)abc def ghi jkl def ghi jkl
011- (39)£á£â£ã ¤¢¤ª¤¤ ¤«¤³¤Ê ¤ï¤ñ¤ó £á£â£ã ¤¢¤ª¤¤ ¤« ¤³¤Ê
¤ï¤ñ¤ó
012- (39)£í£ú£ø£æ£ð ¤¦¤ª¤« ¤¤« ¤ò¤ð £í£ú£ø£æ£ð ¤¦¤ª¤«
¤¤« ¤ò¤ð
================================================================================
================================================================================
/Users/kazu/src/php-4.3.0RC3/ext/mbstring/tests/mb_http_output.phpt
================================================================================
---- EXPECTED OUTPUT
OK_ASCII_SET
ASCII
OK_SJIS_SET
SJIS
OK_JIS_SET
JIS
OK_UTF-8_SET
UTF-8
OK_EUC-JP_SET
EUC-JP
== INVALID PARAMETER ==
ERR: Warning
OK_BAD_SET
EUC-JP
ERR: Notice
ERR: Warning
OK_BAD_ARY_SET
EUC-JP
ERR: Notice
ERR: Warning
OK_BAD_OBJ_SET
EUC-JP
---- ACTUAL OUTPUT
Parse error: parse error, expecting `')'' in
/Users/kazu/src/php-4.3.0RC3/ext/mbstring/tests/common.inc on line 38
OK_ASCII_SET
ASCII
OK_SJIS_SET
SJIS
OK_JIS_SET
JIS
OK_UTF-8_SET
UTF-8
OK_EUC-JP_SET
EUC-JP
== INVALID PARAMETER ==
Warning: mb_http_output() [/phpmanual/function.mb-http-output.html]: Unknown encoding
"BAD_NAME" in /Users/kazu/src/php-4.3.0RC3/ext/mbstring/tests/mb_http_output.php on line
41
OK_BAD_SET
EUC-JP
Notice: Undefined variable: t_ary in
/Users/kazu/src/php-4.3.0RC3/ext/mbstring/tests/mb_http_output.php on line 46
Warning: mb_http_output() [/phpmanual/function.mb-http-output.html]: Unknown encoding ""
in /Users/kazu/src/php-4.3.0RC3/ext/mbstring/tests/mb_http_output.php on line 46
OK_BAD_ARY_SET
EUC-JP
Notice: Undefined variable: t_obj in
/Users/kazu/src/php-4.3.0RC3/ext/mbstring/tests/mb_http_output.php on line 51
Warning: mb_http_output() [/phpmanual/function.mb-http-output.html]: Unknown encoding ""
in /Users/kazu/src/php-4.3.0RC3/ext/mbstring/tests/mb_http_output.php on line 51
OK_BAD_OBJ_SET
EUC-JP
---- FAILED
================================================================================
001- OK_ASCII_SET
001+ Parse error: parse error, expecting `')'' in
/Users/kazu/src/php-4.3.0RC3/ext/mbstring/tests/common.inc on line 38
002- ASCII
002+ OK_ASCII_SET
003- OK_SJIS_SET
003+ ASCII
004- SJIS
004+ OK_SJIS_SET
005- OK_JIS_SET
005+ SJIS
006- JIS
006+ OK_JIS_SET
007- OK_UTF-8_SET
007+ JIS
008- UTF-8
008+ OK_UTF-8_SET
009- OK_EUC-JP_SET
009+ UTF-8
010- EUC-JP
010+ OK_EUC-JP_SET
011- == INVALID PARAMETER ==
011+ EUC-JP
012- ERR: Warning
012+ == INVALID PARAMETER ==
013- OK_BAD_SET
013+
014- EUC-JP
014+ Warning: mb_http_output() [/phpmanual/function.mb-http-output.html]: Unknown encoding
"BAD_NAME" in /Users/kazu/src/php-4.3.0RC3/ext/mbstring/tests/mb_http_output.php on line
41
015- ERR: Notice
015+ OK_BAD_SET
016- ERR: Warning
016+ EUC-JP
017- OK_BAD_ARY_SET
017+
018- EUC-JP
018+ Notice: Undefined variable: t_ary in
/Users/kazu/src/php-4.3.0RC3/ext/mbstring/tests/mb_http_output.php on line 46
019- ERR: Notice
019+
020- ERR: Warning
020+ Warning: mb_http_output() [/phpmanual/function.mb-http-output.html]: Unknown encoding
"" in /Users/kazu/src/php-4.3.0RC3/ext/mbstring/tests/mb_http_output.php on line 46
021- OK_BAD_OBJ_SET
021+ OK_BAD_ARY_SET
023+
024+ Notice: Undefined variable: t_obj in
/Users/kazu/src/php-4.3.0RC3/ext/mbstring/tests/mb_http_output.php on line 51
025+
026+ Warning: mb_http_output() [/phpmanual/function.mb-http-output.html]: Unknown encoding
"" in /Users/kazu/src/php-4.3.0RC3/ext/mbstring/tests/mb_http_output.php on line 51
027+ OK_BAD_OBJ_SET
028+ EUC-JP
================================================================================
================================================================================
/Users/kazu/src/php-4.3.0RC3/ext/mbstring/tests/mb_internal_encoding.phpt
================================================================================
---- EXPECTED OUTPUT
OK_EUC-JP_SET
EUC-JP
OK_UTF-8_SET
UTF-8
OK_ASCII_SET
ASCII
== INVALID PARAMETER ==
ERR: Warning
OK_BAD_SET
ASCII
ERR: Notice
ERR: Warning
OK_BAD_ARY_SET
ASCII
ERR: Notice
ERR: Warning
OK_BAD_OBJ_SET
ASCII
---- ACTUAL OUTPUT
Parse error: parse error, expecting `')'' in
/Users/kazu/src/php-4.3.0RC3/ext/mbstring/tests/common.inc on line 38
OK_EUC-JP_SET
EUC-JP
OK_UTF-8_SET
UTF-8
OK_ASCII_SET
ASCII
== INVALID PARAMETER ==
Warning: mb_internal_encoding() [/phpmanual/function.mb-internal-encoding.html]: Unknown encoding
"BAD" in /Users/kazu/src/php-4.3.0RC3/ext/mbstring/tests/mb_internal_encoding.php on line
29
OK_BAD_SET
ASCII
Notice: Undefined variable: t_ary in
/Users/kazu/src/php-4.3.0RC3/ext/mbstring/tests/mb_internal_encoding.php on line 34
Warning: mb_internal_encoding() [/phpmanual/function.mb-internal-encoding.html]: Unknown encoding
"" in /Users/kazu/src/php-4.3.0RC3/ext/mbstring/tests/mb_internal_encoding.php on line 34
OK_BAD_ARY_SET
ASCII
Notice: Undefined variable: t_obj in
/Users/kazu/src/php-4.3.0RC3/ext/mbstring/tests/mb_internal_encoding.php on line 39
Warning: mb_internal_encoding() [/phpmanual/function.mb-internal-encoding.html]: Unknown encoding
"" in /Users/kazu/src/php-4.3.0RC3/ext/mbstring/tests/mb_internal_encoding.php on line 39
OK_BAD_OBJ_SET
ASCII
---- FAILED
================================================================================
001- OK_EUC-JP_SET
001+ Parse error: parse error, expecting `')'' in
/Users/kazu/src/php-4.3.0RC3/ext/mbstring/tests/common.inc on line 38
002- EUC-JP
002+ OK_EUC-JP_SET
003- OK_UTF-8_SET
003+ EUC-JP
004- UTF-8
004+ OK_UTF-8_SET
005- OK_ASCII_SET
005+ UTF-8
006- ASCII
006+ OK_ASCII_SET
007- == INVALID PARAMETER ==
007+ ASCII
008- ERR: Warning
008+ == INVALID PARAMETER ==
009- OK_BAD_SET
009+
010- ASCII
010+ Warning: mb_internal_encoding() [/phpmanual/function.mb-internal-encoding.html]: Unknown
encoding "BAD" in /Users/kazu/src/php-4.3.0RC3/ext/mbstring/tests/mb_internal_encoding.php
on line 29
011- ERR: Notice
011+ OK_BAD_SET
012- ERR: Warning
012+ ASCII
013- OK_BAD_ARY_SET
013+
014- ASCII
014+ Notice: Undefined variable: t_ary in
/Users/kazu/src/php-4.3.0RC3/ext/mbstring/tests/mb_internal_encoding.php on line 34
015- ERR: Notice
015+
016- ERR: Warning
016+ Warning: mb_internal_encoding() [/phpmanual/function.mb-internal-encoding.html]: Unknown
encoding "" in /Users/kazu/src/php-4.3.0RC3/ext/mbstring/tests/mb_internal_encoding.php on
line 34
017- OK_BAD_OBJ_SET
017+ OK_BAD_ARY_SET
019+
020+ Notice: Undefined variable: t_obj in
/Users/kazu/src/php-4.3.0RC3/ext/mbstring/tests/mb_internal_encoding.php on line 39
021+
022+ Warning: mb_internal_encoding() [/phpmanual/function.mb-internal-encoding.html]: Unknown
encoding "" in /Users/kazu/src/php-4.3.0RC3/ext/mbstring/tests/mb_internal_encoding.php on
line 39
023+ OK_BAD_OBJ_SET
024+ ASCII
================================================================================
================================================================================
/Users/kazu/src/php-4.3.0RC3/ext/mbstring/tests/mb_preferred_mime_name.phpt
================================================================================
---- EXPECTED OUTPUT
Shift_JIS
Shift_JIS
EUC-JP
UTF-8
ISO-2022-JP
ISO-2022-JP
ISO-8859-1
UCS-2
UCS-4
== INVALID PARAMETER ==
ERR: Warning
OK_BAD_NAME
---- ACTUAL OUTPUT
Parse error: parse error, expecting `')'' in
/Users/kazu/src/php-4.3.0RC3/ext/mbstring/tests/common.inc on line 38
Shift_JIS
Shift_JIS
EUC-JP
UTF-8
ISO-2022-JP
ISO-2022-JP
ISO-8859-1
UCS-2
UCS-4
== INVALID PARAMETER ==
Warning: mb_preferred_mime_name(BAD_NAME) [/phpmanual/function.mb-preferred-mime-name.html]: Unknown
encoding in /Users/kazu/src/php-4.3.0RC3/ext/mbstring/tests/mb_preferred_mime_name.php on line 38
OK_BAD_NAME
---- FAILED
================================================================================
001- Shift_JIS
001+ Parse error: parse error, expecting `')'' in
/Users/kazu/src/php-4.3.0RC3/ext/mbstring/tests/common.inc on line 38
003- EUC-JP
003+ Shift_JIS
004- UTF-8
004+ EUC-JP
005- ISO-2022-JP
005+ UTF-8
007- ISO-8859-1
007+ ISO-2022-JP
008- UCS-2
008+ ISO-8859-1
009- UCS-4
009+ UCS-2
010- == INVALID PARAMETER ==
010+ UCS-4
011- ERR: Warning
011+ == INVALID PARAMETER ==
012- OK_BAD_NAME
012+
013+ Warning: mb_preferred_mime_name(BAD_NAME) [/phpmanual/function.mb-preferred-mime-name.html]:
Unknown encoding in /Users/kazu/src/php-4.3.0RC3/ext/mbstring/tests/mb_preferred_mime_name.php on
line 38
014+ OK_BAD_NAME
================================================================================
================================================================================
/Users/kazu/src/php-4.3.0RC3/ext/mbstring/tests/mb_send_mail04.phpt
================================================================================
---- EXPECTED OUTPUT
To: example@example.com
Subject: %s
Mime-Version: 1.0
Content-Type: text/plain; charset=%s
Content-Transfer-Encoding: %s
test
To: example@example.com
Subject: =?ISO-8859-15?Q?Pr=FCfung=20German?=
Mime-Version: 1.0
Content-Type: text/plain; charset=%s-8859-15
Content-Transfer-Encoding: 8bit
Prüfung
---- ACTUAL OUTPUT
To: example@example.com
Subject: Japanese
Mime-Version: 1.0
Content-Type: text/plain; charset=ISO-2022-JP
Content-Transfer-Encoding: 7bit
test
To: example@example.com
Subject: Prfung German
Mime-Version: 1.0
Content-Type: text/plain; charset=ISO-8859-15
Content-Transfer-Encoding: 8bit
Prfung
---- FAILED
================================================================================
002- Subject: %s
002+ Subject: Japanese
004- Content-Type: text/plain; charset=%s
004+ Content-Type: text/plain; charset=ISO-2022-JP
005- Content-Transfer-Encoding: %s
005+ Content-Transfer-Encoding: 7bit
009- Subject: =?ISO-8859-15?Q?Pr=FCfung=20German?=
009+ Subject: Prfung German
011- Content-Type: text/plain; charset=%s-8859-15
011+ Content-Type: text/plain; charset=ISO-8859-15
014- Prüfung
014+ Prfung
================================================================================
================================================================================
/Users/kazu/src/php-4.3.0RC3/ext/mbstring/tests/mb_split.phpt
================================================================================
---- EXPECTED OUTPUT
bool(true)
ok
ok
ok
ok
ok
ok
2-2
3-3
4-4
---- ACTUAL OUTPUT
bool(true)
ok
ok
ok
ok
ok
ok
ok
ok
ok
---- FAILED
================================================================================
008- 2-2
008+ ok
009- 3-3
009+ ok
010- 4-4
010+ ok
================================================================================
================================================================================
/Users/kazu/src/php-4.3.0RC3/ext/mbstring/tests/mb_strcut.phpt
================================================================================
---- EXPECTED OUTPUT
¤Îʸ
0123¤³¤Îʸ»úÎó¤ÏÆüËܸì¤Ç¤¹¡£EUC-JP¤ò»È¤Ã¤Æ¤¤¤Þ¤¹¡£ÆüËܸì¤ÏÌÌÅݽ¤¤¡£
OK
OK: 0123¤³¤Îʸ
---- ACTUAL OUTPUT
Parse error: parse error, expecting `')'' in
/Users/kazu/src/php-4.3.0RC3/ext/mbstring/tests/common.inc on line 38
¤Îʸ
0123¤³¤Îʸ»úÎó¤ÏÆüËܸì¤Ç¤¹¡£EUC-JP¤ò»È¤Ã¤Æ¤¤¤Þ¤¹¡£ÆüËܸì¤ÏÌÌÅݽ¤¤¡£
OK
OK: 0123¤³¤Îʸ
---- FAILED
================================================================================
001- ¤Îʸ
001+ Parse error: parse error, expecting `')'' in
/Users/kazu/src/php-4.3.0RC3/ext/mbstring/tests/common.inc on line 38
002-
0123¤³¤Îʸ»úÎó¤ÏÆüËܸì¤Ç¤¹¡£EUC-JP¤ò»È¤Ã¤Æ¤¤¤Þ¤¹¡£ÆüËܸì¤ÏÌÌÅݽ¤¤¡£
002+ ¤Îʸ
003- OK
003+
0123¤³¤Îʸ»úÎó¤ÏÆüËܸì¤Ç¤¹¡£EUC-JP¤ò»È¤Ã¤Æ¤¤¤Þ¤¹¡£ÆüËܸì¤ÏÌÌÅݽ¤¤¡£
004- OK: 0123¤³¤Îʸ
004+ OK
005+ OK: 0123¤³¤Îʸ
================================================================================
================================================================================
/Users/kazu/src/php-4.3.0RC3/ext/mbstring/tests/mb_strimwidth.phpt
================================================================================
---- EXPECTED OUTPUT
1: 0123¤³¤Îʸ»ú...
2:
0123¤³¤Îʸ»úÎó¤ÏÆüËܸì¤Ç¤¹¡£EUC-JP¤ò»È¤Ã¤Æ¤¤¤Þ¤¹¡£ÆüËܸì¤ÏÌÌÅݽ¤¤¡£
3: ¡£EUC-JP¤ò»È¤Ã¤Æ¤¤¤Þ¤¹¡£ÆüËܸì¤ÏÌÌÅݽ¤¤¡£
ERR: Warning
4 OK
ERR: Warning
5 OK
ERR: Warning
6 OK
---- ACTUAL OUTPUT
Parse error: parse error, expecting `')'' in
/Users/kazu/src/php-4.3.0RC3/ext/mbstring/tests/common.inc on line 38
1: 0123¤³¤Îʸ»ú...
2:
0123¤³¤Îʸ»úÎó¤ÏÆüËܸì¤Ç¤¹¡£EUC-JP¤ò»È¤Ã¤Æ¤¤¤Þ¤¹¡£ÆüËܸì¤ÏÌÌÅݽ¤¤¡£
3: ¡£EUC-JP¤ò»È¤Ã¤Æ¤¤¤Þ¤¹¡£ÆüËܸì¤ÏÌÌÅݽ¤¤¡£
Warning: mb_strimwidth() [/phpmanual/function.mb-strimwidth.html]: Start position is out of reange
in /Users/kazu/src/php-4.3.0RC3/ext/mbstring/tests/mb_strimwidth.php on line 14
4 OK
Warning: mb_strimwidth() [/phpmanual/function.mb-strimwidth.html]: Start position is out of reange
in /Users/kazu/src/php-4.3.0RC3/ext/mbstring/tests/mb_strimwidth.php on line 17
5 OK
Warning: mb_strimwidth() [/phpmanual/function.mb-strimwidth.html]: Start position is out of reange
in /Users/kazu/src/php-4.3.0RC3/ext/mbstring/tests/mb_strimwidth.php on line 20
6 OK
---- FAILED
================================================================================
001- 1: 0123¤³¤Îʸ»ú...
001+ Parse error: parse error, expecting `')'' in
/Users/kazu/src/php-4.3.0RC3/ext/mbstring/tests/common.inc on line 38
002- 2:
0123¤³¤Îʸ»úÎó¤ÏÆüËܸì¤Ç¤¹¡£EUC-JP¤ò»È¤Ã¤Æ¤¤¤Þ¤¹¡£ÆüËܸì¤ÏÌÌÅݽ¤¤¡£
002+ 1: 0123¤³¤Îʸ»ú...
003- 3: ¡£EUC-JP¤ò»È¤Ã¤Æ¤¤¤Þ¤¹¡£ÆüËܸì¤ÏÌÌÅݽ¤¤¡£
003+ 2:
0123¤³¤Îʸ»úÎó¤ÏÆüËܸì¤Ç¤¹¡£EUC-JP¤ò»È¤Ã¤Æ¤¤¤Þ¤¹¡£ÆüËܸì¤ÏÌÌÅݽ¤¤¡£
004- ERR: Warning
004+ 3: ¡£EUC-JP¤ò»È¤Ã¤Æ¤¤¤Þ¤¹¡£ÆüËܸì¤ÏÌÌÅݽ¤¤¡£
005- 4 OK
005+
006- ERR: Warning
006+ Warning: mb_strimwidth() [/phpmanual/function.mb-strimwidth.html]: Start position is out of
reange in /Users/kazu/src/php-4.3.0RC3/ext/mbstring/tests/mb_strimwidth.php on line 14
007- 5 OK
007+ 4 OK
008- ERR: Warning
008+
009- 6 OK
009+ Warning: mb_strimwidth() [/phpmanual/function.mb-strimwidth.html]: Start position is out of
reange in /Users/kazu/src/php-4.3.0RC3/ext/mbstring/tests/mb_strimwidth.php on line 17
010+ 5 OK
011+
012+ Warning: mb_strimwidth() [/phpmanual/function.mb-strimwidth.html]: Start position is out of
reange in /Users/kazu/src/php-4.3.0RC3/ext/mbstring/tests/mb_strimwidth.php on line 20
013+ 6 OK
================================================================================
================================================================================
/Users/kazu/src/php-4.3.0RC3/ext/mbstring/tests/mb_strlen.phpt
================================================================================
---- EXPECTED OUTPUT
== ASCII ==
ERR: Warning
40
== EUC-JP ==
ERR: Warning
72
== SJIS ==
ERR: Warning
72
== JIS ==
ERR: Warning
121
== UTF-8 ==
ERR: Warning
174
== WRONG PARAMETERS ==
ERR: Notice
5
ERR: Notice
6
ERR: Warning
---- ACTUAL OUTPUT
Parse error: parse error, expecting `')'' in
/Users/kazu/src/php-4.3.0RC3/ext/mbstring/tests/common.inc on line 38
== ASCII ==
Warning: Wrong parameter count for strlen() in
/Users/kazu/src/php-4.3.0RC3/ext/mbstring/tests/mb_strlen.php on line 17
40
== EUC-JP ==
Warning: Wrong parameter count for strlen() in
/Users/kazu/src/php-4.3.0RC3/ext/mbstring/tests/mb_strlen.php on line 22
72
== SJIS ==
Warning: Wrong parameter count for strlen() in
/Users/kazu/src/php-4.3.0RC3/ext/mbstring/tests/mb_strlen.php on line 29
72
== JIS ==
Warning: Wrong parameter count for strlen() in
/Users/kazu/src/php-4.3.0RC3/ext/mbstring/tests/mb_strlen.php on line 37
121
== UTF-8 ==
Warning: Wrong parameter count for strlen() in
/Users/kazu/src/php-4.3.0RC3/ext/mbstring/tests/mb_strlen.php on line 45
174
== WRONG PARAMETERS ==
Notice: Undefined variable: t_ary in /Users/kazu/src/php-4.3.0RC3/ext/mbstring/tests/mb_strlen.php
on line 54
0
Notice: Undefined variable: t_obj in /Users/kazu/src/php-4.3.0RC3/ext/mbstring/tests/mb_strlen.php
on line 58
0
Warning: Wrong parameter count for strlen() in
/Users/kazu/src/php-4.3.0RC3/ext/mbstring/tests/mb_strlen.php on line 62
---- FAILED
================================================================================
001- == ASCII ==
001+ Parse error: parse error, expecting `')'' in
/Users/kazu/src/php-4.3.0RC3/ext/mbstring/tests/common.inc on line 38
002- ERR: Warning
002+ == ASCII ==
004- 40
004+ Warning: Wrong parameter count for strlen() in
/Users/kazu/src/php-4.3.0RC3/ext/mbstring/tests/mb_strlen.php on line 17
005- == EUC-JP ==
005+
006- ERR: Warning
006+ 40
007-
007+ == EUC-JP ==
008- 72
008+
009- == SJIS ==
009+ Warning: Wrong parameter count for strlen() in
/Users/kazu/src/php-4.3.0RC3/ext/mbstring/tests/mb_strlen.php on line 22
010- ERR: Warning
010+
011-
011+ 72
012- 72
012+ == SJIS ==
013- == JIS ==
013+
014- ERR: Warning
014+ Warning: Wrong parameter count for strlen() in
/Users/kazu/src/php-4.3.0RC3/ext/mbstring/tests/mb_strlen.php on line 29
016- 121
016+ 72
017- == UTF-8 ==
017+ == JIS ==
018- ERR: Warning
018+
019-
019+ Warning: Wrong parameter count for strlen() in
/Users/kazu/src/php-4.3.0RC3/ext/mbstring/tests/mb_strlen.php on line 37
020- 174
020+
021- == WRONG PARAMETERS ==
021+ 121
022- ERR: Notice
022+ == UTF-8 ==
023- 5
023+
024- ERR: Notice
024+ Warning: Wrong parameter count for strlen() in
/Users/kazu/src/php-4.3.0RC3/ext/mbstring/tests/mb_strlen.php on line 45
025- 6
025+
026- ERR: Warning
026+ 174
027+ == WRONG PARAMETERS ==
028+
029+ Notice: Undefined variable: t_ary in
/Users/kazu/src/php-4.3.0RC3/ext/mbstring/tests/mb_strlen.php on line 54
030+ 0
031+
032+ Notice: Undefined variable: t_obj in
/Users/kazu/src/php-4.3.0RC3/ext/mbstring/tests/mb_strlen.php on line 58
033+ 0
034+
035+ Warning: Wrong parameter count for strlen() in
/Users/kazu/src/php-4.3.0RC3/ext/mbstring/tests/mb_strlen.php on line 62
================================================================================
================================================================================
/Users/kazu/src/php-4.3.0RC3/ext/mbstring/tests/mb_strpos.phpt
================================================================================
---- EXPECTED OUTPUT
== POSITIVE OFFSET ==
10
0
3
0
34
30
33
30
== NEGATIVE OFFSET ==
ERR: Warning
OK_NEGATIVE_OFFSET
ERR: Warning
OK_NEGATIVE_OFFSET
ERR: Warning
OK_NEGATIVE_OFFSET
ERR: Warning
OK_NEGATIVE_OFFSET
ERR: Warning
OK_NEGATIVE_OFFSET
ERR: Warning
OK_NEGATIVE_OFFSET
ERR: Warning
OK_NEGATIVE_OFFSET
ERR: Warning
OK_NEGATIVE_OFFSET
== OUT OF RANGE ==
OK_OUT_RANGE
OK_OUT_RANGE
OK_OUT_RANGE
OK_OUT_RANGE
== NON-EXISTENT ==
OK_STR
OK_NEWLINE
== NO ENCODING PARAMETER ==
10
0
3
0
OK_STR
OK_NEWLINE
== NO OFFSET AND ENCODING PARAMETER ==
10
0
3
0
OK_STR
OK_NEWLINE
== INVALID PARAMETER TEST ==
ERR: Warning
OK_NULL
ERR: Notice
OK_ARRAY
ERR: Notice
OK_OBJECT
ERR: Notice
OK_BAD_ENCODING
---- ACTUAL OUTPUT
Parse error: parse error in /Users/kazu/src/php-4.3.0RC3/ext/mbstring/tests/mb_strpos.php on line 16
---- FAILED
================================================================================
001- == POSITIVE OFFSET ==
001+ Parse error: parse error in /Users/kazu/src/php-4.3.0RC3/ext/mbstring/tests/mb_strpos.php on
line 16
002- 10
003- 0
004- 3
005- 0
006- 34
007- 30
008- 33
009- 30
010- == NEGATIVE OFFSET ==
011- ERR: Warning
012- OK_NEGATIVE_OFFSET
013- ERR: Warning
014- OK_NEGATIVE_OFFSET
015- ERR: Warning
016- OK_NEGATIVE_OFFSET
017- ERR: Warning
018- OK_NEGATIVE_OFFSET
019- ERR: Warning
020- OK_NEGATIVE_OFFSET
021- ERR: Warning
022- OK_NEGATIVE_OFFSET
023- ERR: Warning
024- OK_NEGATIVE_OFFSET
025- ERR: Warning
026- OK_NEGATIVE_OFFSET
027- == OUT OF RANGE ==
028- OK_OUT_RANGE
029- OK_OUT_RANGE
030- OK_OUT_RANGE
031- OK_OUT_RANGE
032- == NON-EXISTENT ==
033- OK_STR
034- OK_NEWLINE
035- == NO ENCODING PARAMETER ==
036- 10
037- 0
038- 3
039- 0
040- OK_STR
041- OK_NEWLINE
042- == NO OFFSET AND ENCODING PARAMETER ==
043- 10
044- 0
045- 3
046- 0
047- OK_STR
048- OK_NEWLINE
049- == INVALID PARAMETER TEST ==
050- ERR: Warning
051- OK_NULL
052- ERR: Notice
053- OK_ARRAY
054- ERR: Notice
055- OK_OBJECT
056- ERR: Notice
057- OK_BAD_ENCODING
================================================================================
================================================================================
/Users/kazu/src/php-4.3.0RC3/ext/mbstring/tests/mb_strwidth.phpt
================================================================================
---- EXPECTED OUTPUT
1: 68
---- ACTUAL OUTPUT
Parse error: parse error, expecting `')'' in
/Users/kazu/src/php-4.3.0RC3/ext/mbstring/tests/common.inc on line 38
1: 68
---- FAILED
================================================================================
001- 1: 68
001+ Parse error: parse error, expecting `')'' in
/Users/kazu/src/php-4.3.0RC3/ext/mbstring/tests/common.inc on line 38
002+ 1: 68
================================================================================
================================================================================
/Users/kazu/src/php-4.3.0RC3/ext/mbstring/tests/mb_substitute_character.phpt
================================================================================
---- EXPECTED OUTPUT
OK_UTF
12307
OK_LONG
long
OK_NONE
none
== INVALID PARAMETER ==
ERR: Warning
OK_BAD_NAME
---- ACTUAL OUTPUT
Parse error: parse error, expecting `')'' in
/Users/kazu/src/php-4.3.0RC3/ext/mbstring/tests/common.inc on line 38
OK_UTF
12307
OK_LONG
long
OK_NONE
none
== INVALID PARAMETER ==
Warning: mb_substitute_character() [/phpmanual/function.mb-substitute-character.html]: Unknown
character. in /Users/kazu/src/php-4.3.0RC3/ext/mbstring/tests/mb_substitute_character.php on line 29
OK_BAD_NAME
---- FAILED
================================================================================
001- OK_UTF
001+ Parse error: parse error, expecting `')'' in
/Users/kazu/src/php-4.3.0RC3/ext/mbstring/tests/common.inc on line 38
002- 12307
002+ OK_UTF
003- OK_LONG
003+ 12307
004- long
004+ OK_LONG
005- OK_NONE
005+ long
006- none
006+ OK_NONE
007- == INVALID PARAMETER ==
007+ none
008- ERR: Warning
008+ == INVALID PARAMETER ==
009- OK_BAD_NAME
009+
010+ Warning: mb_substitute_character() [/phpmanual/function.mb-substitute-character.html]: Unknown
character. in /Users/kazu/src/php-4.3.0RC3/ext/mbstring/tests/mb_substitute_character.php on line 29
011+ OK_BAD_NAME
================================================================================
================================================================================
/Users/kazu/src/php-4.3.0RC3/ext/mbstring/tests/mb_substr.phpt
================================================================================
---- EXPECTED OUTPUT
1: ÆüËܸì¤Ç¤¹¡£EUC-
2:
0123¤³¤Îʸ»úÎó¤ÏÆüËܸì¤Ç¤¹¡£EUC-JP¤ò»È¤Ã¤Æ¤¤¤Þ¤¹¡£ÆüËܸì¤ÏÌÌÅݽ¤¤¡£
3 OK
4 OK: 0123¤³¤Îʸ»úÎó¤Ï
---- ACTUAL OUTPUT
Parse error: parse error, expecting `')'' in
/Users/kazu/src/php-4.3.0RC3/ext/mbstring/tests/common.inc on line 38
1: ÆüËܸì¤Ç¤¹¡£EUC-
2:
0123¤³¤Îʸ»úÎó¤ÏÆüËܸì¤Ç¤¹¡£EUC-JP¤ò»È¤Ã¤Æ¤¤¤Þ¤¹¡£ÆüËܸì¤ÏÌÌÅݽ¤¤¡£
3 OK
4 OK: 0123¤³¤Îʸ»úÎó¤Ï
---- FAILED
================================================================================
001- 1: ÆüËܸì¤Ç¤¹¡£EUC-
001+ Parse error: parse error, expecting `')'' in
/Users/kazu/src/php-4.3.0RC3/ext/mbstring/tests/common.inc on line 38
002- 2:
0123¤³¤Îʸ»úÎó¤ÏÆüËܸì¤Ç¤¹¡£EUC-JP¤ò»È¤Ã¤Æ¤¤¤Þ¤¹¡£ÆüËܸì¤ÏÌÌÅݽ¤¤¡£
002+ 1: ÆüËܸì¤Ç¤¹¡£EUC-
003- 3 OK
003+ 2:
0123¤³¤Îʸ»úÎó¤ÏÆüËܸì¤Ç¤¹¡£EUC-JP¤ò»È¤Ã¤Æ¤¤¤Þ¤¹¡£ÆüËܸì¤ÏÌÌÅݽ¤¤¡£
004- 4 OK: 0123¤³¤Îʸ»úÎó¤Ï
004+ 3 OK
005+ 4 OK: 0123¤³¤Îʸ»úÎó¤Ï
================================================================================
================================================================================
/Users/kazu/src/php-4.3.0RC3/ext/standard/tests/file/001.phpt
================================================================================
---- EXPECTED OUTPUT
test.file does not exist
test.file exists
test.link exists
test.file is not a symlink
test.link is a symlink
test.file exists
test.link lstat and stat differ at element 1
test.link lstat and stat differ at element 2
test.link lstat and stat differ at element 7
test.link lstat and stat differ at element 8
test.link lstat and stat differ at element 9
test.link lstat and stat differ at element 10
test.file is file
test.link is link
test.file permissions are 0744
test.file size is 0
test.file is writeable
test.file is readable
test.file is executable
test.file is a regular file
test.link is a regular file
test.link is not a directory
../file is a directory
test.file is not a directory
test.file does not exist
test.file does not exist
---- ACTUAL OUTPUT
test.file does not exist
test.file exists
test.link exists
test.file is not a symlink
test.link is a symlink
test.file exists
test.link lstat and stat differ at element 1
test.link lstat and stat differ at element 2
test.link lstat and stat differ at element 7
test.link lstat and stat differ at element 8
test.link lstat and stat differ at element 9
test.file is file
test.link is link
test.file permissions are 0744
test.file size is 0
test.file is writeable
test.file is readable
test.file is executable
test.file is a regular file
test.link is a regular file
test.link is not a directory
../file is a directory
test.file is not a directory
test.file does not exist
test.file does not exist
---- FAILED
================================================================================
012- test.link lstat and stat differ at element 10
012+ test.file is file
013- test.file is file
013+ test.link is link
014- test.link is link
014+ test.file permissions are 0744
015- test.file permissions are 0744
015+ test.file size is 0
016- test.file size is 0
016+ test.file is writeable
017- test.file is writeable
017+ test.file is readable
018- test.file is readable
018+ test.file is executable
019- test.file is executable
019+ test.file is a regular file
020- test.file is a regular file
020+ test.link is a regular file
021- test.link is a regular file
021+ test.link is not a directory
022- test.link is not a directory
022+ ../file is a directory
023- ../file is a directory
023+ test.file is not a directory
024- test.file is not a directory
024+ test.file does not exist
026- test.file does not exist
================================================================================
================================================================================
/Users/kazu/src/php-4.3.0RC3/ext/standard/tests/general_functions/getopt.phpt
================================================================================
---- EXPECTED OUTPUT
array(5) {
["v"]=>
bool(false)
["h"]=>
bool(false)
["d"]=>
string(4) "test"
["m"]=>
string(4) "1234"
["t"]=>
bool(false)
}
---- ACTUAL OUTPUT
array(0) {
}
---- FAILED
================================================================================
001- array(5) {
001+ array(0) {
002- ["v"]=>
002+ }
003- bool(false)
004- ["h"]=>
005- bool(false)
006- ["d"]=>
007- string(4) "test"
008- ["m"]=>
009- string(4) "1234"
010- ["t"]=>
011- bool(false)
012- }
================================================================================
================================================================================
/Users/kazu/src/php-4.3.0RC3/ext/standard/tests/strings/htmlentities01.phpt
================================================================================
---- EXPECTED OUTPUT
string(28) "‚†™Ÿ"
string(32) "€¢£¤¥"
---- ACTUAL OUTPUT
string(28) "‚†™Ÿ"
string(28) "€¡‚£"
---- FAILED
================================================================================
002- string(32) "€¢£¤¥"
002+ string(28) "€¡‚£"
================================================================================
================================================================================
/Users/kazu/src/php-4.3.0RC3/ext/standard/tests/strings/htmlentities02.phpt
================================================================================
---- EXPECTED OUTPUT
string(20) "ŒœŸ"
---- ACTUAL OUTPUT
string(8) "»"
---- FAILED
================================================================================
001- string(20) "ŒœŸ"
001+ string(8) "»"
================================================================================
================================================================================
/Users/kazu/src/php-4.3.0RC3/ext/standard/tests/strings/htmlentities03.phpt
================================================================================
---- EXPECTED OUTPUT
string(18) "äöü"
---- ACTUAL OUTPUT
string(14) "âô"
---- FAILED
================================================================================
001- string(18) "äöü"
001+ string(14) "âô"
================================================================================
================================================================================
/Users/kazu/src/php-4.3.0RC3/ext/standard/tests/strings/htmlentities05.phpt
================================================================================
---- EXPECTED OUTPUT
Windows-1252
string(28) "‚†™Ÿ"
string(32) "€¢£¤¥"
---- ACTUAL OUTPUT
Windows-1252
string(28) "‚†™Ÿ"
string(28) "€¡‚£"
---- FAILED
================================================================================
003- string(32) "€¢£¤¥"
003+ string(28) "€¡‚£"
================================================================================
================================================================================
/Users/kazu/src/php-4.3.0RC3/ext/standard/tests/strings/htmlentities06.phpt
================================================================================
---- EXPECTED OUTPUT
ISO-8859-15
string(20) "ŒœŸ"
---- ACTUAL OUTPUT
ISO-8859-15
string(8) "»"
---- FAILED
================================================================================
002- string(20) "ŒœŸ"
002+ string(8) "»"
================================================================================
================================================================================
/Users/kazu/src/php-4.3.0RC3/ext/standard/tests/strings/htmlentities07.phpt
================================================================================
---- EXPECTED OUTPUT
ISO-8859-1
string(18) "äöü"
---- ACTUAL OUTPUT
ISO-8859-1
string(14) "âô"
---- FAILED
================================================================================
002- string(18) "äöü"
002+ string(14) "âô"
================================================================================
================================================================================
/Users/kazu/src/php-4.3.0RC3/ext/standard/tests/strings/htmlentities08.phpt
================================================================================
---- EXPECTED OUTPUT
EUC-JP
string(6) "¡¢¡£¡¤"
---- ACTUAL OUTPUT
EUC-JP
string(6) "ABC"
---- FAILED
================================================================================
002- string(6) "¡¢¡£¡¤"
002+ string(6) "ABC"
================================================================================
================================================================================
/Users/kazu/src/php-4.3.0RC3/ext/standard/tests/strings/htmlentities10.phpt
================================================================================
---- EXPECTED OUTPUT
cp1252
string(28) "‚†™Ÿ"
string(32) "€¢£¤¥"
---- ACTUAL OUTPUT
cp1252
string(28) "‚†™Ÿ"
string(28) "€¡‚£"
---- FAILED
================================================================================
003- string(32) "€¢£¤¥"
003+ string(28) "€¡‚£"
================================================================================
================================================================================
/Users/kazu/src/php-4.3.0RC3/ext/standard/tests/strings/htmlentities11.phpt
================================================================================
---- EXPECTED OUTPUT
ISO-8859-15
string(20) "ŒœŸ"
---- ACTUAL OUTPUT
ISO-8859-15
string(8) "»"
---- FAILED
================================================================================
002- string(20) "ŒœŸ"
002+ string(8) "»"
================================================================================
================================================================================
/Users/kazu/src/php-4.3.0RC3/ext/standard/tests/strings/htmlentities12.phpt
================================================================================
---- EXPECTED OUTPUT
ISO-8859-1
string(18) "äöü"
---- ACTUAL OUTPUT
ISO-8859-1
string(14) "âô"
---- FAILED
================================================================================
002- string(18) "äöü"
002+ string(14) "âô"
================================================================================
================================================================================
/Users/kazu/src/php-4.3.0RC3/ext/standard/tests/strings/htmlentities13.phpt
================================================================================
---- EXPECTED OUTPUT
EUC-JP
string(6) "¡¢¡£¡¤"
---- ACTUAL OUTPUT
EUC-JP
string(6) "ABC"
---- FAILED
================================================================================
002- string(6) "¡¢¡£¡¤"
002+ string(6) "ABC"
================================================================================
================================================================================
/Users/kazu/src/php-4.3.0RC3/ext/standard/tests/strings/strtoupper.phpt
================================================================================
---- EXPECTED OUTPUT
ÄÖÜ
---- ACTUAL OUTPUT
Parse error: parse error in /Users/kazu/src/php-4.3.0RC3/ext/standard/tests/strings/strtoupper.php
on line 7
---- FAILED
================================================================================
001- ÄÖÜ
001+ Parse error: parse error in
/Users/kazu/src/php-4.3.0RC3/ext/standard/tests/strings/strtoupper.php on line 7
================================================================================
================================================================================
/Users/kazu/src/php-4.3.0RC3/ext/standard/tests/strings/trim.phpt
================================================================================
---- EXPECTED OUTPUT
OK
---- ACTUAL OUTPUT
Assert failed:
'ABC' === trim(" \0\t\nABC \0\t\n")
Left: string(3) "ABC"
Right: string(0) ""
Assert failed:
"ABC \0\t\n" === ltrim(" \0\t\nABC \0\t\n")
Left: string(4) "ABC "
Right: string(0) ""
Assert failed:
" \0\t\nABC" === rtrim(" \0\t\nABC \0\t\n")
Left: string(1) " "
Right: string(0) ""
Warning: trim() [/phpmanual/function.trim.html]: Invalid '..'-range, no character to the
right of '..'. in /Users/kazu/src/php-4.3.0RC3/tests/quicktester.inc(48) : eval()'d
code on line 1
Assert failed:
"ABC\x50\xC1" === trim("ABC\x50\xC1\x60\x90","\x51..\xC0")
Left: string(4) "ABCP"
Right: string(7) "ABCP"
Warning: trim() [/phpmanual/function.trim.html]: Invalid '..'-range, no character to the
right of '..'. in /Users/kazu/src/php-4.3.0RC3/tests/quicktester.inc(48) : eval()'d
code on line 1
Assert failed:
"ABC\x50" === trim("ABC\x50\xC1\x60\x90","\x51..\xC1")
Left: string(4) "ABCP"
Right: string(7) "ABCP"
Warning: trim() [/phpmanual/function.trim.html]: Invalid '..'-range, no character to the
right of '..'. in /Users/kazu/src/php-4.3.0RC3/tests/quicktester.inc(48) : eval()'d
code on line 1
Assert failed:
"ABC" === trim("ABC\x50\xC1\x60\x90","\x50..\xC1")
Left: string(3) "ABC"
Right: string(7) "ABCP"
Warning: trim() [/phpmanual/function.trim.html]: Invalid '..'-range, no character to the
right of '..'. in /Users/kazu/src/php-4.3.0RC3/tests/quicktester.inc(48) : eval()'d
code on line 1
Assert failed:
"ABC\x50\xC1" === trim("ABC\x50\xC1\x60\x90","\x51..\xC0")
Left: string(4) "ABCP"
Right: string(7) "ABCP"
Warning: trim() [/phpmanual/function.trim.html]: Invalid '..'-range, no character to the
right of '..'. in /Users/kazu/src/php-4.3.0RC3/tests/quicktester.inc(48) : eval()'d
code on line 1
Assert failed:
"ABC\x50" === trim("ABC\x50\xC1\x60\x90","\x51..\xC1")
Left: string(4) "ABCP"
Right: string(7) "ABCP"
Warning: trim() [/phpmanual/function.trim.html]: Invalid '..'-range, no character to the
right of '..'. in /Users/kazu/src/php-4.3.0RC3/tests/quicktester.inc(48) : eval()'d
code on line 1
Assert failed:
"ABC" === trim("ABC\x50\xC1\x60\x90","\x50..\xC1")
Left: string(3) "ABC"
Right: string(7) "ABCP"
---- FAILED
================================================================================
001- OK
001+ Assert failed:
002+ 'ABC' === trim(" \0\t\nABC \0\t\n")
003+ Left: string(3) "ABC"
004+ Right: string(0) ""
005+
006+ Assert failed:
007+ "ABC \0\t\n" === ltrim(" \0\t\nABC \0\t\n")
008+ Left: string(4) "ABC "
009+ Right: string(0) ""
010+
011+ Assert failed:
012+ " \0\t\nABC" === rtrim(" \0\t\nABC \0\t\n")
013+ Left: string(1) " "
014+ Right: string(0) ""
015+
016+ Warning: trim() [/phpmanual/function.trim.html]: Invalid '..'-range, no character to
the right of '..'. in /Users/kazu/src/php-4.3.0RC3/tests/quicktester.inc(48) :
eval()'d code on line 1
017+
018+ Assert failed:
019+ "ABC\x50\xC1" === trim("ABC\x50\xC1\x60\x90","\x51..\xC0")
020+ Left: string(4) "ABCP"
021+ Right: string(7) "ABCP"
022+
023+ Warning: trim() [/phpmanual/function.trim.html]: Invalid '..'-range, no character to
the right of '..'. in /Users/kazu/src/php-4.3.0RC3/tests/quicktester.inc(48) :
eval()'d code on line 1
024+
025+ Assert failed:
026+ "ABC\x50" === trim("ABC\x50\xC1\x60\x90","\x51..\xC1")
027+ Left: string(4) "ABCP"
028+ Right: string(7) "ABCP"
029+
030+ Warning: trim() [/phpmanual/function.trim.html]: Invalid '..'-range, no character to
the right of '..'. in /Users/kazu/src/php-4.3.0RC3/tests/quicktester.inc(48) :
eval()'d code on line 1
031+
032+ Assert failed:
033+ "ABC" === trim("ABC\x50\xC1\x60\x90","\x50..\xC1")
034+ Left: string(3) "ABC"
035+ Right: string(7) "ABCP"
036+
037+ Warning: trim() [/phpmanual/function.trim.html]: Invalid '..'-range, no character to
the right of '..'. in /Users/kazu/src/php-4.3.0RC3/tests/quicktester.inc(48) :
eval()'d code on line 1
038+
039+ Assert failed:
040+ "ABC\x50\xC1" === trim("ABC\x50\xC1\x60\x90","\x51..\xC0")
041+ Left: string(4) "ABCP"
042+ Right: string(7) "ABCP"
043+
044+ Warning: trim() [/phpmanual/function.trim.html]: Invalid '..'-range, no character to
the right of '..'. in /Users/kazu/src/php-4.3.0RC3/tests/quicktester.inc(48) :
eval()'d code on line 1
045+
046+ Assert failed:
047+ "ABC\x50" === trim("ABC\x50\xC1\x60\x90","\x51..\xC1")
048+ Left: string(4) "ABCP"
049+ Right: string(7) "ABCP"
050+
051+ Warning: trim() [/phpmanual/function.trim.html]: Invalid '..'-range, no character to
the right of '..'. in /Users/kazu/src/php-4.3.0RC3/tests/quicktester.inc(48) :
eval()'d code on line 1
052+
053+ Assert failed:
054+ "ABC" === trim("ABC\x50\xC1\x60\x90","\x50..\xC1")
055+ Left: string(3) "ABC"
056+ Right: string(7) "ABCP"
================================================================================
================================================================================
/Users/kazu/src/php-4.3.0RC3/ext/xml/tests/xml006.phpt
================================================================================
---- EXPECTED OUTPUT
%E6 -> %C3%A6
%E6 <- %C3%A6
---- ACTUAL OUTPUT
Parse error: parse error in /Users/kazu/src/php-4.3.0RC3/ext/xml/tests/xml006.php on line 2
---- FAILED
================================================================================
001- %E6 -> %C3%A6
001+ Parse error: parse error in /Users/kazu/src/php-4.3.0RC3/ext/xml/tests/xml006.php on line 2
002- %E6 <- %C3%A6
================================================================================
================================================================================
BUILD ENVIRONMENT
================================================================================
OS:
Darwin
Automake:
automake (GNU automake) 1.6.1
Written by Tom Tromey <tromey@redhat.com>.
Copyright 2002 Free Software Foundation, Inc.
This is free software; see the source for copying conditions. There is NO
warranty; not even for MERCHANTABILITY or FITNESS FOR A PARTICULAR PURPOSE.
Autoconf:
autoconf (GNU Autoconf) 2.52
Written by David J. MacKenzie.
Copyright 1992, 1993, 1994, 1996, 1999, 2000, 2001
Free Software Foundation, Inc.
This is free software; see the source for copying conditions. There is NO
warranty; not even for MERCHANTABILITY or FITNESS FOR A PARTICULAR PURPOSE.
Libtool:
Compiler:
Reading specs from /usr/libexec/gcc/darwin/ppc/3.1/specs
Thread model: posix
Apple Computer, Inc. GCC version 1151, based on gcc version 3.1 20020420 (prerelease)
Bison:
GNU Bison version 1.28
User's E-mail: kazu at csplan dot co dot jp
================================================================================
PHPINFO
================================================================================
phpinfo()
PHP Version => 4.3.0RC3
System => Darwin Macintosh.local. 6.2 Darwin Kernel Version 6.2: Tue Nov 5 22:00:03 PST 2002;
root:xnu/xnu-344.12.2.obj~1/RELEASE_PPC Power Macintosh
Build Date => Dec 12 2002 12:36:40
Configure Command => './configure' '--with-pgsql'
'--with-apxs=/usr/sbin/apxs' '--enable-mbregex' '--enable-mbstring'
'--with-config-file-path=/Users/kazu/php' '--enable-zend-multibyte'
'--enable-versioning' '--enable-ftp'
Server API => Command Line Interface
Virtual Directory Support => disabled
Configuration File (php.ini) Path => /Users/kazu/php/php.ini
PHP API => 20020918
PHP Extension => 20020429
Zend Extension => 20021010
Debug Build => no
Thread Safety => disabled
Registered PHP Streams => php, http, ftp
This program makes use of the Zend Scripting Language Engine:
Zend Engine v1.3.0, Copyright (c) 1998-2002 Zend Technologies
_______________________________________________________________________
Configuration
PHP Core
Directive => Local Value => Master Value
allow_call_time_pass_reference => Off => Off
allow_url_fopen => On => On
always_populate_raw_post_data => Off => Off
arg_separator.input => & => &
arg_separator.output => & => &
asp_tags => Off => Off
auto_append_file => no value => no value
auto_prepend_file => no value => no value
browscap => no value => no value
default_charset => no value => no value
default_mimetype => text/html => text/html
define_syslog_variables => Off => Off
disable_functions => no value => no value
display_errors => Off => Off
display_startup_errors => Off => Off
doc_root => no value => no value
docref_ext => no value => no value
docref_root => http://www.php.net/ => http://www.php.net/
enable_dl => On => On
error_append_string => no value => no value
error_log => no value => no value
error_prepend_string => no value => no value
error_reporting => 2047 => 2047
expose_php => On => On
extension_dir => ./ => ./
file_uploads => On => On
gpc_order => GPC => GPC
highlight.bg => #FFFFFF => #FFFFFF
highlight.comment => #FF8000 => #FF8000
highlight.default => #0000BB => #0000BB
highlight.html => #000000 => #000000
highlight.keyword => #007700 => #007700
highlight.string => #DD0000 => #DD0000
html_errors => Off => On
ignore_repeated_errors => Off => Off
ignore_repeated_source => Off => Off
ignore_user_abort => Off => Off
implicit_flush => On => Off
include_path => .:/usr/local/lib/php => .:/usr/local/lib/php
log_errors => On => On
log_errors_max_len => 1024 => 1024
magic_quotes_gpc => Off => Off
magic_quotes_runtime => Off => Off
magic_quotes_sybase => Off => Off
max_execution_time => 0 => 30
max_input_time => 60 => 60
open_basedir => no value => no value
output_buffering => 4096 => 4096
output_handler => mb_output_handler => mb_output_handler
post_max_size => 8M => 8M
precision => 14 => 14
register_argc_argv => On => Off
register_globals => Off => Off
report_memleaks => On => On
safe_mode => Off => Off
safe_mode_exec_dir => no value => no value
safe_mode_gid => Off => Off
safe_mode_include_dir => no value => no value
sendmail_from => me@localhost.com => me@localhost.com
sendmail_path => /usr/sbin/sendmail -t -i => /usr/sbin/sendmail -t -i
short_open_tag => On => On
SMTP => localhost => localhost
smtp_port => 25 => 25
sql.safe_mode => Off => Off
track_errors => Off => Off
unserialize_callback_func => no value => no value
upload_max_filesize => 2M => 2M
upload_tmp_dir => no value => no value
user_dir => no value => no value
variables_order => GPCS => GPCS
xmlrpc_error_number => 0 => 0
xmlrpc_errors => Off => Off
y2k_compliance => On => On
ctype
ctype functions => enabled
mbstring
Multibyte Support => enabled
Japanese support => enabled
Multibyte (japanese) regex support => enabled
Directive => Local Value => Master Value
mbstring.detect_order => auto => auto
mbstring.encoding_translation => On => On
mbstring.func_overload => 0 => 0
mbstring.http_input => auto => auto
mbstring.http_output => SJIS => SJIS
mbstring.internal_encoding => EUC-JP => EUC-JP
mbstring.language => Japanese => Japanese
mbstring.script_encoding => SJIS => SJIS
mbstring.substitute_character => no value => no value
mysql
MySQL Support => enabled
Active Persistent Links => 0
Active Links => 0
Client API version => 3.23.49
MYSQL_MODULE_TYPE => builtin
MYSQL_SOCKET => /tmp/mysql.sock
MYSQL_INCLUDE => MYSQL_LIBS =>
Directive => Local Value => Master Value
mysql.allow_persistent => On => On
mysql.connect_timeout => -1 => -1
mysql.default_host => no value => no value
mysql.default_password => no value => no value
mysql.default_port => no value => no value
mysql.default_socket => no value => no value
mysql.default_user => no value => no value
mysql.max_links => Unlimited => Unlimited
mysql.max_persistent => Unlimited => Unlimited
mysql.trace_mode => Off => Off
overload
User-Space Object Overloading Support => enabled
pcre
PCRE (Perl Compatible Regular Expressions) Support => enabled
PCRE Library Version => 3.92 11-Sep-2002
pgsql
PostgreSQL Support => enabled
PostgreSQL(libpq) Version => 7.2.3
Multibyte charater support => enabled
SSL support => disabled
Active Persistent Links => 0
Active Links => 0
Directive => Local Value => Master Value
pgsql.allow_persistent => On => On
pgsql.auto_reset_persistent => Off => Off
pgsql.ignore_notice => Off => Off
pgsql.log_notice => Off => Off
pgsql.max_links => Unlimited => Unlimited
pgsql.max_persistent => Unlimited => Unlimited
posix
Revision => $Revision: 1.51 $
session
Session Support => enabled
Registered save handlers => files user
Directive => Local Value => Master Value
session.auto_start => Off => Off
session.bug_compat_42 => Off => Off
session.bug_compat_warn => On => On
session.cache_expire => 180 => 180
session.cache_limiter => nocache => nocache
session.cookie_domain => no value => no value
session.cookie_lifetime => 0 => 0
session.cookie_path => / => /
session.cookie_secure => Off => Off
session.entropy_file => no value => no value
session.entropy_length => 0 => 0
session.gc_dividend => 1000 => 1000
session.gc_maxlifetime => 1440 => 1440
session.gc_probability => 1 => 1
session.name => PHPSESSID => PHPSESSID
session.referer_check => no value => no value
session.save_handler => files => files
session.save_path => /tmp => /tmp
session.serialize_handler => php => php
session.use_cookies => On => On
session.use_only_cookies => Off => Off
session.use_trans_sid => Off => Off
standard
Regex Library => Bundled library enabled
Dynamic Library Support => enabled
Path to sendmail => /usr/sbin/sendmail -t -i
Directive => Local Value => Master Value
assert.active => 1 => 1
assert.bail => 0 => 0
assert.callback => no value => no value
assert.quiet_eval => 0 => 0
assert.warning => 1 => 1
auto_detect_line_endings => 0 => 0
default_socket_timeout => 60 => 60
safe_mode_allowed_env_vars => PHP_ => PHP_
safe_mode_protected_env_vars => LD_LIBRARY_PATH => LD_LIBRARY_PATH
url_rewriter.tags => a=href,area=href,frame=src,input=src,form=fakeentry =>
a=href,area=href,frame=src,input=src,form=fakeentry
user_agent => no value => no value
tokenizer
Tokenizer Support => enabled
xml
XML Support => active
XML Namespace Support => active
EXPAT Version => 1.95.2
Additional Modules
Module Name
Environment
Variable => Value
PWD => /Users/kazu/src/php-4.3.0RC3
MAKEFLAGS => VENDOR => apple
MFLAGS => REDIRECT_STATUS => TEST_PHP_EXECUTABLE =>
/Users/kazu/src/php-4.3.0RC3/sapi/cli/php
CC => gcc
USER => kazu
MACHTYPE => powerpc
SCRIPT_FILENAME => PATH_TRANSLATED => LANG => ja_JP
QUERY_STRING => CONTENT_LENGTH => HOST => Macintosh.local.
MAKELEVEL => 1
SHLVL => 3
LOGNAME => kazu
GROUP => staff
_ => /Users/kazu/src/php-4.3.0RC3/sapi/cli/php
REQUEST_METHOD => SHELL => /bin/sh
HOSTTYPE => macintosh
TEST_PHP_SRCDIR => /Users/kazu/src/php-4.3.0RC3
OSTYPE => darwin
TERM => vt100
HOME => /Users/kazu
PATH => /bin:/sbin:/usr/bin:/usr/sbin:/usr/local/pgsql/bin
__CF_USER_TEXT_ENCODING => 0x1F5:1:14
CONTENT_TYPE =>
PHP Variables
Variable => Value
_SERVER["PWD"] => /Users/kazu/src/php-4.3.0RC3
_SERVER["MAKEFLAGS"] =>
_SERVER["VENDOR"] => apple
_SERVER["MFLAGS"] =>
_SERVER["REDIRECT_STATUS"] =>
_SERVER["TEST_PHP_EXECUTABLE"] => /Users/kazu/src/php-4.3.0RC3/sapi/cli/php
_SERVER["CC"] => gcc
_SERVER["USER"] => kazu
_SERVER["MACHTYPE"] => powerpc
_SERVER["SCRIPT_FILENAME"] =>
_SERVER["PATH_TRANSLATED"] =>
_SERVER["LANG"] => ja_JP
_SERVER["QUERY_STRING"] =>
_SERVER["CONTENT_LENGTH"] =>
_SERVER["HOST"] => Macintosh.local.
_SERVER["MAKELEVEL"] => 1
_SERVER["SHLVL"] => 3
_SERVER["LOGNAME"] => kazu
_SERVER["GROUP"] => staff
_SERVER["_"] => /Users/kazu/src/php-4.3.0RC3/sapi/cli/php
_SERVER["REQUEST_METHOD"] =>
_SERVER["SHELL"] => /bin/sh
_SERVER["HOSTTYPE"] => macintosh
_SERVER["TEST_PHP_SRCDIR"] => /Users/kazu/src/php-4.3.0RC3
_SERVER["OSTYPE"] => darwin
_SERVER["TERM"] => vt100
_SERVER["HOME"] => /Users/kazu
_SERVER["PATH"] => /bin:/sbin:/usr/bin:/usr/sbin:/usr/local/pgsql/bin
_SERVER["__CF_USER_TEXT_ENCODING"] => 0x1F5:1:14
_SERVER["CONTENT_TYPE"] =>
_SERVER["PHP_SELF"] =>
_SERVER["SCRIPT_NAME"] =>
_SERVER["DOCUMENT_ROOT"] =>
_SERVER["argv"] => Array
(
)
_SERVER["argc"] => 0
PHP License
This program is free software; you can redistribute it and/or modify
it under the terms of the PHP License as published by the PHP Group
and included in the distribution in the file: LICENSE
This program is distributed in the hope that it will be useful,
but WITHOUT ANY WARRANTY; without even the implied warranty of
MERCHANTABILITY or FITNESS FOR A PARTICULAR PURPOSE.
If you did not receive a copy of the PHP license, or have any
questions about PHP licensing, please contact license@php.net.