Test results

From: Date: Thu, 12 Dec 2002 09:10:11 +0000
Subject: Test results
Groups: php.qa 
Request: Send a blank email to php-qa+get-7200@lists.php.net to get a copy of this message
===================================================================== FAILED TEST SUMMARY --------------------------------------------------------------------- session object serialization [ext/session/tests/001.phpt] session object deserialization [ext/session/tests/003.phpt] correct instantiation of references between variables in sessions [ext/session/tests/006.phpt] bug compatibility: unset($c) with enabled register_globals [ext/session/tests/007.phpt] bug compatibility: global is used albeit register_globals=0 [ext/session/tests/008-php4.2.3.phpt] unset($_SESSION["name"]); should work with register_globals=off [ext/session/tests/009.phpt] registering $_SESSION should not segfault [ext/session/tests/012.phpt] redefining SID should not cause warnings [ext/session/tests/013.phpt] a script should not be able to modify session.use_trans_sid [ext/session/tests/014.phpt] use_trans_sid should not affect SID [ext/session/tests/015.phpt] invalid session.save_path should not cause a segfault [ext/session/tests/016.phpt] setting $_SESSION before session_start() should not cause segfault [ext/session/tests/017.phpt] rewriter correctly handles attribute names which contain dashes [ext/session/tests/018.phpt] serializing references test case using globals [ext/session/tests/019.phpt] rewriter uses arg_seperator.output for modifying URLs [ext/session/tests/020.phpt] rewriter handles form and fieldset tags correctly [ext/session/tests/021.phpt] htmlentities() test 2 (setlocale / fr_FR.ISO-8859-15) [ext/standard/tests/strings/htmlentities02.phpt] ===================================================================== ================================================================================ /usr/local/src/php-4.3.0RC2/ext/session/tests/001.phpt ================================================================================ ---- EXPECTED OUTPUT baz|O:3:"foo":2:{s:3:"bar";s:2:"ok";s:3:"yes";s:4:"done";}arr|a:1:{i:3;O:3:"foo":2:{s:3:"bar";s:2:"ok";s:3:"yes";s:4:"done";}} ---- ACTUAL OUTPUT Fatal error: Failed to initialize session module in /usr/local/src/php-4.3.0RC2/ext/session/tests/001.php on line 16 ---- FAILED ================================================================================ 001- baz|O:3:"foo":2:{s:3:"bar";s:2:"ok";s:3:"yes";s:4:"done";}arr|a:1:{i:3;O:3:"foo":2:{s:3:"bar";s:2:"ok";s:3:"yes";s:4:"done";}} 001+ Fatal error: Failed to initialize session module in /usr/local/src/php-4.3.0RC2/ext/session/tests/001.php on line 16 ================================================================================ ================================================================================ /usr/local/src/php-4.3.0RC2/ext/session/tests/003.phpt ================================================================================ ---- EXPECTED OUTPUT object(foo)(2) { ["bar"]=> string(2) "ok" ["yes"]=> int(2) } array(1) { [3]=> &object(foo)(2) { ["bar"]=> string(2) "ok" ["yes"]=> int(2) } } ---- ACTUAL OUTPUT Fatal error: Failed to initialize session module in /usr/local/src/php-4.3.0RC2/ext/session/tests/003.php on line 10 ---- FAILED ================================================================================ 001- object(foo)(2) { 001+ Fatal error: Failed to initialize session module in /usr/local/src/php-4.3.0RC2/ext/session/tests/003.php on line 10 002- ["bar"]=> 003- string(2) "ok" 004- ["yes"]=> 005- int(2) 006- } 007- array(1) { 008- [3]=> 009- &object(foo)(2) { 010- ["bar"]=> 011- string(2) "ok" 012- ["yes"]=> 013- int(2) 014- } 015- } ================================================================================ ================================================================================ /usr/local/src/php-4.3.0RC2/ext/session/tests/006.phpt ================================================================================ ---- EXPECTED OUTPUT original values: object(a)(1) { ["test"]=> string(5) "hallo" } object(b)(1) { ["a"]=> &object(a)(1) { ["test"]=> string(5) "hallo" } } values after session: object(a)(1) { ["test"]=> string(5) "hallo" } object(b)(1) { ["a"]=> &object(a)(1) { ["test"]=> string(5) "hallo" } } ---- ACTUAL OUTPUT Fatal error: Failed to initialize session module in /usr/local/src/php-4.3.0RC2/ext/session/tests/006.php on line 5 ---- FAILED ================================================================================ 001- original values: 001+ Fatal error: Failed to initialize session module in /usr/local/src/php-4.3.0RC2/ext/session/tests/006.php on line 5 002- object(a)(1) { 003- ["test"]=> 004- string(5) "hallo" 005- } 006- object(b)(1) { 007- ["a"]=> 008- &object(a)(1) { 009- ["test"]=> 010- string(5) "hallo" 011- } 012- } 013- values after session: 014- object(a)(1) { 015- ["test"]=> 016- string(5) "hallo" 017- } 018- object(b)(1) { 019- ["a"]=> 020- &object(a)(1) { 021- ["test"]=> 022- string(5) "hallo" 023- } 024- } ================================================================================ ================================================================================ /usr/local/src/php-4.3.0RC2/ext/session/tests/007.phpt ================================================================================ ---- EXPECTED OUTPUT float(3.14) array(1) { ["c"]=> &float(3.14) } float(3.14) array(1) { ["c"]=> &float(3.14) } ---- ACTUAL OUTPUT Fatal error: Failed to initialize session module in /usr/local/src/php-4.3.0RC2/ext/session/tests/007.php on line 7 ---- FAILED ================================================================================ 001- float(3.14) 001+ Fatal error: Failed to initialize session module in /usr/local/src/php-4.3.0RC2/ext/session/tests/007.php on line 7 002- array(1) { 003- ["c"]=> 004- &float(3.14) 005- } 006- float(3.14) 007- array(1) { 008- ["c"]=> 009- &float(3.14) 010- } ================================================================================ ================================================================================ /usr/local/src/php-4.3.0RC2/ext/session/tests/008-php4.2.3.phpt ================================================================================ ---- EXPECTED OUTPUT NULL Your script possibly relies on a session side-effect which existed until PHP 4.2.3. Please be advised that the session extension does not consider global variables as a source of data, unless register_globals is enabled. You can disable this functionality and this warning by setting session.bug_compat_42 or session.bug_compat_warn to off, respectively. array(1) { ["c"]=> float(3.14) } NULL array(1) { ["c"]=> float(3.14) } ---- ACTUAL OUTPUT Fatal error: Failed to initialize session module in /usr/local/src/php-4.3.0RC2/ext/session/tests/008-php4.2.3.php on line 5 ---- FAILED ================================================================================ 001- NULL 001+ Fatal error: Failed to initialize session module in /usr/local/src/php-4.3.0RC2/ext/session/tests/008-php4.2.3.php on line 5 002- Your script possibly relies on a session side-effect which existed until PHP 4.2.3. Please be advised that the session extension does not consider global variables as a source of data, unless register_globals is enabled. You can disable this functionality and this warning by setting session.bug_compat_42 or session.bug_compat_warn to off, respectively. 003- array(1) { 004- ["c"]=> 005- float(3.14) 006- } 007- NULL 008- array(1) { 009- ["c"]=> 010- float(3.14) 011- } ================================================================================ ================================================================================ /usr/local/src/php-4.3.0RC2/ext/session/tests/009.phpt ================================================================================ ---- EXPECTED OUTPUT array(0) { } array(1) { ["name"]=> string(3) "foo" } array(1) { ["name"]=> string(3) "foo" } array(0) { } array(0) { } ---- ACTUAL OUTPUT Fatal error: Failed to initialize session module in /usr/local/src/php-4.3.0RC2/ext/session/tests/009.php on line 7 ---- FAILED ================================================================================ 001- array(0) { 001+ Fatal error: Failed to initialize session module in /usr/local/src/php-4.3.0RC2/ext/session/tests/009.php on line 7 002- } 003- array(1) { 004- ["name"]=> 005- string(3) "foo" 006- } 007- array(1) { 008- ["name"]=> 009- string(3) "foo" 010- } 011- array(0) { 012- } 013- array(0) { 014- } ================================================================================ ================================================================================ /usr/local/src/php-4.3.0RC2/ext/session/tests/012.phpt ================================================================================ ---- EXPECTED OUTPUT I live ---- ACTUAL OUTPUT Fatal error: Failed to initialize session module in /usr/local/src/php-4.3.0RC2/ext/session/tests/012.php on line 7 ---- FAILED ================================================================================ 001- I live 001+ Fatal error: Failed to initialize session module in /usr/local/src/php-4.3.0RC2/ext/session/tests/012.php on line 7 ================================================================================ ================================================================================ /usr/local/src/php-4.3.0RC2/ext/session/tests/013.phpt ================================================================================ ---- EXPECTED OUTPUT I live ---- ACTUAL OUTPUT Fatal error: Failed to initialize session module in /usr/local/src/php-4.3.0RC2/ext/session/tests/013.php on line 5 ---- FAILED ================================================================================ 001- I live 001+ Fatal error: Failed to initialize session module in /usr/local/src/php-4.3.0RC2/ext/session/tests/013.php on line 5 ================================================================================ ================================================================================ /usr/local/src/php-4.3.0RC2/ext/session/tests/014.phpt ================================================================================ ---- EXPECTED OUTPUT <a href="/link?PHPSESSID=abtest"> <a href="/link?PHPSESSID=abtest"> <a href="/link?PHPSESSID=abtest"> ---- ACTUAL OUTPUT Fatal error: Failed to initialize session module in /usr/local/src/php-4.3.0RC2/ext/session/tests/014.php on line 5 ---- FAILED ================================================================================ 001- <a href="/link?PHPSESSID=abtest"> 001+ Fatal error: Failed to initialize session module in /usr/local/src/php-4.3.0RC2/ext/session/tests/014.php on line 5 002- <a href="/link?PHPSESSID=abtest"> 003- <a href="/link?PHPSESSID=abtest"> ================================================================================ ================================================================================ /usr/local/src/php-4.3.0RC2/ext/session/tests/015.phpt ================================================================================ ---- EXPECTED OUTPUT <a href="/link?PHPSESSID=abtest&PHPSESSID=abtest"> ---- ACTUAL OUTPUT Fatal error: Failed to initialize session module in /usr/local/src/php-4.3.0RC2/ext/session/tests/015.php on line 5 ---- FAILED ================================================================================ 001- <a href="/link?PHPSESSID=abtest&PHPSESSID=abtest"> 001+ Fatal error: Failed to initialize session module in /usr/local/src/php-4.3.0RC2/ext/session/tests/015.php on line 5 ================================================================================ ================================================================================ /usr/local/src/php-4.3.0RC2/ext/session/tests/016.phpt ================================================================================ ---- EXPECTED OUTPUT I live ---- ACTUAL OUTPUT ---- FAILED ================================================================================ 001- I live 001+ ================================================================================ ================================================================================ /usr/local/src/php-4.3.0RC2/ext/session/tests/017.phpt ================================================================================ ---- EXPECTED OUTPUT I live ---- ACTUAL OUTPUT Fatal error: Failed to initialize session module in /usr/local/src/php-4.3.0RC2/ext/session/tests/017.php on line 8 ---- FAILED ================================================================================ 001- I live 001+ Fatal error: Failed to initialize session module in /usr/local/src/php-4.3.0RC2/ext/session/tests/017.php on line 8 ================================================================================ ================================================================================ /usr/local/src/php-4.3.0RC2/ext/session/tests/018.phpt ================================================================================ ---- EXPECTED OUTPUT <form accept-charset="ISO-8859-15, ISO-8859-1" action=url.php><input type="hidden" name="PHPSESSID" value="abtest" /> ---- ACTUAL OUTPUT Fatal error: Failed to initialize session module in /usr/local/src/php-4.3.0RC2/ext/session/tests/018.php on line 6 ---- FAILED ================================================================================ 001- <form accept-charset="ISO-8859-15, ISO-8859-1" action=url.php><input type="hidden" name="PHPSESSID" value="abtest" /> 001+ Fatal error: Failed to initialize session module in /usr/local/src/php-4.3.0RC2/ext/session/tests/018.php on line 6 ================================================================================ ================================================================================ /usr/local/src/php-4.3.0RC2/ext/session/tests/019.phpt ================================================================================ ---- EXPECTED OUTPUT array(2) { ["o1"]=> &object(tfoo)(1) { ["c"]=> int(42) } ["o2"]=> &object(tfoo)(1) { ["c"]=> int(42) } } array(2) { ["o1"]=> &object(tfoo)(1) { ["c"]=> int(44) } ["o2"]=> &object(tfoo)(1) { ["c"]=> int(44) } } ---- ACTUAL OUTPUT Fatal error: Failed to initialize session module in /usr/local/src/php-4.3.0RC2/ext/session/tests/019.php on line 16 ---- FAILED ================================================================================ 001- array(2) { 001+ Fatal error: Failed to initialize session module in /usr/local/src/php-4.3.0RC2/ext/session/tests/019.php on line 16 002- ["o1"]=> 003- &object(tfoo)(1) { 004- ["c"]=> 005- int(42) 006- } 007- ["o2"]=> 008- &object(tfoo)(1) { 009- ["c"]=> 010- int(42) 011- } 012- } 013- array(2) { 014- ["o1"]=> 015- &object(tfoo)(1) { 016- ["c"]=> 017- int(44) 018- } 019- ["o2"]=> 020- &object(tfoo)(1) { 021- ["c"]=> 022- int(44) 023- } 024- } ================================================================================ ================================================================================ /usr/local/src/php-4.3.0RC2/ext/session/tests/020.phpt ================================================================================ ---- EXPECTED OUTPUT <a href="link.php?a=b&amp;PHPSESSID=abtest"> ---- ACTUAL OUTPUT Fatal error: Failed to initialize session module in /usr/local/src/php-4.3.0RC2/ext/session/tests/020.php on line 6 ---- FAILED ================================================================================ 001- <a href="link.php?a=b&amp;PHPSESSID=abtest"> 001+ Fatal error: Failed to initialize session module in /usr/local/src/php-4.3.0RC2/ext/session/tests/020.php on line 6 ================================================================================ ================================================================================ /usr/local/src/php-4.3.0RC2/ext/session/tests/021.phpt ================================================================================ ---- EXPECTED OUTPUT <form><input type="hidden" name="PHPSESSID" value="abtest" /> <fieldset><input type="hidden" name="PHPSESSID" value="abtest" /> <form><input type="hidden" name="PHPSESSID" value="abtest" /> <fieldset> <form><input type="hidden" name="PHPSESSID" value="abtest" /> <fieldset> <form> <fieldset><input type="hidden" name="PHPSESSID" value="abtest" /> ---- ACTUAL OUTPUT Fatal error: Failed to initialize session module in /usr/local/src/php-4.3.0RC2/ext/session/tests/021.php on line 6 ---- FAILED ================================================================================ 001- <form><input type="hidden" name="PHPSESSID" value="abtest" /> 001+ Fatal error: Failed to initialize session module in /usr/local/src/php-4.3.0RC2/ext/session/tests/021.php on line 6 002- <fieldset><input type="hidden" name="PHPSESSID" value="abtest" /> 003- <form><input type="hidden" name="PHPSESSID" value="abtest" /> 004- <fieldset> 005- <form><input type="hidden" name="PHPSESSID" value="abtest" /> 006- <fieldset> 007- <form> 008- <fieldset><input type="hidden" name="PHPSESSID" value="abtest" /> ================================================================================ ================================================================================ /usr/local/src/php-4.3.0RC2/ext/standard/tests/strings/htmlentities02.phpt ================================================================================ ---- EXPECTED OUTPUT string(20) "&OElig;&oelig;&Yuml;" ---- ACTUAL OUTPUT string(24) "&frac14;&frac12;&frac34;" ---- FAILED ================================================================================ 001- string(20) "&OElig;&oelig;&Yuml;" 001+ string(24) "&frac14;&frac12;&frac34;" ================================================================================ ================================================================================ BUILD ENVIRONMENT ================================================================================ OS: Linux Automake: automake (GNU automake) 1.4 Copyright (C) 1999 Free Software Foundation, Inc. This is free software; see the source for copying conditions. There is NO warranty; not even for MERCHANTABILITY or FITNESS FOR A PARTICULAR PURPOSE. Written by Tom Tromey <tromey@cygnus.com> Autoconf: Autoconf version 2.13 Libtool: ltmain.sh (GNU libtool) 1.3.5 (1.385.2.206 2000/05/27 11:12:27) Compiler: Reading specs from /usr/lib/gcc-lib/i486-suse-linux/2.95.2/specs gcc version 2.95.2 19991024 (release) Bison: GNU Bison version 1.28 ================================================================================ PHPINFO ================================================================================ phpinfo() PHP Version => 4.3.0RC2 System => Linux camouflage 2.4.5 #8 Tue Jun 26 17:05:34 CEST 2001 i686 Build Date => Dec 9 2002 13:51:35 Configure Command => './configure' '--with-apxs=/opt/apache/bin/apxs' '--without-mysql' '--with-sybase-ct=/opt/sybase/' '--with-gd=/usr/local/src/gd-2.0.1/' '--with-jpeg-dir=/usr/lib/' '--with-png-dir=/usr/lib/' '--with-zlib-dir=shared' '--with-xpm-dir=/usr/X11R6/' Server API => Command Line Interface Virtual Directory Support => disabled Configuration File (php.ini) Path => /usr/local/lib/php.ini PHP API => 20020918 PHP Extension => 20020429 Zend Extension => 20021010 Debug Build => no Thread Safety => disabled Registered PHP Streams => php, http, ftp, compress.zlib This program makes use of the Zend Scripting Language Engine: Zend Engine v1.4.0, Copyright (c) 1998-2002 Zend Technologies with the ionCube PHP Accelerator v1.3.3r2, Copyright (c) 2001-2002, by Nick Lindridge _______________________________________________________________________ Configuration PHP Core Directive => Local Value => Master Value allow_call_time_pass_reference => Off => Off allow_url_fopen => On => On always_populate_raw_post_data => Off => Off arg_separator.input => &amp; => &amp; arg_separator.output => &amp; => &amp; asp_tags => Off => Off auto_append_file => no value => no value auto_prepend_file => no value => no value browscap => no value => no value default_charset => no value => no value default_mimetype => text/html => text/html define_syslog_variables => Off => Off disable_functions => no value => no value display_errors => On => On display_startup_errors => Off => Off doc_root => no value => no value docref_ext => no value => no value docref_root => http://www.php.net/ => http://www.php.net/ enable_dl => On => On error_append_string => no value => no value error_log => no value => no value error_prepend_string => no value => no value error_reporting => 2037 => 2037 expose_php => On => On extension_dir => /usr/local/lib/php/extensions/ => /usr/local/lib/php/extensions/ file_uploads => On => On gpc_order => GPC => GPC highlight.bg => #FFFFFF => #FFFFFF highlight.comment => #FF9900 => #FF9900 highlight.default => #0000CC => #0000CC highlight.html => #000000 => #000000 highlight.keyword => #006600 => #006600 highlight.string => #CC0000 => #CC0000 html_errors => Off => On ignore_repeated_errors => Off => Off ignore_repeated_source => Off => Off ignore_user_abort => Off => Off implicit_flush => On => Off include_path => .:/usr/local/lib/php => .:/usr/local/lib/php log_errors => On => On log_errors_max_len => 1024 => 1024 magic_quotes_gpc => Off => Off magic_quotes_runtime => Off => Off magic_quotes_sybase => Off => Off max_execution_time => 0 => 30 max_input_time => -1 => -1 open_basedir => no value => no value output_buffering => 0 => 0 output_handler => no value => no value post_max_size => 8M => 8M precision => 14 => 14 register_argc_argv => On => Off register_globals => Off => Off report_memleaks => On => On safe_mode => Off => Off safe_mode_exec_dir => no value => no value safe_mode_gid => Off => Off safe_mode_include_dir => no value => no value sendmail_from => me@localhost.com => me@localhost.com sendmail_path => /usr/sbin/sendmail -t -i => /usr/sbin/sendmail -t -i short_open_tag => Off => Off SMTP => localhost => localhost smtp_port => 25 => 25 sql.safe_mode => Off => Off track_errors => Off => Off unserialize_callback_func => no value => no value upload_max_filesize => 2M => 2M upload_tmp_dir => no value => no value user_dir => no value => no value variables_order => GPCS => GPCS xmlrpc_error_number => 0 => 0 xmlrpc_errors => Off => Off y2k_compliance => Off => Off ctype ctype functions => enabled gd GD Support => enabled GD Version => 2.0 or higher JPG Support => enabled PNG Support => enabled WBMP Support => enabled overload User-Space Object Overloading Support => enabled pcre PCRE (Perl Compatible Regular Expressions) Support => enabled PCRE Library Version => 3.92 11-Sep-2002 posix Revision => $Revision: 1.51 $ session Session Support => enabled Registered save handlers => files user Directive => Local Value => Master Value session.auto_start => Off => Off session.bug_compat_42 => On => On session.bug_compat_warn => On => On session.cache_expire => 180 => 180 session.cache_limiter => nocache => nocache session.cookie_domain => no value => no value session.cookie_lifetime => 0 => 0 session.cookie_path => / => / session.cookie_secure => Off => Off session.entropy_file => no value => no value session.entropy_length => 0 => 0 session.gc_dividend => 100 => 100 session.gc_maxlifetime => 1440 => 1440 session.gc_probability => 1 => 1 session.name => PHPSESSID => PHPSESSID session.referer_check => no value => no value session.save_handler => user => user session.save_path => t01.cyland.com:6860 => t01.cyland.com:6860 session.serialize_handler => php => php session.use_cookies => Off => Off session.use_only_cookies => Off => Off session.use_trans_sid => On => On standard Regex Library => Bundled library enabled Dynamic Library Support => enabled Path to sendmail => /usr/sbin/sendmail -t -i Directive => Local Value => Master Value assert.active => 1 => 1 assert.bail => 0 => 0 assert.callback => no value => no value assert.quiet_eval => 0 => 0 assert.warning => 1 => 1 auto_detect_line_endings => 0 => 0 default_socket_timeout => 60 => 60 safe_mode_allowed_env_vars => PHP_ => PHP_ safe_mode_protected_env_vars => LD_LIBRARY_PATH => LD_LIBRARY_PATH url_rewriter.tags => a=href,area=href,frame=src,input=src,form=fakeentry => a=href,area=href,frame=src,input=src,form=fakeentry user_agent => no value => no value sybase_ct Sybase_CT Support => enabled Active Persistent Links => 0 Active Links => 0 Min server severity => 10 Min client severity => 10 Application Name => PHP 4.0 Deadlock retry count => -1 Directive => Local Value => Master Value sybct.allow_persistent => On => On sybct.deadlock_retry_count => Unlimited => Unlimited sybct.hostname => no value => no value sybct.max_links => Unlimited => Unlimited sybct.max_persistent => Unlimited => Unlimited sybct.min_client_severity => 10 => 10 sybct.min_server_severity => 10 => 10 tokenizer Tokenizer Support => enabled xml XML Support => active XML Namespace Support => active EXPAT Version => 1.95.2 zlib ZLib Support => enabled Compiled Version => 1.1.3 Linked Version => 1.1.3 Directive => Local Value => Master Value zlib.output_compression => Off => Off zlib.output_compression_level => -1 => -1 zlib.output_handler => no value => no value Additional Modules Module Name Environment Variable => Value PWD => /usr/local/src/php-4.3.0RC2 MAKEFLAGS => SCRIPT_FILENAME => PAGER => less MFLAGS => HOSTNAME => camouflage RC_LANG => de_DE LS_OPTIONS => -a -N --color=tty -T 0 ignoreeof => 0 SUSE_DOC_HOST => localhost POVRAYOPT => -l/usr/lib/povray/include QTDIR => /usr/lib/qt LESSKEY => /etc/lesskey.bin MANPATH => /usr/share/man:/usr/local/man:/usr/X11R6/man:/usr/man:/usr/openwin/man LESSOPEN => |lesspipe.sh %s CC => gcc NNTPSERVER => news KDEDIR => /opt/kde LESS => -M -S -I REQUEST_METHOD => HISTCONTROL => ignoredups LS_COLORS => USER => root XKEYSYMDB => /usr/X11R6/lib/X11/XKeysymDB RC_LC_COLLATE => POSIX MACHTYPE => i386-suse-linux TEST_PHP_SRCDIR => /usr/local/src/php-4.3.0RC2 PATH_TRANSLATED => GNOMEDIR => /opt/gnome QUERY_STRING => CONTENT_LENGTH => MAKELEVEL => 1 COLORTERM => 1 INFOPATH => /usr/local/info:/usr/share/info:/usr/info SHLVL => 3 LOGNAME => root LC_CTYPE => de_DE TEXINPUTS => :~/.TeX:/usr/share/doc/.TeX:/usr/doc/.TeX MINICOM => -c on INFODIR => /usr/local/info:/usr/share/info:/usr/info REDIRECT_STATUS => _ => /usr/local/src/php-4.3.0RC2/sapi/cli/php TEST_PHP_EXECUTABLE => /usr/local/src/php-4.3.0RC2/sapi/cli/php SHELL => /bin/sh PRINTER => lp HOSTTYPE => i386 WINDOWMANAGER => /usr/X11R6/bin/kde OSTYPE => linux no_proxy => localhost TERM => kvt HOME => /root XNLSPATH => /usr/X11R6/lib/X11/nls LESSCHARSET => latin1 PATH => /sbin:/usr/sbin:/usr/local/sbin:/root/bin:/usr/local/bin:/usr/bin:/usr/X11R6/bin:/bin:/usr/lib/java/bin:/usr/games/bin:/usr/games:/opt/gnome/bin:/opt/kde2/bin:/opt/kde/bin FROM_HEADER => camouflage.cyland.com CONTENT_TYPE => PHP Variables Variable => Value _SERVER["PWD"] => /usr/local/src/php-4.3.0RC2 _SERVER["MAKEFLAGS"] => _SERVER["SCRIPT_FILENAME"] => _SERVER["PAGER"] => less _SERVER["MFLAGS"] => _SERVER["HOSTNAME"] => camouflage _SERVER["RC_LANG"] => de_DE _SERVER["LS_OPTIONS"] => -a -N --color=tty -T 0 _SERVER["ignoreeof"] => 0 _SERVER["SUSE_DOC_HOST"] => localhost _SERVER["POVRAYOPT"] => -l/usr/lib/povray/include _SERVER["QTDIR"] => /usr/lib/qt _SERVER["LESSKEY"] => /etc/lesskey.bin _SERVER["MANPATH"] => /usr/share/man:/usr/local/man:/usr/X11R6/man:/usr/man:/usr/openwin/man _SERVER["LESSOPEN"] => |lesspipe.sh %s _SERVER["CC"] => gcc _SERVER["NNTPSERVER"] => news _SERVER["KDEDIR"] => /opt/kde _SERVER["LESS"] => -M -S -I _SERVER["REQUEST_METHOD"] => _SERVER["HISTCONTROL"] => ignoredups _SERVER["LS_COLORS"] => _SERVER["USER"] => root _SERVER["XKEYSYMDB"] => /usr/X11R6/lib/X11/XKeysymDB _SERVER["RC_LC_COLLATE"] => POSIX _SERVER["MACHTYPE"] => i386-suse-linux _SERVER["TEST_PHP_SRCDIR"] => /usr/local/src/php-4.3.0RC2 _SERVER["PATH_TRANSLATED"] => _SERVER["GNOMEDIR"] => /opt/gnome _SERVER["QUERY_STRING"] => _SERVER["CONTENT_LENGTH"] => _SERVER["MAKELEVEL"] => 1 _SERVER["COLORTERM"] => 1 _SERVER["INFOPATH"] => /usr/local/info:/usr/share/info:/usr/info _SERVER["SHLVL"] => 3 _SERVER["LOGNAME"] => root _SERVER["LC_CTYPE"] => de_DE _SERVER["TEXINPUTS"] => :~/.TeX:/usr/share/doc/.TeX:/usr/doc/.TeX _SERVER["MINICOM"] => -c on _SERVER["INFODIR"] => /usr/local/info:/usr/share/info:/usr/info _SERVER["REDIRECT_STATUS"] => _SERVER["_"] => /usr/local/src/php-4.3.0RC2/sapi/cli/php _SERVER["TEST_PHP_EXECUTABLE"] => /usr/local/src/php-4.3.0RC2/sapi/cli/php _SERVER["SHELL"] => /bin/sh _SERVER["PRINTER"] => lp _SERVER["HOSTTYPE"] => i386 _SERVER["WINDOWMANAGER"] => /usr/X11R6/bin/kde _SERVER["OSTYPE"] => linux _SERVER["no_proxy"] => localhost _SERVER["TERM"] => kvt _SERVER["HOME"] => /root _SERVER["XNLSPATH"] => /usr/X11R6/lib/X11/nls _SERVER["LESSCHARSET"] => latin1 _SERVER["PATH"] => /sbin:/usr/sbin:/usr/local/sbin:/root/bin:/usr/local/bin:/usr/bin:/usr/X11R6/bin:/bin:/usr/lib/java/bin:/usr/games/bin:/usr/games:/opt/gnome/bin:/opt/kde2/bin:/opt/kde/bin _SERVER["FROM_HEADER"] => camouflage.cyland.com _SERVER["CONTENT_TYPE"] => _SERVER["PHP_SELF"] => _SERVER["SCRIPT_NAME"] => _SERVER["DOCUMENT_ROOT"] => _SERVER["argv"] => Array ( ) _SERVER["argc"] => 0 PHP License This program is free software; you can redistribute it and/or modify it under the terms of the PHP License as published by the PHP Group and included in the distribution in the file: LICENSE This program is distributed in the hope that it will be useful, but WITHOUT ANY WARRANTY; without even the implied warranty of MERCHANTABILITY or FITNESS FOR A PARTICULAR PURPOSE. If you did not receive a copy of the PHP license, or have any questions about PHP licensing, please contact license@php.net.

« previous php.qa (#7200) next »