Test results

From: Date: Thu, 12 Dec 2002 11:49:03 +0000
Subject: Test results
Groups: php.qa 
Request: Send a blank email to php-qa+get-7205@lists.php.net to get a copy of this message
===================================================================== FAILED TEST SUMMARY --------------------------------------------------------------------- session object serialization [ext/session/tests/001.phpt] session object deserialization [ext/session/tests/003.phpt] correct instantiation of references between variables in sessions [ext/session/tests/006.phpt] bug compatibility: unset($c) with enabled register_globals [ext/session/tests/007.phpt] bug compatibility: global is used albeit register_globals=0 [ext/session/tests/008-php4.2.3.phpt] unset($_SESSION["name"]); should work with register_globals=off [ext/session/tests/009.phpt] registering $_SESSION should not segfault [ext/session/tests/012.phpt] redefining SID should not cause warnings [ext/session/tests/013.phpt] a script should not be able to modify session.use_trans_sid [ext/session/tests/014.phpt] use_trans_sid should not affect SID [ext/session/tests/015.phpt] invalid session.save_path should not cause a segfault [ext/session/tests/016.phpt] setting $_SESSION before session_start() should not cause segfault [ext/session/tests/017.phpt] rewriter correctly handles attribute names which contain dashes [ext/session/tests/018.phpt] serializing references test case using globals [ext/session/tests/019.phpt] rewriter uses arg_seperator.output for modifying URLs [ext/session/tests/020.phpt] rewriter handles form and fieldset tags correctly [ext/session/tests/021.phpt] ===================================================================== ================================================================================ /home/mlc/build/php-4.3.0RC3/ext/session/tests/001.phpt ================================================================================ ---- EXPECTED OUTPUT baz|O:3:"foo":2:{s:3:"bar";s:2:"ok";s:3:"yes";s:4:"done";}arr|a:1:{i:3;O:3:"foo":2:{s:3:"bar";s:2:"ok";s:3:"yes";s:4:"done";}} ---- ACTUAL OUTPUT Fatal error: session_register() [/phpmanual/function.session-register.html]: Failed to initialize session module in /home/mlc/build/php-4.3.0RC3/ext/session/tests/001.php on line 16 ---- FAILED ================================================================================ 001- baz|O:3:"foo":2:{s:3:"bar";s:2:"ok";s:3:"yes";s:4:"done";}arr|a:1:{i:3;O:3:"foo":2:{s:3:"bar";s:2:"ok";s:3:"yes";s:4:"done";}} 001+ Fatal error: session_register() [/phpmanual/function.session-register.html]: Failed to initialize session module in /home/mlc/build/php-4.3.0RC3/ext/session/tests/001.php on line 16 ================================================================================ ================================================================================ /home/mlc/build/php-4.3.0RC3/ext/session/tests/003.phpt ================================================================================ ---- EXPECTED OUTPUT object(foo)(2) { ["bar"]=> string(2) "ok" ["yes"]=> int(2) } array(1) { [3]=> &object(foo)(2) { ["bar"]=> string(2) "ok" ["yes"]=> int(2) } } ---- ACTUAL OUTPUT Fatal error: session_start() [/phpmanual/function.session-start.html]: Failed to initialize session module in /home/mlc/build/php-4.3.0RC3/ext/session/tests/003.php on line 10 ---- FAILED ================================================================================ 001- object(foo)(2) { 001+ Fatal error: session_start() [/phpmanual/function.session-start.html]: Failed to initialize session module in /home/mlc/build/php-4.3.0RC3/ext/session/tests/003.php on line 10 002- ["bar"]=> 003- string(2) "ok" 004- ["yes"]=> 005- int(2) 006- } 007- array(1) { 008- [3]=> 009- &object(foo)(2) { 010- ["bar"]=> 011- string(2) "ok" 012- ["yes"]=> 013- int(2) 014- } 015- } ================================================================================ ================================================================================ /home/mlc/build/php-4.3.0RC3/ext/session/tests/006.phpt ================================================================================ ---- EXPECTED OUTPUT original values: object(a)(1) { ["test"]=> string(5) "hallo" } object(b)(1) { ["a"]=> &object(a)(1) { ["test"]=> string(5) "hallo" } } values after session: object(a)(1) { ["test"]=> string(5) "hallo" } object(b)(1) { ["a"]=> &object(a)(1) { ["test"]=> string(5) "hallo" } } ---- ACTUAL OUTPUT Fatal error: session_start() [/phpmanual/function.session-start.html]: Failed to initialize session module in /home/mlc/build/php-4.3.0RC3/ext/session/tests/006.php on line 5 ---- FAILED ================================================================================ 001- original values: 001+ Fatal error: session_start() [/phpmanual/function.session-start.html]: Failed to initialize session module in /home/mlc/build/php-4.3.0RC3/ext/session/tests/006.php on line 5 002- object(a)(1) { 003- ["test"]=> 004- string(5) "hallo" 005- } 006- object(b)(1) { 007- ["a"]=> 008- &object(a)(1) { 009- ["test"]=> 010- string(5) "hallo" 011- } 012- } 013- values after session: 014- object(a)(1) { 015- ["test"]=> 016- string(5) "hallo" 017- } 018- object(b)(1) { 019- ["a"]=> 020- &object(a)(1) { 021- ["test"]=> 022- string(5) "hallo" 023- } 024- } ================================================================================ ================================================================================ /home/mlc/build/php-4.3.0RC3/ext/session/tests/007.phpt ================================================================================ ---- EXPECTED OUTPUT float(3.14) array(1) { ["c"]=> &float(3.14) } float(3.14) array(1) { ["c"]=> &float(3.14) } ---- ACTUAL OUTPUT Fatal error: session_start() [/phpmanual/function.session-start.html]: Failed to initialize session module in /home/mlc/build/php-4.3.0RC3/ext/session/tests/007.php on line 7 ---- FAILED ================================================================================ 001- float(3.14) 001+ Fatal error: session_start() [/phpmanual/function.session-start.html]: Failed to initialize session module in /home/mlc/build/php-4.3.0RC3/ext/session/tests/007.php on line 7 002- array(1) { 003- ["c"]=> 004- &float(3.14) 005- } 006- float(3.14) 007- array(1) { 008- ["c"]=> 009- &float(3.14) 010- } ================================================================================ ================================================================================ /home/mlc/build/php-4.3.0RC3/ext/session/tests/008-php4.2.3.phpt ================================================================================ ---- EXPECTED OUTPUT NULL Your script possibly relies on a session side-effect which existed until PHP 4.2.3. Please be advised that the session extension does not consider global variables as a source of data, unless register_globals is enabled. You can disable this functionality and this warning by setting session.bug_compat_42 or session.bug_compat_warn to off, respectively. array(1) { ["c"]=> float(3.14) } NULL array(1) { ["c"]=> float(3.14) } ---- ACTUAL OUTPUT Fatal error: session_start() [/phpmanual/function.session-start.html]: Failed to initialize session module in /home/mlc/build/php-4.3.0RC3/ext/session/tests/008-php4.2.3.php on line 5 ---- FAILED ================================================================================ 001- NULL 001+ Fatal error: session_start() [/phpmanual/function.session-start.html]: Failed to initialize session module in /home/mlc/build/php-4.3.0RC3/ext/session/tests/008-php4.2.3.php on line 5 002- Your script possibly relies on a session side-effect which existed until PHP 4.2.3. Please be advised that the session extension does not consider global variables as a source of data, unless register_globals is enabled. You can disable this functionality and this warning by setting session.bug_compat_42 or session.bug_compat_warn to off, respectively. 003- array(1) { 004- ["c"]=> 005- float(3.14) 006- } 007- NULL 008- array(1) { 009- ["c"]=> 010- float(3.14) 011- } ================================================================================ ================================================================================ /home/mlc/build/php-4.3.0RC3/ext/session/tests/009.phpt ================================================================================ ---- EXPECTED OUTPUT array(0) { } array(1) { ["name"]=> string(3) "foo" } array(1) { ["name"]=> string(3) "foo" } array(0) { } array(0) { } ---- ACTUAL OUTPUT Fatal error: session_start() [/phpmanual/function.session-start.html]: Failed to initialize session module in /home/mlc/build/php-4.3.0RC3/ext/session/tests/009.php on line 7 ---- FAILED ================================================================================ 001- array(0) { 001+ Fatal error: session_start() [/phpmanual/function.session-start.html]: Failed to initialize session module in /home/mlc/build/php-4.3.0RC3/ext/session/tests/009.php on line 7 002- } 003- array(1) { 004- ["name"]=> 005- string(3) "foo" 006- } 007- array(1) { 008- ["name"]=> 009- string(3) "foo" 010- } 011- array(0) { 012- } 013- array(0) { 014- } ================================================================================ ================================================================================ /home/mlc/build/php-4.3.0RC3/ext/session/tests/012.phpt ================================================================================ ---- EXPECTED OUTPUT I live ---- ACTUAL OUTPUT Fatal error: session_start() [/phpmanual/function.session-start.html]: Failed to initialize session module in /home/mlc/build/php-4.3.0RC3/ext/session/tests/012.php on line 7 ---- FAILED ================================================================================ 001- I live 001+ Fatal error: session_start() [/phpmanual/function.session-start.html]: Failed to initialize session module in /home/mlc/build/php-4.3.0RC3/ext/session/tests/012.php on line 7 ================================================================================ ================================================================================ /home/mlc/build/php-4.3.0RC3/ext/session/tests/013.phpt ================================================================================ ---- EXPECTED OUTPUT I live ---- ACTUAL OUTPUT Fatal error: session_start() [/phpmanual/function.session-start.html]: Failed to initialize session module in /home/mlc/build/php-4.3.0RC3/ext/session/tests/013.php on line 5 ---- FAILED ================================================================================ 001- I live 001+ Fatal error: session_start() [/phpmanual/function.session-start.html]: Failed to initialize session module in /home/mlc/build/php-4.3.0RC3/ext/session/tests/013.php on line 5 ================================================================================ ================================================================================ /home/mlc/build/php-4.3.0RC3/ext/session/tests/014.phpt ================================================================================ ---- EXPECTED OUTPUT <a href="/link?PHPSESSID=abtest"> <a href="/link?PHPSESSID=abtest"> <a href="/link?PHPSESSID=abtest"> ---- ACTUAL OUTPUT Fatal error: session_start() [/phpmanual/function.session-start.html]: Failed to initialize session module in /home/mlc/build/php-4.3.0RC3/ext/session/tests/014.php on line 5 ---- FAILED ================================================================================ 001- <a href="/link?PHPSESSID=abtest"> 001+ Fatal error: session_start() [/phpmanual/function.session-start.html]: Failed to initialize session module in /home/mlc/build/php-4.3.0RC3/ext/session/tests/014.php on line 5 002- <a href="/link?PHPSESSID=abtest"> 003- <a href="/link?PHPSESSID=abtest"> ================================================================================ ================================================================================ /home/mlc/build/php-4.3.0RC3/ext/session/tests/015.phpt ================================================================================ ---- EXPECTED OUTPUT <a href="/link?PHPSESSID=abtest&PHPSESSID=abtest"> ---- ACTUAL OUTPUT Fatal error: session_start() [/phpmanual/function.session-start.html]: Failed to initialize session module in /home/mlc/build/php-4.3.0RC3/ext/session/tests/015.php on line 5 ---- FAILED ================================================================================ 001- <a href="/link?PHPSESSID=abtest&PHPSESSID=abtest"> 001+ Fatal error: session_start() [/phpmanual/function.session-start.html]: Failed to initialize session module in /home/mlc/build/php-4.3.0RC3/ext/session/tests/015.php on line 5 ================================================================================ ================================================================================ /home/mlc/build/php-4.3.0RC3/ext/session/tests/016.phpt ================================================================================ ---- EXPECTED OUTPUT I live ---- ACTUAL OUTPUT ---- FAILED ================================================================================ 001- I live 001+ ================================================================================ ================================================================================ /home/mlc/build/php-4.3.0RC3/ext/session/tests/017.phpt ================================================================================ ---- EXPECTED OUTPUT I live ---- ACTUAL OUTPUT Fatal error: session_start() [/phpmanual/function.session-start.html]: Failed to initialize session module in /home/mlc/build/php-4.3.0RC3/ext/session/tests/017.php on line 8 ---- FAILED ================================================================================ 001- I live 001+ Fatal error: session_start() [/phpmanual/function.session-start.html]: Failed to initialize session module in /home/mlc/build/php-4.3.0RC3/ext/session/tests/017.php on line 8 ================================================================================ ================================================================================ /home/mlc/build/php-4.3.0RC3/ext/session/tests/018.phpt ================================================================================ ---- EXPECTED OUTPUT <form accept-charset="ISO-8859-15, ISO-8859-1" action=url.php><input type="hidden" name="PHPSESSID" value="abtest" /> ---- ACTUAL OUTPUT Fatal error: session_start() [/phpmanual/function.session-start.html]: Failed to initialize session module in /home/mlc/build/php-4.3.0RC3/ext/session/tests/018.php on line 6 ---- FAILED ================================================================================ 001- <form accept-charset="ISO-8859-15, ISO-8859-1" action=url.php><input type="hidden" name="PHPSESSID" value="abtest" /> 001+ Fatal error: session_start() [/phpmanual/function.session-start.html]: Failed to initialize session module in /home/mlc/build/php-4.3.0RC3/ext/session/tests/018.php on line 6 ================================================================================ ================================================================================ /home/mlc/build/php-4.3.0RC3/ext/session/tests/019.phpt ================================================================================ ---- EXPECTED OUTPUT array(2) { ["o1"]=> &object(tfoo)(1) { ["c"]=> int(42) } ["o2"]=> &object(tfoo)(1) { ["c"]=> int(42) } } array(2) { ["o1"]=> &object(tfoo)(1) { ["c"]=> int(44) } ["o2"]=> &object(tfoo)(1) { ["c"]=> int(44) } } ---- ACTUAL OUTPUT Fatal error: session_register() [/phpmanual/function.session-register.html]: Failed to initialize session module in /home/mlc/build/php-4.3.0RC3/ext/session/tests/019.php on line 16 ---- FAILED ================================================================================ 001- array(2) { 001+ Fatal error: session_register() [/phpmanual/function.session-register.html]: Failed to initialize session module in /home/mlc/build/php-4.3.0RC3/ext/session/tests/019.php on line 16 002- ["o1"]=> 003- &object(tfoo)(1) { 004- ["c"]=> 005- int(42) 006- } 007- ["o2"]=> 008- &object(tfoo)(1) { 009- ["c"]=> 010- int(42) 011- } 012- } 013- array(2) { 014- ["o1"]=> 015- &object(tfoo)(1) { 016- ["c"]=> 017- int(44) 018- } 019- ["o2"]=> 020- &object(tfoo)(1) { 021- ["c"]=> 022- int(44) 023- } 024- } ================================================================================ ================================================================================ /home/mlc/build/php-4.3.0RC3/ext/session/tests/020.phpt ================================================================================ ---- EXPECTED OUTPUT <a href="link.php?a=b&amp;PHPSESSID=abtest"> ---- ACTUAL OUTPUT Fatal error: session_start() [/phpmanual/function.session-start.html]: Failed to initialize session module in /home/mlc/build/php-4.3.0RC3/ext/session/tests/020.php on line 6 ---- FAILED ================================================================================ 001- <a href="link.php?a=b&amp;PHPSESSID=abtest"> 001+ Fatal error: session_start() [/phpmanual/function.session-start.html]: Failed to initialize session module in /home/mlc/build/php-4.3.0RC3/ext/session/tests/020.php on line 6 ================================================================================ ================================================================================ /home/mlc/build/php-4.3.0RC3/ext/session/tests/021.phpt ================================================================================ ---- EXPECTED OUTPUT <form><input type="hidden" name="PHPSESSID" value="abtest" /> <fieldset><input type="hidden" name="PHPSESSID" value="abtest" /> <form><input type="hidden" name="PHPSESSID" value="abtest" /> <fieldset> <form><input type="hidden" name="PHPSESSID" value="abtest" /> <fieldset> <form> <fieldset><input type="hidden" name="PHPSESSID" value="abtest" /> ---- ACTUAL OUTPUT Fatal error: session_start() [/phpmanual/function.session-start.html]: Failed to initialize session module in /home/mlc/build/php-4.3.0RC3/ext/session/tests/021.php on line 6 ---- FAILED ================================================================================ 001- <form><input type="hidden" name="PHPSESSID" value="abtest" /> 001+ Fatal error: session_start() [/phpmanual/function.session-start.html]: Failed to initialize session module in /home/mlc/build/php-4.3.0RC3/ext/session/tests/021.php on line 6 002- <fieldset><input type="hidden" name="PHPSESSID" value="abtest" /> 003- <form><input type="hidden" name="PHPSESSID" value="abtest" /> 004- <fieldset> 005- <form><input type="hidden" name="PHPSESSID" value="abtest" /> 006- <fieldset> 007- <form> 008- <fieldset><input type="hidden" name="PHPSESSID" value="abtest" /> ================================================================================ ================================================================================ BUILD ENVIRONMENT ================================================================================ OS: Linux Automake: automake (GNU automake) 1.4-p4 Copyright (C) 1999, 2001 Free Software Foundation, Inc. This is free software; see the source for copying conditions. There is NO warranty; not even for MERCHANTABILITY or FITNESS FOR A PARTICULAR PURPOSE. Written by Tom Tromey <tromey@cygnus.com> Autoconf: Autoconf version 2.13 Libtool: ltmain.sh (GNU libtool) 1.4.2a (1.922.2.79 2001/11/28 21:50:31) Compiler: Reading specs from /usr/lib/gcc-lib/i386-linux/2.95.4/specs gcc version 2.95.4 20011002 (Debian prerelease) Bison: bison (GNU Bison) 1.35 Copyright 1984, 1986, 1989, 1992, 2000, 2001, 2002 Free Software Foundation, Inc. This is free software; see the source for copying conditions. There is NO warranty; not even for MERCHANTABILITY or FITNESS FOR A PARTICULAR PURPOSE. User's E-mail: mlc at 2600 dot com ================================================================================ PHPINFO ================================================================================ phpinfo() PHP Version => 4.3.0RC3 System => Linux fir 2.2.18 #1 Fri Feb 16 15:27:15 EST 2001 i586 Build Date => Dec 12 2002 06:42:48 Configure Command => '../php-4.3.0RC3/configure' '--with-mysql=/usr' '--with-apxs2=/opt/apache2/bin/apxs' '--with-db3' Server API => Command Line Interface Virtual Directory Support => disabled Configuration File (php.ini) Path => /usr/local/lib/php.ini PHP API => 20020918 PHP Extension => 20020429 Zend Extension => 20021010 Debug Build => no Thread Safety => disabled Registered PHP Streams => php, http, ftp This program makes use of the Zend Scripting Language Engine: Zend Engine v1.3.0, Copyright (c) 1998-2002 Zend Technologies _______________________________________________________________________ Configuration PHP Core Directive => Local Value => Master Value allow_call_time_pass_reference => On => On allow_url_fopen => On => On always_populate_raw_post_data => Off => Off arg_separator.input => &amp; => &amp; arg_separator.output => &amp; => &amp; asp_tags => Off => Off auto_append_file => no value => no value auto_prepend_file => no value => no value browscap => no value => no value default_charset => no value => no value default_mimetype => text/html => text/html define_syslog_variables => Off => Off disable_functions => no value => no value display_errors => On => On display_startup_errors => Off => Off doc_root => no value => no value docref_ext => no value => no value docref_root => http://www.php.net/ => http://www.php.net/ enable_dl => On => On error_append_string => no value => no value error_log => no value => no value error_prepend_string => no value => no value error_reporting => no value => no value expose_php => On => On extension_dir => /usr/local/lib/php/extensions/no-debug-non-zts-20020429 => /usr/local/lib/php/extensions/no-debug-non-zts-20020429 file_uploads => On => On gpc_order => GPC => GPC highlight.bg => #FFFFFF => #FFFFFF highlight.comment => #FF8000 => #FF8000 highlight.default => #0000BB => #0000BB highlight.html => #000000 => #000000 highlight.keyword => #007700 => #007700 highlight.string => #DD0000 => #DD0000 html_errors => Off => On ignore_repeated_errors => Off => Off ignore_repeated_source => Off => Off ignore_user_abort => Off => Off implicit_flush => On => Off include_path => .:/usr/local/lib/php => .:/usr/local/lib/php log_errors => Off => Off log_errors_max_len => 1024 => 1024 magic_quotes_gpc => On => On magic_quotes_runtime => Off => Off magic_quotes_sybase => Off => Off max_execution_time => 0 => 30 max_input_time => -1 => -1 open_basedir => no value => no value output_buffering => 0 => 0 output_handler => no value => no value post_max_size => 8M => 8M precision => 14 => 14 register_argc_argv => On => On register_globals => On => On report_memleaks => On => On safe_mode => Off => Off safe_mode_exec_dir => 1 => 1 safe_mode_gid => Off => Off safe_mode_include_dir => no value => no value sendmail_from => no value => no value sendmail_path => /usr/sbin/sendmail -t -i => /usr/sbin/sendmail -t -i short_open_tag => On => On SMTP => localhost => localhost smtp_port => 25 => 25 sql.safe_mode => Off => Off track_errors => Off => Off unserialize_callback_func => no value => no value upload_max_filesize => 2M => 2M upload_tmp_dir => no value => no value user_dir => no value => no value variables_order => no value => no value xmlrpc_error_number => 0 => 0 xmlrpc_errors => Off => Off y2k_compliance => On => On ctype ctype functions => enabled dba DBA support => enabled Supported handlers => db3 mysql MySQL Support => enabled Active Persistent Links => 0 Active Links => 0 Client API version => 3.23.49 MYSQL_MODULE_TYPE => external MYSQL_SOCKET => /var/run/mysqld/mysqld.sock MYSQL_INCLUDE => -I/usr/include/mysql MYSQL_LIBS => -L/usr/lib -lmysqlclient Directive => Local Value => Master Value mysql.allow_persistent => On => On mysql.connect_timeout => -1 => -1 mysql.default_host => no value => no value mysql.default_password => no value => no value mysql.default_port => no value => no value mysql.default_socket => no value => no value mysql.default_user => no value => no value mysql.max_links => Unlimited => Unlimited mysql.max_persistent => Unlimited => Unlimited mysql.trace_mode => Off => Off overload User-Space Object Overloading Support => enabled pcre PCRE (Perl Compatible Regular Expressions) Support => enabled PCRE Library Version => 3.92 11-Sep-2002 posix Revision => $Revision: 1.51 $ session Session Support => enabled Registered save handlers => files user Directive => Local Value => Master Value session.auto_start => Off => Off session.bug_compat_42 => On => On session.bug_compat_warn => On => On session.cache_expire => 180 => 180 session.cache_limiter => nocache => nocache session.cookie_domain => no value => no value session.cookie_lifetime => 0 => 0 session.cookie_path => / => / session.cookie_secure => Off => Off session.entropy_file => no value => no value session.entropy_length => 0 => 0 session.gc_dividend => 100 => 100 session.gc_maxlifetime => 1440 => 1440 session.gc_probability => 1 => 1 session.name => PHPSESSID => PHPSESSID session.referer_check => no value => no value session.save_handler => user => user session.save_path => PHPSessions => PHPSessions session.serialize_handler => php => php session.use_cookies => On => On session.use_only_cookies => Off => Off session.use_trans_sid => Off => Off standard Regex Library => Bundled library enabled Dynamic Library Support => enabled Path to sendmail => /usr/sbin/sendmail -t -i Directive => Local Value => Master Value assert.active => 1 => 1 assert.bail => 0 => 0 assert.callback => no value => no value assert.quiet_eval => 0 => 0 assert.warning => 1 => 1 auto_detect_line_endings => 0 => 0 default_socket_timeout => 60 => 60 safe_mode_allowed_env_vars => PHP_ => PHP_ safe_mode_protected_env_vars => LD_LIBRARY_PATH => LD_LIBRARY_PATH url_rewriter.tags => a=href,area=href,frame=src,form=,fieldset= => a=href,area=href,frame=src,form=,fieldset= user_agent => no value => no value tokenizer Tokenizer Support => enabled xml XML Support => active XML Namespace Support => active EXPAT Version => 1.95.2 Additional Modules Module Name Environment Variable => Value PWD => /home/mlc/build/php-4.3.0RC3 MAKEFLAGS => MFLAGS => REDIRECT_STATUS => LESSCLOSE => /usr/bin/lesspipe %s %s TEST_PHP_EXECUTABLE => /home/mlc/build/objdir/sapi/cli/php LESSOPEN => | /usr/bin/lesspipe %s CC => gcc LS_COLORS => no=00:fi=00:di=01;34:ln=01;36:pi=40;33:so=01;35:do=01;35:bd=40;33;01:cd=40;33;01:or=40;31;01:ex=01;32:*.tar=01;31:*.tgz=01;31:*.arj=01;31:*.taz=01;31:*.lzh=01;31:*.zip=01;31:*.z=01;31:*.Z=01;31:*.gz=01;31:*.bz2=01;31:*.deb=01;31:*.rpm=01;31:*.jar=01;31:*.jpg=01;35:*.jpeg=01;35:*.png=01;35:*.gif=01;35:*.bmp=01;35:*.pbm=01;35:*.pgm=01;35:*.ppm=01;35:*.tga=01;35:*.xbm=01;35:*.xpm=01;35:*.tif=01;35:*.tiff=01;35:*.mpg=01;35:*.mpeg=01;35:*.avi=01;35:*.fli=01;35:*.gl=01;35:*.dl=01;35:*.xcf=01;35:*.xwd=01;35:*.ogg=01;35:*.mp3=01;35: USER => mlc SCRIPT_FILENAME => MAIL => /var/mail/mlc PATH_TRANSLATED => LANG => C QUERY_STRING => CONTENT_LENGTH => MAKELEVEL => 1 SSH_CLIENT => 160.39.232.13 1926 22 SHLVL => 3 LOGNAME => mlc _ => /home/mlc/build/objdir/sapi/cli/php REQUEST_METHOD => SHELL => /bin/sh TEST_PHP_SRCDIR => /home/mlc/build/php-4.3.0RC3 TERM => xterm HOME => /home/mlc PATH => /usr/local/bin:/usr/bin:/bin:/usr/bin/X11:/usr/games SSH_TTY => /dev/pts/2 CONTENT_TYPE => PHP Variables Variable => Value PHP_SELF => _SERVER["PWD"] => /home/mlc/build/php-4.3.0RC3 _SERVER["MAKEFLAGS"] => _SERVER["MFLAGS"] => _SERVER["REDIRECT_STATUS"] => _SERVER["LESSCLOSE"] => /usr/bin/lesspipe %s %s _SERVER["TEST_PHP_EXECUTABLE"] => /home/mlc/build/objdir/sapi/cli/php _SERVER["LESSOPEN"] => | /usr/bin/lesspipe %s _SERVER["CC"] => gcc _SERVER["LS_COLORS"] => no=00:fi=00:di=01;34:ln=01;36:pi=40;33:so=01;35:do=01;35:bd=40;33;01:cd=40;33;01:or=40;31;01:ex=01;32:*.tar=01;31:*.tgz=01;31:*.arj=01;31:*.taz=01;31:*.lzh=01;31:*.zip=01;31:*.z=01;31:*.Z=01;31:*.gz=01;31:*.bz2=01;31:*.deb=01;31:*.rpm=01;31:*.jar=01;31:*.jpg=01;35:*.jpeg=01;35:*.png=01;35:*.gif=01;35:*.bmp=01;35:*.pbm=01;35:*.pgm=01;35:*.ppm=01;35:*.tga=01;35:*.xbm=01;35:*.xpm=01;35:*.tif=01;35:*.tiff=01;35:*.mpg=01;35:*.mpeg=01;35:*.avi=01;35:*.fli=01;35:*.gl=01;35:*.dl=01;35:*.xcf=01;35:*.xwd=01;35:*.ogg=01;35:*.mp3=01;35: _SERVER["USER"] => mlc _SERVER["SCRIPT_FILENAME"] => _SERVER["MAIL"] => /var/mail/mlc _SERVER["PATH_TRANSLATED"] => _SERVER["LANG"] => C _SERVER["QUERY_STRING"] => _SERVER["CONTENT_LENGTH"] => _SERVER["MAKELEVEL"] => 1 _SERVER["SSH_CLIENT"] => 160.39.232.13 1926 22 _SERVER["SHLVL"] => 3 _SERVER["LOGNAME"] => mlc _SERVER["_"] => /home/mlc/build/objdir/sapi/cli/php _SERVER["REQUEST_METHOD"] => _SERVER["SHELL"] => /bin/sh _SERVER["TEST_PHP_SRCDIR"] => /home/mlc/build/php-4.3.0RC3 _SERVER["TERM"] => xterm _SERVER["HOME"] => /home/mlc _SERVER["PATH"] => /usr/local/bin:/usr/bin:/bin:/usr/bin/X11:/usr/games _SERVER["SSH_TTY"] => /dev/pts/2 _SERVER["CONTENT_TYPE"] => _SERVER["PHP_SELF"] => _SERVER["SCRIPT_NAME"] => _SERVER["DOCUMENT_ROOT"] => _SERVER["argv"] => Array ( ) _SERVER["argc"] => 0 _ENV["PWD"] => /home/mlc/build/php-4.3.0RC3 _ENV["MAKEFLAGS"] => _ENV["MFLAGS"] => _ENV["REDIRECT_STATUS"] => _ENV["LESSCLOSE"] => /usr/bin/lesspipe %s %s _ENV["TEST_PHP_EXECUTABLE"] => /home/mlc/build/objdir/sapi/cli/php _ENV["LESSOPEN"] => | /usr/bin/lesspipe %s _ENV["CC"] => gcc _ENV["LS_COLORS"] => no=00:fi=00:di=01;34:ln=01;36:pi=40;33:so=01;35:do=01;35:bd=40;33;01:cd=40;33;01:or=40;31;01:ex=01;32:*.tar=01;31:*.tgz=01;31:*.arj=01;31:*.taz=01;31:*.lzh=01;31:*.zip=01;31:*.z=01;31:*.Z=01;31:*.gz=01;31:*.bz2=01;31:*.deb=01;31:*.rpm=01;31:*.jar=01;31:*.jpg=01;35:*.jpeg=01;35:*.png=01;35:*.gif=01;35:*.bmp=01;35:*.pbm=01;35:*.pgm=01;35:*.ppm=01;35:*.tga=01;35:*.xbm=01;35:*.xpm=01;35:*.tif=01;35:*.tiff=01;35:*.mpg=01;35:*.mpeg=01;35:*.avi=01;35:*.fli=01;35:*.gl=01;35:*.dl=01;35:*.xcf=01;35:*.xwd=01;35:*.ogg=01;35:*.mp3=01;35: _ENV["USER"] => mlc _ENV["SCRIPT_FILENAME"] => _ENV["MAIL"] => /var/mail/mlc _ENV["PATH_TRANSLATED"] => _ENV["LANG"] => C _ENV["QUERY_STRING"] => _ENV["CONTENT_LENGTH"] => _ENV["MAKELEVEL"] => 1 _ENV["SSH_CLIENT"] => 160.39.232.13 1926 22 _ENV["SHLVL"] => 3 _ENV["LOGNAME"] => mlc _ENV["_"] => /home/mlc/build/objdir/sapi/cli/php _ENV["REQUEST_METHOD"] => _ENV["SHELL"] => /bin/sh _ENV["TEST_PHP_SRCDIR"] => /home/mlc/build/php-4.3.0RC3 _ENV["TERM"] => xterm _ENV["HOME"] => /home/mlc _ENV["PATH"] => /usr/local/bin:/usr/bin:/bin:/usr/bin/X11:/usr/games _ENV["SSH_TTY"] => /dev/pts/2 _ENV["CONTENT_TYPE"] => PHP License This program is free software; you can redistribute it and/or modify it under the terms of the PHP License as published by the PHP Group and included in the distribution in the file: LICENSE This program is distributed in the hope that it will be useful, but WITHOUT ANY WARRANTY; without even the implied warranty of MERCHANTABILITY or FITNESS FOR A PARTICULAR PURPOSE. If you did not receive a copy of the PHP license, or have any questions about PHP licensing, please contact license@php.net.

« previous php.qa (#7205) next »