Test results
| From: | noreply@php.net | Date: | Sun, 15 Dec 2002 01:04:29 +0000 |
| Subject: | Test results | ||
| Groups: | php.qa | ||
| Request: | Send a blank email to php-qa+get-7271@lists.php.net to get a copy of this message | ||
=====================================================================
FAILED TEST SUMMARY
---------------------------------------------------------------------
Locale settings affecting float parsing [tests/lang/034.phpt]
String functions [tests/strings/001.phpt]
invalid session.save_path should not cause a segfault [ext/session/tests/016.phpt]
File type functions [ext/standard/tests/file/001.phpt]
getopt [ext/standard/tests/general_functions/getopt.phpt]
=====================================================================
================================================================================
/Users/lr/src/php-4.3.0RC3/tests/lang/034.phpt
================================================================================
---- EXPECTED OUTPUT
3,14
---- ACTUAL OUTPUT
3.14
---- FAILED
================================================================================
001- 3,14
001+ 3.14
================================================================================
================================================================================
/Users/lr/src/php-4.3.0RC3/tests/strings/001.phpt
================================================================================
---- EXPECTED OUTPUT
Testing strtok: passed
Testing strstr: passed
Testing strrchr: passed
Testing strtoupper: passed
Testing strtolower: passed
Testing substr: passed
Testing rawurlencode: passed
Testing rawurldecode: passed
Testing urlencode: passed
Testing urldecode: passed
Testing quotemeta: passed
Testing ufirst: passed
Testing strtr: passed
Testing addslashes: passed
Testing stripslashes: passed
Testing uniqid: passed
---- ACTUAL OUTPUT
Testing strtok: passed
Testing strstr: passed
Testing strrchr: passed
Testing strtoupper: passed
Testing strtolower: passed
Testing substr: passed
Testing rawurlencode: passed
Testing rawurldecode: passed
Testing urlencode: passed
Testing urldecode: passed
Testing quotemeta: passed
Testing ufirst: passed
Testing strtr: passed
Testing addslashes: failed!
Testing stripslashes: failed!
Testing uniqid: passed
---- FAILED
================================================================================
014- Testing addslashes: passed
014+ Testing addslashes: failed!
015- Testing stripslashes: passed
015+ Testing stripslashes: failed!
================================================================================
================================================================================
/Users/lr/src/php-4.3.0RC3/ext/session/tests/016.phpt
================================================================================
---- EXPECTED OUTPUT
I live
---- ACTUAL OUTPUT
---- FAILED
================================================================================
001- I live
001+
================================================================================
================================================================================
/Users/lr/src/php-4.3.0RC3/ext/standard/tests/file/001.phpt
================================================================================
---- EXPECTED OUTPUT
test.file does not exist
test.file exists
test.link exists
test.file is not a symlink
test.link is a symlink
test.file exists
test.link lstat and stat differ at element 1
test.link lstat and stat differ at element 2
test.link lstat and stat differ at element 7
test.link lstat and stat differ at element 8
test.link lstat and stat differ at element 9
test.link lstat and stat differ at element 10
test.file is file
test.link is link
test.file permissions are 0744
test.file size is 0
test.file is writeable
test.file is readable
test.file is executable
test.file is a regular file
test.link is a regular file
test.link is not a directory
../file is a directory
test.file is not a directory
test.file does not exist
test.file does not exist
---- ACTUAL OUTPUT
test.file does not exist
test.file exists
test.link exists
test.file is not a symlink
test.link is a symlink
test.file exists
test.link lstat and stat differ at element 1
test.link lstat and stat differ at element 2
test.link lstat and stat differ at element 7
test.link lstat and stat differ at element 8
test.link lstat and stat differ at element 9
test.file is file
test.link is link
test.file permissions are 0744
test.file size is 0
test.file is writeable
test.file is readable
test.file is executable
test.file is a regular file
test.link is a regular file
test.link is not a directory
../file is a directory
test.file is not a directory
test.file does not exist
test.file does not exist
---- FAILED
================================================================================
012- test.link lstat and stat differ at element 10
012+ test.file is file
013- test.file is file
013+ test.link is link
014- test.link is link
014+ test.file permissions are 0744
015- test.file permissions are 0744
015+ test.file size is 0
016- test.file size is 0
016+ test.file is writeable
017- test.file is writeable
017+ test.file is readable
018- test.file is readable
018+ test.file is executable
019- test.file is executable
019+ test.file is a regular file
020- test.file is a regular file
020+ test.link is a regular file
021- test.link is a regular file
021+ test.link is not a directory
022- test.link is not a directory
022+ ../file is a directory
023- ../file is a directory
023+ test.file is not a directory
024- test.file is not a directory
024+ test.file does not exist
026- test.file does not exist
================================================================================
================================================================================
/Users/lr/src/php-4.3.0RC3/ext/standard/tests/general_functions/getopt.phpt
================================================================================
---- EXPECTED OUTPUT
array(5) {
["v"]=>
bool(false)
["h"]=>
bool(false)
["d"]=>
string(4) "test"
["m"]=>
string(4) "1234"
["t"]=>
bool(false)
}
---- ACTUAL OUTPUT
array(0) {
}
---- FAILED
================================================================================
001- array(5) {
001+ array(0) {
002- ["v"]=>
002+ }
003- bool(false)
004- ["h"]=>
005- bool(false)
006- ["d"]=>
007- string(4) "test"
008- ["m"]=>
009- string(4) "1234"
010- ["t"]=>
011- bool(false)
012- }
================================================================================
================================================================================
BUILD ENVIRONMENT
================================================================================
OS:
Darwin
Automake:
automake (GNU automake) 1.6.1
Written by Tom Tromey <tromey@redhat.com>.
Copyright 2002 Free Software Foundation, Inc.
This is free software; see the source for copying conditions. There is NO
warranty; not even for MERCHANTABILITY or FITNESS FOR A PARTICULAR PURPOSE.
Autoconf:
autoconf (GNU Autoconf) 2.52
Written by David J. MacKenzie.
Copyright 1992, 1993, 1994, 1996, 1999, 2000, 2001
Free Software Foundation, Inc.
This is free software; see the source for copying conditions. There is NO
warranty; not even for MERCHANTABILITY or FITNESS FOR A PARTICULAR PURPOSE.
Libtool:
Compiler:
Reading specs from /usr/libexec/gcc/darwin/ppc/3.1/specs
Thread model: posix
Apple Computer, Inc. GCC version 1161, based on gcc version 3.1 20020420 (prerelease)
Bison:
GNU Bison version 1.28
User's E-mail: lr at socrates dot berkeley dot edu
================================================================================
PHPINFO
================================================================================
phpinfo()
PHP Version => 4.3.0RC3
System => Darwin nose.local. 6.1 Darwin Kernel Version 6.1: Fri Sep 6 23:24:34 PDT 2002;
root:xnu/xnu-344.2.obj~2/RELEASE_PPC Power Macintosh
Build Date => Dec 14 2002 01:26:11
Configure Command => './configure' '--without-mysql'
'--with-fbsql' '--with-apxs'
Server API => Command Line Interface
Virtual Directory Support => disabled
Configuration File (php.ini) Path => /usr/local/lib/php.ini
PHP API => 20020918
PHP Extension => 20020429
Zend Extension => 20021010
Debug Build => no
Thread Safety => disabled
Registered PHP Streams => php, http, ftp
This program makes use of the Zend Scripting Language Engine:
Zend Engine v1.3.0, Copyright (c) 1998-2002 Zend Technologies
_______________________________________________________________________
Configuration
PHP Core
Directive => Local Value => Master Value
allow_call_time_pass_reference => Off => Off
allow_url_fopen => On => On
always_populate_raw_post_data => Off => Off
arg_separator.input => & => &
arg_separator.output => & => &
asp_tags => Off => Off
auto_append_file => no value => no value
auto_prepend_file => no value => no value
browscap => no value => no value
default_charset => no value => no value
default_mimetype => text/html => text/html
define_syslog_variables => Off => Off
disable_functions => no value => no value
display_errors => On => On
display_startup_errors => Off => Off
doc_root => no value => no value
docref_ext => no value => no value
docref_root => http://www.php.net/ => http://www.php.net/
enable_dl => On => On
error_append_string => no value => no value
error_log => no value => no value
error_prepend_string => no value => no value
error_reporting => 2047 => 2047
expose_php => On => On
extension_dir => ./ => ./
file_uploads => On => On
gpc_order => GPC => GPC
highlight.bg => #FFFFFF => #FFFFFF
highlight.comment => #FF9900 => #FF9900
highlight.default => #0000CC => #0000CC
highlight.html => #000000 => #000000
highlight.keyword => #006600 => #006600
highlight.string => #CC0000 => #CC0000
html_errors => Off => On
ignore_repeated_errors => Off => Off
ignore_repeated_source => Off => Off
ignore_user_abort => Off => Off
implicit_flush => On => Off
include_path => .:/php/includes:/Library/WebServer/Documents/bavc/libs:/usr/local/lib/php =>
.:/php/includes:/Library/WebServer/Documents/bavc/libs:/usr/local/lib/php
log_errors => On => On
log_errors_max_len => 1024 => 1024
magic_quotes_gpc => Off => Off
magic_quotes_runtime => Off => Off
magic_quotes_sybase => On => On
max_execution_time => 0 => 30
max_input_time => -1 => -1
open_basedir => no value => no value
output_buffering => 4096 => 4096
output_handler => no value => no value
post_max_size => 8M => 8M
precision => 14 => 14
register_argc_argv => On => Off
register_globals => On => On
report_memleaks => On => On
safe_mode => Off => Off
safe_mode_exec_dir => no value => no value
safe_mode_gid => Off => Off
safe_mode_include_dir => no value => no value
sendmail_from => no value => no value
sendmail_path => /usr/sbin/sendmail -t -i -f lr@localhost => /usr/sbin/sendmail -t -i -f
lr@localhost
short_open_tag => On => On
SMTP => localhost => localhost
smtp_port => 25 => 25
sql.safe_mode => Off => Off
track_errors => Off => Off
unserialize_callback_func => no value => no value
upload_max_filesize => 2M => 2M
upload_tmp_dir => no value => no value
user_dir => no value => no value
variables_order => GPCS => GPCS
xmlrpc_error_number => 0 => 0
xmlrpc_errors => Off => Off
y2k_compliance => Off => Off
ctype
ctype functions => enabled
fbsql
FrontBase support => enabled
Client API version => 2.24
Active Persistent Links => 0
Active Links => 0
Directive => Local Value => Master Value
fbsql.allow_persistent => On => On
fbsql.autocommit => On => On
fbsql.batchSize => 1000 => 1000
fbsql.default_database => no value => no value
fbsql.default_database_password => no value => no value
fbsql.default_host => no value => no value
fbsql.default_password => no value => no value
fbsql.default_user => _SYSTEM => _SYSTEM
fbsql.generate_warnings => Off => Off
fbsql.max_connections => 128 => 128
fbsql.max_links => 128 => 128
fbsql.max_persistent => Unlimited => Unlimited
fbsql.max_results => 128 => 128
overload
User-Space Object Overloading Support => enabled
pcre
PCRE (Perl Compatible Regular Expressions) Support => enabled
PCRE Library Version => 3.92 11-Sep-2002
posix
Revision => $Revision: 1.51 $
session
Session Support => enabled
Registered save handlers => files user
Directive => Local Value => Master Value
session.auto_start => Off => Off
session.bug_compat_42 => On => On
session.bug_compat_warn => On => On
session.cache_expire => 180 => 180
session.cache_limiter => nocache => nocache
session.cookie_domain => no value => no value
session.cookie_lifetime => 0 => 0
session.cookie_path => / => /
session.cookie_secure => Off => Off
session.entropy_file => no value => no value
session.entropy_length => 0 => 0
session.gc_dividend => 100 => 100
session.gc_maxlifetime => 1440 => 1440
session.gc_probability => 1 => 1
session.name => otlsessid => otlsessid
session.referer_check => no value => no value
session.save_handler => files => files
session.save_path => /tmp => /tmp
session.serialize_handler => php => php
session.use_cookies => Off => Off
session.use_only_cookies => Off => Off
session.use_trans_sid => On => On
standard
Regex Library => Bundled library enabled
Dynamic Library Support => enabled
Path to sendmail => /usr/sbin/sendmail -t -i -f lr@localhost
Directive => Local Value => Master Value
assert.active => 1 => 1
assert.bail => 0 => 0
assert.callback => no value => no value
assert.quiet_eval => 0 => 0
assert.warning => 1 => 1
auto_detect_line_endings => 0 => 0
default_socket_timeout => 60 => 60
safe_mode_allowed_env_vars => PHP_ => PHP_
safe_mode_protected_env_vars => LD_LIBRARY_PATH => LD_LIBRARY_PATH
url_rewriter.tags => a=href,area=href,frame=src,input=src,form=fakeentry =>
a=href,area=href,frame=src,input=src,form=fakeentry
user_agent => no value => no value
tokenizer
Tokenizer Support => enabled
xml
XML Support => active
XML Namespace Support => active
EXPAT Version => 1.95.2
Additional Modules
Module Name
Environment
Variable => Value
PWD => /Users/lr/src/php-4.3.0RC3
P4PASSWD => lr
P4PORT => localhost:1666
CATALINA_HOME => /Library/Tomcat
MAKEFLAGS => VENDOR => apple
MFLAGS => REDIRECT_STATUS => TEST_PHP_EXECUTABLE =>
/Users/lr/src/php-4.3.0RC3/sapi/cli/php
P4USER => lr
TERM_PROGRAM => Apple_Terminal
P4CLIENT => lr_home
CC => gcc
USER => lr
MACHTYPE => powerpc
SCRIPT_FILENAME => ENV_SET => PATH_TRANSLATED => TERMCAP => ¿ÿØ
EDITOR => emacs
LANG => en_US
QUERY_STRING => CONTENT_LENGTH => JAVA_HOME => /Library/Java/Home
HOST => nose.local.
MAKELEVEL => 1
SHLVL => 3
LOGNAME => lr
GROUP => staff
_ => /Users/lr/src/php-4.3.0RC3/sapi/cli/php
REQUEST_METHOD => SHELL => /bin/sh
CVSEDITOR => emacs
CVSROOT => /Library/cvs
HOSTTYPE => macintosh
TEST_PHP_SRCDIR => /Users/lr/src/php-4.3.0RC3
OSTYPE => darwin
TERM => vt100
HOME => /Users/lr
TERM_PROGRAM_VERSION => 81
PATH => /bin:/sbin:/usr/bin:/usr/sbin
__CF_USER_TEXT_ENCODING => 0x1F5:0:0
CONTENT_TYPE =>
PHP Variables
Variable => Value
PHP_SELF => _SERVER["PWD"] => /Users/lr/src/php-4.3.0RC3
_SERVER["P4PASSWD"] => lr
_SERVER["P4PORT"] => localhost:1666
_SERVER["CATALINA_HOME"] => /Library/Tomcat
_SERVER["MAKEFLAGS"] =>
_SERVER["VENDOR"] => apple
_SERVER["MFLAGS"] =>
_SERVER["REDIRECT_STATUS"] =>
_SERVER["TEST_PHP_EXECUTABLE"] => /Users/lr/src/php-4.3.0RC3/sapi/cli/php
_SERVER["P4USER"] => lr
_SERVER["TERM_PROGRAM"] => Apple_Terminal
_SERVER["P4CLIENT"] => lr_home
_SERVER["CC"] => gcc
_SERVER["USER"] => lr
_SERVER["MACHTYPE"] => powerpc
_SERVER["SCRIPT_FILENAME"] =>
_SERVER["ENV_SET"] =>
_SERVER["PATH_TRANSLATED"] =>
_SERVER["TERMCAP"] => ¿ÿØ
_SERVER["EDITOR"] => emacs
_SERVER["LANG"] => en_US
_SERVER["QUERY_STRING"] =>
_SERVER["CONTENT_LENGTH"] =>
_SERVER["JAVA_HOME"] => /Library/Java/Home
_SERVER["HOST"] => nose.local.
_SERVER["MAKELEVEL"] => 1
_SERVER["SHLVL"] => 3
_SERVER["LOGNAME"] => lr
_SERVER["GROUP"] => staff
_SERVER["_"] => /Users/lr/src/php-4.3.0RC3/sapi/cli/php
_SERVER["REQUEST_METHOD"] =>
_SERVER["SHELL"] => /bin/sh
_SERVER["CVSEDITOR"] => emacs
_SERVER["CVSROOT"] => /Library/cvs
_SERVER["HOSTTYPE"] => macintosh
_SERVER["TEST_PHP_SRCDIR"] => /Users/lr/src/php-4.3.0RC3
_SERVER["OSTYPE"] => darwin
_SERVER["TERM"] => vt100
_SERVER["HOME"] => /Users/lr
_SERVER["TERM_PROGRAM_VERSION"] => 81
_SERVER["PATH"] => /bin:/sbin:/usr/bin:/usr/sbin
_SERVER["__CF_USER_TEXT_ENCODING"] => 0x1F5:0:0
_SERVER["CONTENT_TYPE"] =>
_SERVER["PHP_SELF"] =>
_SERVER["SCRIPT_NAME"] =>
_SERVER["DOCUMENT_ROOT"] =>
_SERVER["argv"] => Array
(
)
_SERVER["argc"] => 0
PHP License
This program is free software; you can redistribute it and/or modify
it under the terms of the PHP License as published by the PHP Group
and included in the distribution in the file: LICENSE
This program is distributed in the hope that it will be useful,
but WITHOUT ANY WARRANTY; without even the implied warranty of
MERCHANTABILITY or FITNESS FOR A PARTICULAR PURPOSE.
If you did not receive a copy of the PHP license, or have any
questions about PHP licensing, please contact license@php.net.