Test results

From: Date: Sun, 15 Dec 2002 16:33:31 +0000
Subject: Test results
Groups: php.qa 
Request: Send a blank email to php-qa+get-7280@lists.php.net to get a copy of this message
===================================================================== FAILED TEST SUMMARY --------------------------------------------------------------------- session object serialization [E:\devel\php4\ext\session\tests\001.phpt] session object deserialization [E:\devel\php4\ext\session\tests\003.phpt] correct instantiation of references between variables in sessions [E:\devel\php4\ext\session\tests\006.phpt] bug compatibility: unset($c) with enabled register_globals [E:\devel\php4\ext\session\tests\007.phpt] bug compatibility: global is used albeit register_globals=0 [E:\devel\php4\ext\session\tests\008-php4.2.3.phpt] unset($_SESSION["name"]); should work with register_globals=off [E:\devel\php4\ext\session\tests\009.phpt] registering $_SESSION should not segfault [E:\devel\php4\ext\session\tests\012.phpt] redefining SID should not cause warnings [E:\devel\php4\ext\session\tests\013.phpt] a script should not be able to modify session.use_trans_sid [E:\devel\php4\ext\session\tests\014.phpt] use_trans_sid should not affect SID [E:\devel\php4\ext\session\tests\015.phpt] setting $_SESSION before session_start() should not cause segfault [E:\devel\php4\ext\session\tests\017.phpt] rewriter correctly handles attribute names which contain dashes [E:\devel\php4\ext\session\tests\018.phpt] serializing references test case using globals [E:\devel\php4\ext\session\tests\019.phpt] rewriter uses arg_seperator.output for modifying URLs [E:\devel\php4\ext\session\tests\020.phpt] rewriter handles form and fieldset tags correctly [E:\devel\php4\ext\session\tests\021.phpt] File type functions [E:\devel\php4\ext\standard\tests\file\001.phpt] is_*() and file_exists() return values are boolean. [E:\devel\php4\ext\standard\tests\file\003.phpt] Bug #12556: fgetcvs ignores lengths when quotes not closed [E:\devel\php4\ext\standard\tests\file\bug12556.phpt] quoted_printable_decode() function test with CR/LF [E:\devel\php4\ext\standard\tests\general_functions\006.phpt] MD5 / Base64 [E:\devel\php4\ext\standard\tests\general_functions\007.phpt] getopt [E:\devel\php4\ext\standard\tests\general_functions\getopt.phpt] proc_open [E:\devel\php4\ext\standard\tests\general_functions\proc_open.phpt] Various pow() tests [E:\devel\php4\ext\standard\tests\math\pow.phpt] Test split() [E:\devel\php4\ext\standard\tests\reg\009.phpt] unserialize() floats with E notation (#18654) [E:\devel\php4\ext\standard\tests\serialize\003.phpt] nl2br() function [E:\devel\php4\ext\standard\tests\strings\nl2br.phpt] wordwrap() function [E:\devel\php4\ext\standard\tests\strings\wordwrap.phpt] strtotime() function [E:\devel\php4\ext\standard\tests\time\002.phpt] Check for mktime with out-of-range parameters [E:\devel\php4\ext\standard\tests\time\003.phpt] Bug #20993 (referenced array key, makes array global) [E:\devel\php4\tests\lang\bug20993.phpt] ===================================================================== ================================================================================ E:\devel\php4\ext\session\tests\001.phpt ================================================================================ ---- EXPECTED OUTPUT baz|O:3:"foo":2:{s:3:"bar";s:2:"ok";s:3:"yes";s:4:"done";}arr|a:1:{i:3;O:3:"foo":2:{s:3:"bar";s:2:"ok";s:3:"yes";s:4:"done";}} ---- ACTUAL OUTPUT Warning: session_register() [/phpmanual/function.session-register.html]: open(/tmp\sess_ae175faf3f208a6dcf6b5588c7e6d9de, O_RDWR) failed: No such file or directory (2) in E:\devel\php4\ext\session\tests\001.php on line 16 baz|O:3:"foo":2:{s:3:"bar";s:2:"ok";s:3:"yes";s:4:"done";}arr|a:1:{i:3;O:3:"foo":2:{s:3:"bar";s:2:"ok";s:3:"yes";s:4:"done";}} Warning: session_destroy() [/phpmanual/function.session-destroy.html]: Session object destruction failed in E:\devel\php4\ext\session\tests\001.php on line 21 ---- FAILED ================================================================================ 001- baz|O:3:"foo":2:{s:3:"bar";s:2:"ok";s:3:"yes";s:4:"done";}arr|a:1:{i:3;O:3:"foo":2:{s:3:"bar";s:2:"ok";s:3:"yes";s:4:"done";}} 001+ Warning: session_register() [/phpmanual/function.session-register.html]: open(/tmp\sess_ae175faf3f208a6dcf6b5588c7e6d9de, O_RDWR) failed: No such file or directory (2) in E:\devel\php4\ext\session\tests\001.php on line 16 002+ baz|O:3:"foo":2:{s:3:"bar";s:2:"ok";s:3:"yes";s:4:"done";}arr|a:1:{i:3;O:3:"foo":2:{s:3:"bar";s:2:"ok";s:3:"yes";s:4:"done";}} 003+ 004+ Warning: session_destroy() [/phpmanual/function.session-destroy.html]: Session object destruction failed in E:\devel\php4\ext\session\tests\001.php on line 21 ================================================================================ ================================================================================ E:\devel\php4\ext\session\tests\003.phpt ================================================================================ ---- EXPECTED OUTPUT object(foo)(2) { ["bar"]=> string(2) "ok" ["yes"]=> int(2) } array(1) { [3]=> &object(foo)(2) { ["bar"]=> string(2) "ok" ["yes"]=> int(2) } } ---- ACTUAL OUTPUT Warning: session_start() [/phpmanual/function.session-start.html]: open(/tmp\sess_abtest, O_RDWR) failed: No such file or directory (2) in E:\devel\php4\ext\session\tests\003.php on line 10 object(foo)(2) { ["bar"]=> string(2) "ok" ["yes"]=> int(2) } array(1) { [3]=> &object(foo)(2) { ["bar"]=> string(2) "ok" ["yes"]=> int(2) } } Warning: session_destroy() [/phpmanual/function.session-destroy.html]: Session object destruction failed in E:\devel\php4\ext\session\tests\003.php on line 18 ---- FAILED ================================================================================ 001- object(foo)(2) { 001+ Warning: session_start() [/phpmanual/function.session-start.html]: open(/tmp\sess_abtest, O_RDWR) failed: No such file or directory (2) in E:\devel\php4\ext\session\tests\003.php on line 10 002- ["bar"]=> 002+ object(foo)(2) { 003- string(2) "ok" 003+ ["bar"]=> 004- ["yes"]=> 004+ string(2) "ok" 005- int(2) 005+ ["yes"]=> 006- } 006+ int(2) 007- array(1) { 007+ } 008- [3]=> 008+ array(1) { 009- &object(foo)(2) { 009+ [3]=> 010- ["bar"]=> 010+ &object(foo)(2) { 011- string(2) "ok" 011+ ["bar"]=> 012- ["yes"]=> 012+ string(2) "ok" 013- int(2) 013+ ["yes"]=> 014- } 014+ int(2) 015- } 015+ } 016+ } 017+ 018+ Warning: session_destroy() [/phpmanual/function.session-destroy.html]: Session object destruction failed in E:\devel\php4\ext\session\tests\003.php on line 18 ================================================================================ ================================================================================ E:\devel\php4\ext\session\tests\006.phpt ================================================================================ ---- EXPECTED OUTPUT original values: object(a)(1) { ["test"]=> string(5) "hallo" } object(b)(1) { ["a"]=> &object(a)(1) { ["test"]=> string(5) "hallo" } } values after session: object(a)(1) { ["test"]=> string(5) "hallo" } object(b)(1) { ["a"]=> &object(a)(1) { ["test"]=> string(5) "hallo" } } ---- ACTUAL OUTPUT Warning: session_start() [/phpmanual/function.session-start.html]: open(/tmp\sess_abtest, O_RDWR) failed: No such file or directory (2) in E:\devel\php4\ext\session\tests\006.php on line 5 original values: object(a)(1) { ["test"]=> string(5) "hallo" } object(b)(1) { ["a"]=> &object(a)(1) { ["test"]=> string(5) "hallo" } } Warning: session_write_close() [/phpmanual/function.session-write-close.html]: open(/tmp\sess_abtest, O_RDWR) failed: No such file or directory (2) in E:\devel\php4\ext\session\tests\006.php on line 26 Warning: session_write_close() [/phpmanual/function.session-write-close.html]: Failed to write session data (files). Please verify that the current setting of session.save_path is correct (/tmp) in E:\devel\php4\ext\session\tests\006.php on line 26 Warning: session_start() [/phpmanual/function.session-start.html]: open(/tmp\sess_abtest, O_RDWR) failed: No such file or directory (2) in E:\devel\php4\ext\session\tests\006.php on line 31 values after session: object(a)(1) { ["test"]=> string(5) "hallo" } object(b)(1) { ["a"]=> &object(a)(1) { ["test"]=> string(5) "hallo" } } Warning: Unknown(): open(/tmp\sess_abtest, O_RDWR) failed: No such file or directory (2) in Unknown on line 0 Warning: Unknown(): Failed to write session data (files). Please verify that the current setting of session.save_path is correct (/tmp) in Unknown on line 0 ---- FAILED ================================================================================ 001- original values: 001+ Warning: session_start() [/phpmanual/function.session-start.html]: open(/tmp\sess_abtest, O_RDWR) failed: No such file or directory (2) in E:\devel\php4\ext\session\tests\006.php on line 5 002- object(a)(1) { 002+ original values: 003- ["test"]=> 003+ object(a)(1) { 004- string(5) "hallo" 004+ ["test"]=> 005- } 005+ string(5) "hallo" 006- object(b)(1) { 006+ } 007- ["a"]=> 007+ object(b)(1) { 008- &object(a)(1) { 008+ ["a"]=> 009- ["test"]=> 009+ &object(a)(1) { 010- string(5) "hallo" 010+ ["test"]=> 011- } 011+ string(5) "hallo" 012- } 012+ } 013- values after session: 013+ } 014- object(a)(1) { 014+ 015- ["test"]=> 015+ Warning: session_write_close() [/phpmanual/function.session-write-close.html]: open(/tmp\sess_abtest, O_RDWR) failed: No such file or directory (2) in E:\devel\php4\ext\session\tests\006.php on line 26 016- string(5) "hallo" 016+ 017- } 017+ Warning: session_write_close() [/phpmanual/function.session-write-close.html]: Failed to write session data (files). Please verify that the current setting of session.save_path is correct (/tmp) in E:\devel\php4\ext\session\tests\006.php on line 26 018- object(b)(1) { 018+ 019- ["a"]=> 019+ Warning: session_start() [/phpmanual/function.session-start.html]: open(/tmp\sess_abtest, O_RDWR) failed: No such file or directory (2) in E:\devel\php4\ext\session\tests\006.php on line 31 020- &object(a)(1) { 020+ values after session: 021- ["test"]=> 021+ object(a)(1) { 022- string(5) "hallo" 022+ ["test"]=> 023- } 023+ string(5) "hallo" 025+ object(b)(1) { 026+ ["a"]=> 027+ &object(a)(1) { 028+ ["test"]=> 029+ string(5) "hallo" 030+ } 031+ } 032+ 033+ Warning: Unknown(): open(/tmp\sess_abtest, O_RDWR) failed: No such file or directory (2) in Unknown on line 0 034+ 035+ Warning: Unknown(): Failed to write session data (files). Please verify that the current setting of session.save_path is correct (/tmp) in Unknown on line 0 ================================================================================ ================================================================================ E:\devel\php4\ext\session\tests\007.phpt ================================================================================ ---- EXPECTED OUTPUT float(3.14) array(1) { ["c"]=> &float(3.14) } float(3.14) array(1) { ["c"]=> &float(3.14) } ---- ACTUAL OUTPUT Warning: session_start() [/phpmanual/function.session-start.html]: open(/tmp\sess_abtest, O_RDWR) failed: No such file or directory (2) in E:\devel\php4\ext\session\tests\007.php on line 7 Warning: session_destroy() [/phpmanual/function.session-destroy.html]: Session object destruction failed in E:\devel\php4\ext\session\tests\007.php on line 8 Warning: session_register() [/phpmanual/function.session-register.html]: open(/tmp\sess_abtest, O_RDWR) failed: No such file or directory (2) in E:\devel\php4\ext\session\tests\007.php on line 12 Warning: session_write_close() [/phpmanual/function.session-write-close.html]: open(/tmp\sess_abtest, O_RDWR) failed: No such file or directory (2) in E:\devel\php4\ext\session\tests\007.php on line 15 Warning: session_write_close() [/phpmanual/function.session-write-close.html]: Failed to write session data (files). Please verify that the current setting of session.save_path is correct (/tmp) in E:\devel\php4\ext\session\tests\007.php on line 15 Warning: session_start() [/phpmanual/function.session-start.html]: open(/tmp\sess_abtest, O_RDWR) failed: No such file or directory (2) in E:\devel\php4\ext\session\tests\007.php on line 20 Notice: Undefined variable: c in E:\devel\php4\ext\session\tests\007.php on line 21 NULL array(0) { } Warning: session_write_close() [/phpmanual/function.session-write-close.html]: open(/tmp\sess_abtest, O_RDWR) failed: No such file or directory (2) in E:\devel\php4\ext\session\tests\007.php on line 26 Warning: session_write_close() [/phpmanual/function.session-write-close.html]: Failed to write session data (files). Please verify that the current setting of session.save_path is correct (/tmp) in E:\devel\php4\ext\session\tests\007.php on line 26 Warning: session_start() [/phpmanual/function.session-start.html]: open(/tmp\sess_abtest, O_RDWR) failed: No such file or directory (2) in E:\devel\php4\ext\session\tests\007.php on line 32 Notice: Undefined variable: c in E:\devel\php4\ext\session\tests\007.php on line 33 NULL array(0) { } Warning: session_destroy() [/phpmanual/function.session-destroy.html]: Session object destruction failed in E:\devel\php4\ext\session\tests\007.php on line 36 ---- FAILED ================================================================================ 001- float(3.14) 001+ Warning: session_start() [/phpmanual/function.session-start.html]: open(/tmp\sess_abtest, O_RDWR) failed: No such file or directory (2) in E:\devel\php4\ext\session\tests\007.php on line 7 002- array(1) { 002+ 003- ["c"]=> 003+ Warning: session_destroy() [/phpmanual/function.session-destroy.html]: Session object destruction failed in E:\devel\php4\ext\session\tests\007.php on line 8 004- &float(3.14) 004+ 005- } 005+ Warning: session_register() [/phpmanual/function.session-register.html]: open(/tmp\sess_abtest, O_RDWR) failed: No such file or directory (2) in E:\devel\php4\ext\session\tests\007.php on line 12 006- float(3.14) 006+ 007- array(1) { 007+ Warning: session_write_close() [/phpmanual/function.session-write-close.html]: open(/tmp\sess_abtest, O_RDWR) failed: No such file or directory (2) in E:\devel\php4\ext\session\tests\007.php on line 15 008- ["c"]=> 008+ 009- &float(3.14) 009+ Warning: session_write_close() [/phpmanual/function.session-write-close.html]: Failed to write session data (files). Please verify that the current setting of session.save_path is correct (/tmp) in E:\devel\php4\ext\session\tests\007.php on line 15 010- } 010+ 011+ Warning: session_start() [/phpmanual/function.session-start.html]: open(/tmp\sess_abtest, O_RDWR) failed: No such file or directory (2) in E:\devel\php4\ext\session\tests\007.php on line 20 012+ 013+ Notice: Undefined variable: c in E:\devel\php4\ext\session\tests\007.php on line 21 014+ NULL 015+ array(0) { 016+ } 017+ 018+ Warning: session_write_close() [/phpmanual/function.session-write-close.html]: open(/tmp\sess_abtest, O_RDWR) failed: No such file or directory (2) in E:\devel\php4\ext\session\tests\007.php on line 26 019+ 020+ Warning: session_write_close() [/phpmanual/function.session-write-close.html]: Failed to write session data (files). Please verify that the current setting of session.save_path is correct (/tmp) in E:\devel\php4\ext\session\tests\007.php on line 26 021+ 022+ Warning: session_start() [/phpmanual/function.session-start.html]: open(/tmp\sess_abtest, O_RDWR) failed: No such file or directory (2) in E:\devel\php4\ext\session\tests\007.php on line 32 023+ 024+ Notice: Undefined variable: c in E:\devel\php4\ext\session\tests\007.php on line 33 025+ NULL 026+ array(0) { 027+ } 028+ 029+ Warning: session_destroy() [/phpmanual/function.session-destroy.html]: Session object destruction failed in E:\devel\php4\ext\session\tests\007.php on line 36 ================================================================================ ================================================================================ E:\devel\php4\ext\session\tests\008-php4.2.3.phpt ================================================================================ ---- EXPECTED OUTPUT NULL Your script possibly relies on a session side-effect which existed until PHP 4.2.3. Please be advised that the session extension does not consider global variables as a source of data, unless register_globals is enabled. You can disable this functionality and this warning by setting session.bug_compat_42 or session.bug_compat_warn to off, respectively. array(1) { ["c"]=> float(3.14) } NULL array(1) { ["c"]=> float(3.14) } ---- ACTUAL OUTPUT Warning: session_start() [/phpmanual/function.session-start.html]: open(/tmp\sess_abtest, O_RDWR) failed: No such file or directory (2) in E:\devel\php4\ext\session\tests\008-php4.2.3.php on line 5 Warning: session_destroy() [/phpmanual/function.session-destroy.html]: Session object destruction failed in E:\devel\php4\ext\session\tests\008-php4.2.3.php on line 6 Warning: session_register() [/phpmanual/function.session-register.html]: open(/tmp\sess_abtest, O_RDWR) failed: No such file or directory (2) in E:\devel\php4\ext\session\tests\008-php4.2.3.php on line 10 NULL Failed to write session data (files). Please verify that the current setting of session.save_path is correct (/tmp) Warning: session_start() [/phpmanual/function.session-start.html]: open(/tmp\sess_abtest, O_RDWR) failed: No such file or directory (2) in E:\devel\php4\ext\session\tests\008-php4.2.3.php on line 21 array(0) { } Warning: session_write_close() [/phpmanual/function.session-write-close.html]: open(/tmp\sess_abtest, O_RDWR) failed: No such file or directory (2) in E:\devel\php4\ext\session\tests\008-php4.2.3.php on line 26 Warning: session_write_close() [/phpmanual/function.session-write-close.html]: Failed to write session data (files). Please verify that the current setting of session.save_path is correct (/tmp) in E:\devel\php4\ext\session\tests\008-php4.2.3.php on line 26 Warning: session_start() [/phpmanual/function.session-start.html]: open(/tmp\sess_abtest, O_RDWR) failed: No such file or directory (2) in E:\devel\php4\ext\session\tests\008-php4.2.3.php on line 32 NULL array(0) { } Warning: session_destroy() [/phpmanual/function.session-destroy.html]: Session object destruction failed in E:\devel\php4\ext\session\tests\008-php4.2.3.php on line 36 ---- FAILED ================================================================================ 001- NULL 001+ Warning: session_start() [/phpmanual/function.session-start.html]: open(/tmp\sess_abtest, O_RDWR) failed: No such file or directory (2) in E:\devel\php4\ext\session\tests\008-php4.2.3.php on line 5 002- Your script possibly relies on a session side-effect which existed until PHP 4.2.3. Please be advised that the session extension does not consider global variables as a source of data, unless register_globals is enabled. You can disable this functionality and this warning by setting session.bug_compat_42 or session.bug_compat_warn to off, respectively. 002+ 003- array(1) { 003+ Warning: session_destroy() [/phpmanual/function.session-destroy.html]: Session object destruction failed in E:\devel\php4\ext\session\tests\008-php4.2.3.php on line 6 004- ["c"]=> 004+ 005- float(3.14) 005+ Warning: session_register() [/phpmanual/function.session-register.html]: open(/tmp\sess_abtest, O_RDWR) failed: No such file or directory (2) in E:\devel\php4\ext\session\tests\008-php4.2.3.php on line 10 006- } 006+ NULL 007- NULL 007+ Failed to write session data (files). Please verify that the current setting of session.save_path is correct (/tmp) 008- array(1) { 008+ 009- ["c"]=> 009+ Warning: session_start() [/phpmanual/function.session-start.html]: open(/tmp\sess_abtest, O_RDWR) failed: No such file or directory (2) in E:\devel\php4\ext\session\tests\008-php4.2.3.php on line 21 010- float(3.14) 010+ array(0) { 012+ 013+ Warning: session_write_close() [/phpmanual/function.session-write-close.html]: open(/tmp\sess_abtest, O_RDWR) failed: No such file or directory (2) in E:\devel\php4\ext\session\tests\008-php4.2.3.php on line 26 014+ 015+ Warning: session_write_close() [/phpmanual/function.session-write-close.html]: Failed to write session data (files). Please verify that the current setting of session.save_path is correct (/tmp) in E:\devel\php4\ext\session\tests\008-php4.2.3.php on line 26 016+ 017+ Warning: session_start() [/phpmanual/function.session-start.html]: open(/tmp\sess_abtest, O_RDWR) failed: No such file or directory (2) in E:\devel\php4\ext\session\tests\008-php4.2.3.php on line 32 018+ NULL 019+ array(0) { 020+ } 021+ 022+ Warning: session_destroy() [/phpmanual/function.session-destroy.html]: Session object destruction failed in E:\devel\php4\ext\session\tests\008-php4.2.3.php on line 36 ================================================================================ ================================================================================ E:\devel\php4\ext\session\tests\009.phpt ================================================================================ ---- EXPECTED OUTPUT array(0) { } array(1) { ["name"]=> string(3) "foo" } array(1) { ["name"]=> string(3) "foo" } array(0) { } array(0) { } ---- ACTUAL OUTPUT Warning: session_start() [/phpmanual/function.session-start.html]: open(/tmp\sess_abtest, O_RDWR) failed: No such file or directory (2) in E:\devel\php4\ext\session\tests\009.php on line 7 Warning: session_destroy() [/phpmanual/function.session-destroy.html]: Session object destruction failed in E:\devel\php4\ext\session\tests\009.php on line 8 Warning: session_start() [/phpmanual/function.session-start.html]: open(/tmp\sess_abtest, O_RDWR) failed: No such file or directory (2) in E:\devel\php4\ext\session\tests\009.php on line 12 array(0) { } array(1) { ["name"]=> string(3) "foo" } Warning: session_write_close() [/phpmanual/function.session-write-close.html]: open(/tmp\sess_abtest, O_RDWR) failed: No such file or directory (2) in E:\devel\php4\ext\session\tests\009.php on line 16 Warning: session_write_close() [/phpmanual/function.session-write-close.html]: Failed to write session data (files). Please verify that the current setting of session.save_path is correct (/tmp) in E:\devel\php4\ext\session\tests\009.php on line 16 Warning: session_start() [/phpmanual/function.session-start.html]: open(/tmp\sess_abtest, O_RDWR) failed: No such file or directory (2) in E:\devel\php4\ext\session\tests\009.php on line 19 array(0) { } array(0) { } Warning: session_write_close() [/phpmanual/function.session-write-close.html]: open(/tmp\sess_abtest, O_RDWR) failed: No such file or directory (2) in E:\devel\php4\ext\session\tests\009.php on line 23 Warning: session_write_close() [/phpmanual/function.session-write-close.html]: Failed to write session data (files). Please verify that the current setting of session.save_path is correct (/tmp) in E:\devel\php4\ext\session\tests\009.php on line 23 Warning: session_start() [/phpmanual/function.session-start.html]: open(/tmp\sess_abtest, O_RDWR) failed: No such file or directory (2) in E:\devel\php4\ext\session\tests\009.php on line 27 array(0) { } Warning: session_destroy() [/phpmanual/function.session-destroy.html]: Session object destruction failed in E:\devel\php4\ext\session\tests\009.php on line 29 ---- FAILED ================================================================================ 001- array(0) { 001+ Warning: session_start() [/phpmanual/function.session-start.html]: open(/tmp\sess_abtest, O_RDWR) failed: No such file or directory (2) in E:\devel\php4\ext\session\tests\009.php on line 7 002- } 002+ 003- array(1) { 003+ Warning: session_destroy() [/phpmanual/function.session-destroy.html]: Session object destruction failed in E:\devel\php4\ext\session\tests\009.php on line 8 004- ["name"]=> 004+ 005- string(3) "foo" 005+ Warning: session_start() [/phpmanual/function.session-start.html]: open(/tmp\sess_abtest, O_RDWR) failed: No such file or directory (2) in E:\devel\php4\ext\session\tests\009.php on line 12 006- } 006+ array(0) { 007- array(1) { 007+ } 008- ["name"]=> 008+ array(1) { 009- string(3) "foo" 009+ ["name"]=> 010- } 010+ string(3) "foo" 011- array(0) { 011+ } 012- } 012+ 013- array(0) { 013+ Warning: session_write_close() [/phpmanual/function.session-write-close.html]: open(/tmp\sess_abtest, O_RDWR) failed: No such file or directory (2) in E:\devel\php4\ext\session\tests\009.php on line 16 014- } 014+ 015+ Warning: session_write_close() [/phpmanual/function.session-write-close.html]: Failed to write session data (files). Please verify that the current setting of session.save_path is correct (/tmp) in E:\devel\php4\ext\session\tests\009.php on line 16 016+ 017+ Warning: session_start() [/phpmanual/function.session-start.html]: open(/tmp\sess_abtest, O_RDWR) failed: No such file or directory (2) in E:\devel\php4\ext\session\tests\009.php on line 19 018+ array(0) { 019+ } 020+ array(0) { 021+ } 022+ 023+ Warning: session_write_close() [/phpmanual/function.session-write-close.html]: open(/tmp\sess_abtest, O_RDWR) failed: No such file or directory (2) in E:\devel\php4\ext\session\tests\009.php on line 23 024+ 025+ Warning: session_write_close() [/phpmanual/function.session-write-close.html]: Failed to write session data (files). Please verify that the current setting of session.save_path is correct (/tmp) in E:\devel\php4\ext\session\tests\009.php on line 23 026+ 027+ Warning: session_start() [/phpmanual/function.session-start.html]: open(/tmp\sess_abtest, O_RDWR) failed: No such file or directory (2) in E:\devel\php4\ext\session\tests\009.php on line 27 028+ array(0) { 029+ } 030+ 031+ Warning: session_destroy() [/phpmanual/function.session-destroy.html]: Session object destruction failed in E:\devel\php4\ext\session\tests\009.php on line 29 ================================================================================ ================================================================================ E:\devel\php4\ext\session\tests\012.phpt ================================================================================ ---- EXPECTED OUTPUT I live ---- ACTUAL OUTPUT Warning: session_start() [/phpmanual/function.session-start.html]: open(/tmp\sess_abtest, O_RDWR) failed: No such file or directory (2) in E:\devel\php4\ext\session\tests\012.php on line 7 Warning: session_start() [/phpmanual/function.session-start.html]: open(/tmp\sess_abtest, O_RDWR) failed: No such file or directory (2) in E:\devel\php4\ext\session\tests\012.php on line 15 Warning: session_destroy() [/phpmanual/function.session-destroy.html]: Session object destruction failed in E:\devel\php4\ext\session\tests\012.php on line 17 I live ---- FAILED ================================================================================ 001- I live 001+ Warning: session_start() [/phpmanual/function.session-start.html]: open(/tmp\sess_abtest, O_RDWR) failed: No such file or directory (2) in E:\devel\php4\ext\session\tests\012.php on line 7 002+ 003+ Warning: session_start() [/phpmanual/function.session-start.html]: open(/tmp\sess_abtest, O_RDWR) failed: No such file or directory (2) in E:\devel\php4\ext\session\tests\012.php on line 15 004+ 005+ Warning: session_destroy() [/phpmanual/function.session-destroy.html]: Session object destruction failed in E:\devel\php4\ext\session\tests\012.php on line 17 006+ I live ================================================================================ ================================================================================ E:\devel\php4\ext\session\tests\013.phpt ================================================================================ ---- EXPECTED OUTPUT I live ---- ACTUAL OUTPUT Warning: session_start() [/phpmanual/function.session-start.html]: open(/tmp\sess_abtest, O_RDWR) failed: No such file or directory (2) in E:\devel\php4\ext\session\tests\013.php on line 5 Warning: session_destroy() [/phpmanual/function.session-destroy.html]: Session object destruction failed in E:\devel\php4\ext\session\tests\013.php on line 6 Warning: session_start() [/phpmanual/function.session-start.html]: open(/tmp\sess_abtest2, O_RDWR) failed: No such file or directory (2) in E:\devel\php4\ext\session\tests\013.php on line 8 Warning: session_destroy() [/phpmanual/function.session-destroy.html]: Session object destruction failed in E:\devel\php4\ext\session\tests\013.php on line 9 I live ---- FAILED ================================================================================ 001- I live 001+ Warning: session_start() [/phpmanual/function.session-start.html]: open(/tmp\sess_abtest, O_RDWR) failed: No such file or directory (2) in E:\devel\php4\ext\session\tests\013.php on line 5 002+ 003+ Warning: session_destroy() [/phpmanual/function.session-destroy.html]: Session object destruction failed in E:\devel\php4\ext\session\tests\013.php on line 6 004+ 005+ Warning: session_start() [/phpmanual/function.session-start.html]: open(/tmp\sess_abtest2, O_RDWR) failed: No such file or directory (2) in E:\devel\php4\ext\session\tests\013.php on line 8 006+ 007+ Warning: session_destroy() [/phpmanual/function.session-destroy.html]: Session object destruction failed in E:\devel\php4\ext\session\tests\013.php on line 9 008+ I live ================================================================================ ================================================================================ E:\devel\php4\ext\session\tests\014.phpt ================================================================================ ---- EXPECTED OUTPUT <a href="/link?PHPSESSID=abtest"> <a href="/link?PHPSESSID=abtest"> <a href="/link?PHPSESSID=abtest"> ---- ACTUAL OUTPUT Warning: session_start() [/phpmanual/function.session-start.html]: open(/tmp\sess_abtest, O_RDWR) failed: No such file or directory (2) in E:\devel\php4\ext\session\tests\014.php on line 5 <a href="/link?PHPSESSID=abtest"> <a href="/link?PHPSESSID=abtest"> <a href="/link?PHPSESSID=abtest"> Warning: session_destroy() [/phpmanual/function.session-destroy.html]: Session object destruction failed in E:\devel\php4\ext\session\tests\014.php on line 18 ---- FAILED ================================================================================ 001- <a href="/link?PHPSESSID=abtest"> 001+ Warning: session_start() [/phpmanual/function.session-start.html]: open(/tmp\sess_abtest, O_RDWR) failed: No such file or directory (2) in E:\devel\php4\ext\session\tests\014.php on line 5 004+ <a href="/link?PHPSESSID=abtest"> 005+ 006+ Warning: session_destroy() [/phpmanual/function.session-destroy.html]: Session object destruction failed in E:\devel\php4\ext\session\tests\014.php on line 18 ================================================================================ ================================================================================ E:\devel\php4\ext\session\tests\015.phpt ================================================================================ ---- EXPECTED OUTPUT <a href="/link?PHPSESSID=abtest&PHPSESSID=abtest"> ---- ACTUAL OUTPUT Warning: session_start() [/phpmanual/function.session-start.html]: open(/tmp\sess_abtest, O_RDWR) failed: No such file or directory (2) in E:\devel\php4\ext\session\tests\015.php on line 5 <a href="/link?PHPSESSID=abtest&PHPSESSID=abtest"> Warning: session_destroy() [/phpmanual/function.session-destroy.html]: Session object destruction failed in E:\devel\php4\ext\session\tests\015.php on line 9 ---- FAILED ================================================================================ 001- <a href="/link?PHPSESSID=abtest&PHPSESSID=abtest"> 001+ Warning: session_start() [/phpmanual/function.session-start.html]: open(/tmp\sess_abtest, O_RDWR) failed: No such file or directory (2) in E:\devel\php4\ext\session\tests\015.php on line 5 002+ <a href="/link?PHPSESSID=abtest&PHPSESSID=abtest"> 003+ 004+ Warning: session_destroy() [/phpmanual/function.session-destroy.html]: Session object destruction failed in E:\devel\php4\ext\session\tests\015.php on line 9 ================================================================================ ================================================================================ E:\devel\php4\ext\session\tests\017.phpt ================================================================================ ---- EXPECTED OUTPUT I live ---- ACTUAL OUTPUT Warning: session_start() [/phpmanual/function.session-start.html]: open(/tmp\sess_2d7da30a25b89d7720c3abfaa6dc9b7f, O_RDWR) failed: No such file or directory (2) in E:\devel\php4\ext\session\tests\017.php on line 8 I live Warning: Unknown(): open(/tmp\sess_2d7da30a25b89d7720c3abfaa6dc9b7f, O_RDWR) failed: No such file or directory (2) in Unknown on line 0 Warning: Unknown(): Failed to write session data (files). Please verify that the current setting of session.save_path is correct (/tmp) in Unknown on line 0 ---- FAILED ================================================================================ 001- I live 001+ Warning: session_start() [/phpmanual/function.session-start.html]: open(/tmp\sess_2d7da30a25b89d7720c3abfaa6dc9b7f, O_RDWR) failed: No such file or directory (2) in E:\devel\php4\ext\session\tests\017.php on line 8 002+ I live 003+ 004+ Warning: Unknown(): open(/tmp\sess_2d7da30a25b89d7720c3abfaa6dc9b7f, O_RDWR) failed: No such file or directory (2) in Unknown on line 0 005+ 006+ Warning: Unknown(): Failed to write session data (files). Please verify that the current setting of session.save_path is correct (/tmp) in Unknown on line 0 ================================================================================ ================================================================================ E:\devel\php4\ext\session\tests\018.phpt ================================================================================ ---- EXPECTED OUTPUT <form accept-charset="ISO-8859-15, ISO-8859-1" action=url.php><input type="hidden" name="PHPSESSID" value="abtest" /> ---- ACTUAL OUTPUT Warning: session_start() [/phpmanual/function.session-start.html]: open(/tmp\sess_abtest, O_RDWR) failed: No such file or directory (2) in E:\devel\php4\ext\session\tests\018.php on line 6 <form accept-charset="ISO-8859-15, ISO-8859-1" action=url.php><input type="hidden" name="PHPSESSID" value="abtest" /> Warning: session_destroy() [/phpmanual/function.session-destroy.html]: Session object destruction failed in E:\devel\php4\ext\session\tests\018.php on line 10 ---- FAILED ================================================================================ 001- <form accept-charset="ISO-8859-15, ISO-8859-1" action=url.php><input type="hidden" name="PHPSESSID" value="abtest" /> 001+ Warning: session_start() [/phpmanual/function.session-start.html]: open(/tmp\sess_abtest, O_RDWR) failed: No such file or directory (2) in E:\devel\php4\ext\session\tests\018.php on line 6 002+ <form accept-charset="ISO-8859-15, ISO-8859-1" action=url.php><input type="hidden" name="PHPSESSID" value="abtest" /> 003+ 004+ Warning: session_destroy() [/phpmanual/function.session-destroy.html]: Session object destruction failed in E:\devel\php4\ext\session\tests\018.php on line 10 ================================================================================ ================================================================================ E:\devel\php4\ext\session\tests\019.phpt ================================================================================ ---- EXPECTED OUTPUT array(2) { ["o1"]=> &object(tfoo)(1) { ["c"]=> int(42) } ["o2"]=> &object(tfoo)(1) { ["c"]=> int(42) } } array(2) { ["o1"]=> &object(tfoo)(1) { ["c"]=> int(44) } ["o2"]=> &object(tfoo)(1) { ["c"]=> int(44) } } ---- ACTUAL OUTPUT Warning: session_register() [/phpmanual/function.session-register.html]: open(/tmp\sess_abtest, O_RDWR) failed: No such file or directory (2) in E:\devel\php4\ext\session\tests\019.php on line 16 Warning: session_write_close() [/phpmanual/function.session-write-close.html]: open(/tmp\sess_abtest, O_RDWR) failed: No such file or directory (2) in E:\devel\php4\ext\session\tests\019.php on line 22 Warning: session_write_close() [/phpmanual/function.session-write-close.html]: Failed to write session data (files). Please verify that the current setting of session.save_path is correct (/tmp) in E:\devel\php4\ext\session\tests\019.php on line 22 Warning: session_start() [/phpmanual/function.session-start.html]: open(/tmp\sess_abtest, O_RDWR) failed: No such file or directory (2) in E:\devel\php4\ext\session\tests\019.php on line 27 array(0) { } Fatal error: Call to a member function on a non-object in E:\devel\php4\ext\session\tests\019.php on line 31 Warning: Unknown(): open(/tmp\sess_abtest, O_RDWR) failed: No such file or directory (2) in Unknown on line 0 Warning: Unknown(): Failed to write session data (files). Please verify that the current setting of session.save_path is correct (/tmp) in Unknown on line 0 ---- FAILED ================================================================================ 001- array(2) { 001+ Warning: session_register() [/phpmanual/function.session-register.html]: open(/tmp\sess_abtest, O_RDWR) failed: No such file or directory (2) in E:\devel\php4\ext\session\tests\019.php on line 16 002- ["o1"]=> 002+ 003- &object(tfoo)(1) { 003+ Warning: session_write_close() [/phpmanual/function.session-write-close.html]: open(/tmp\sess_abtest, O_RDWR) failed: No such file or directory (2) in E:\devel\php4\ext\session\tests\019.php on line 22 004- ["c"]=> 004+ 005- int(42) 005+ Warning: session_write_close() [/phpmanual/function.session-write-close.html]: Failed to write session data (files). Please verify that the current setting of session.save_path is correct (/tmp) in E:\devel\php4\ext\session\tests\019.php on line 22 006- } 006+ 007- ["o2"]=> 007+ Warning: session_start() [/phpmanual/function.session-start.html]: open(/tmp\sess_abtest, O_RDWR) failed: No such file or directory (2) in E:\devel\php4\ext\session\tests\019.php on line 27 008- &object(tfoo)(1) { 008+ array(0) { 009- ["c"]=> 009+ } 010- int(42) 010+ 011- } 011+ Fatal error: Call to a member function on a non-object in E:\devel\php4\ext\session\tests\019.php on line 31 012- } 012+ 013- array(2) { 013+ Warning: Unknown(): open(/tmp\sess_abtest, O_RDWR) failed: No such file or directory (2) in Unknown on line 0 014- ["o1"]=> 014+ 015- &object(tfoo)(1) { 015+ Warning: Unknown(): Failed to write session data (files). Please verify that the current setting of session.save_path is correct (/tmp) in Unknown on line 0 016- ["c"]=> 017- int(44) 018- } 019- ["o2"]=> 020- &object(tfoo)(1) { 021- ["c"]=> 022- int(44) 023- } 024- } ================================================================================ ================================================================================ E:\devel\php4\ext\session\tests\020.phpt ================================================================================ ---- EXPECTED OUTPUT <a href="link.php?a=b&amp;PHPSESSID=abtest"> ---- ACTUAL OUTPUT Warning: session_start() [/phpmanual/function.session-start.html]: open(/tmp\sess_abtest, O_RDWR) failed: No such file or directory (2) in E:\devel\php4\ext\session\tests\020.php on line 6 <a href="link.php?a=b&amp;PHPSESSID=abtest"> Warning: session_destroy() [/phpmanual/function.session-destroy.html]: Session object destruction failed in E:\devel\php4\ext\session\tests\020.php on line 10 ---- FAILED ================================================================================ 001- <a href="link.php?a=b&amp;PHPSESSID=abtest"> 001+ Warning: session_start() [/phpmanual/function.session-start.html]: open(/tmp\sess_abtest, O_RDWR) failed: No such file or directory (2) in E:\devel\php4\ext\session\tests\020.php on line 6 002+ <a href="link.php?a=b&amp;PHPSESSID=abtest"> 003+ 004+ Warning: session_destroy() [/phpmanual/function.session-destroy.html]: Session object destruction failed in E:\devel\php4\ext\session\tests\020.php on line 10 ================================================================================ ================================================================================ E:\devel\php4\ext\session\tests\021.phpt ================================================================================ ---- EXPECTED OUTPUT <form><input type="hidden" name="PHPSESSID" value="abtest" /> <fieldset><input type="hidden" name="PHPSESSID" value="abtest" /> <form><input type="hidden" name="PHPSESSID" value="abtest" /> <fieldset> <form><input type="hidden" name="PHPSESSID" value="abtest" /> <fieldset> <form> <fieldset><input type="hidden" name="PHPSESSID" value="abtest" /> ---- ACTUAL OUTPUT Warning: session_start() [/phpmanual/function.session-start.html]: open(/tmp\sess_abtest, O_RDWR) failed: No such file or directory (2) in E:\devel\php4\ext\session\tests\021.php on line 6 <form><input type="hidden" name="PHPSESSID" value="abtest" /> <fieldset><input type="hidden" name="PHPSESSID" value="abtest" /> <form><input type="hidden" name="PHPSESSID" value="abtest" /> <fieldset> <form><input type="hidden" name="PHPSESSID" value="abtest" /> <fieldset> <form> <fieldset><input type="hidden" name="PHPSESSID" value="abtest" /> Warning: session_destroy() [/phpmanual/function.session-destroy.html]: Session object destruction failed in E:\devel\php4\ext\session\tests\021.php on line 39 ---- FAILED ================================================================================ 001- <form><input type="hidden" name="PHPSESSID" value="abtest" /> 001+ Warning: session_start() [/phpmanual/function.session-start.html]: open(/tmp\sess_abtest, O_RDWR) failed: No such file or directory (2) in E:\devel\php4\ext\session\tests\021.php on line 6 002- <fieldset><input type="hidden" name="PHPSESSID" value="abtest" /> 002+ <form><input type="hidden" name="PHPSESSID" value="abtest" /> 003- <form><input type="hidden" name="PHPSESSID" value="abtest" /> 003+ <fieldset><input type="hidden" name="PHPSESSID" value="abtest" /> 004- <fieldset> 004+ <form><input type="hidden" name="PHPSESSID" value="abtest" /> 005- <form><input type="hidden" name="PHPSESSID" value="abtest" /> 005+ <fieldset> 006- <fieldset> 006+ <form><input type="hidden" name="PHPSESSID" value="abtest" /> 007- <form> 007+ <fieldset> 008- <fieldset><input type="hidden" name="PHPSESSID" value="abtest" /> 008+ <form> 009+ <fieldset><input type="hidden" name="PHPSESSID" value="abtest" /> 010+ 011+ Warning: session_destroy() [/phpmanual/function.session-destroy.html]: Session object destruction failed in E:\devel\php4\ext\session\tests\021.php on line 39 ================================================================================ ================================================================================ E:\devel\php4\ext\standard\tests\file\001.phpt ================================================================================ ---- EXPECTED OUTPUT test.file does not exist test.file exists test.link exists test.file is not a symlink test.link is a symlink test.file exists test.link lstat and stat differ at element 1 test.link lstat and stat differ at element 2 test.link lstat and stat differ at element 7 test.link lstat and stat differ at element 8 test.link lstat and stat differ at element 9 test.link lstat and stat differ at element 10 test.file is file test.link is link test.file permissions are 0744 test.file size is 0 test.file is writeable test.file is readable test.file is executable test.file is a regular file test.link is a regular file test.link is not a directory ../file is a directory test.file is not a directory test.file does not exist test.file does not exist ---- ACTUAL OUTPUT test.file does not exist test.file exists Fatal error: Call to undefined function: symlink() in E:\devel\php4\ext\standard\tests\file\001.php on line 18 ---- FAILED ================================================================================ 003- test.link exists 003+ 004- test.file is not a symlink 004+ Fatal error: Call to undefined function: symlink() in E:\devel\php4\ext\standard\tests\file\001.php on line 18 005- test.link is a symlink 006- test.file exists 007- test.link lstat and stat differ at element 1 008- test.link lstat and stat differ at element 2 009- test.link lstat and stat differ at element 7 010- test.link lstat and stat differ at element 8 011- test.link lstat and stat differ at element 9 012- test.link lstat and stat differ at element 10 013- test.file is file 014- test.link is link 015- test.file permissions are 0744 016- test.file size is 0 017- test.file is writeable 018- test.file is readable 019- test.file is executable 020- test.file is a regular file 021- test.link is a regular file 022- test.link is not a directory 023- ../file is a directory 024- test.file is not a directory 025- test.file does not exist 026- test.file does not exist ================================================================================ ================================================================================ E:\devel\php4\ext\standard\tests\file\003.phpt ================================================================================ ---- EXPECTED OUTPUT boolean boolean boolean boolean boolean boolean boolean boolean boolean boolean ---- ACTUAL OUTPUT boolean boolean Fatal error: Call to undefined function: is_executable() in E:\devel\php4\ext\standard\tests\file\003.php on line 14 ---- FAILED ================================================================================ 003- boolean 003+ 004- boolean 004+ Fatal error: Call to undefined function: is_executable() in E:\devel\php4\ext\standard\tests\file\003.php on line 14 005- boolean 006- boolean 007- boolean 008- boolean 009- boolean 010- boolean ================================================================================ ================================================================================ E:\devel\php4\ext\standard\tests\file\bug12556.phpt ================================================================================ ---- EXPECTED OUTPUT array(4) { [0]=> string(1) "6" [1]=> string(1) "7" [2]=> string(1) "8" [3]=> string(5) "line1" } array(4) { [0]=> string(1) "1" [1]=> string(1) "2" [2]=> string(1) "3" [3]=> string(186) "line2 2,4,5,line3 2,4,5,line3 2,4,5,line3 2,4,5,line3 2,4,5,line3 2,4,5,line3 2,4,5,line3 2,4,5,line3 2,4,5,line3 2,4,5,line3 2,4,5,line3 2,4,5,line3 2,4,5,line3 2,4,5,line3 2,4,5,line3 " } ---- ACTUAL OUTPUT array(4) { [0]=> string(1) "6" [1]=> string(1) "7" [2]=> string(1) "8" [3]=> string(5) "line1" } array(4) { [0]=> string(1) "1" [1]=> string(1) "2" [2]=> string(1) "3" [3]=> string(202) "line2 2,4,5,line3 2,4,5,line3 2,4,5,line3 2,4,5,line3 2,4,5,line3 2,4,5,line3 2,4,5,line3 2,4,5,line3 2,4,5,line3 2,4,5,line3 2,4,5,line3 2,4,5,line3 2,4,5,line3 2,4,5,line3 2,4,5,line3 " } ---- FAILED ================================================================================ 019- string(186) "line2 019+ string(202) "line2 ================================================================================ ================================================================================ E:\devel\php4\ext\standard\tests\general_functions\006.phpt ================================================================================ ---- EXPECTED OUTPUT úwow-factorÁÐÕÝÅÎÎÙÅ ÔÏÒÇÏ×ÙÅ ÐÒÏÅËÔÙ ---- ACTUAL OUTPUT úwow-factorÁÐÕÝÅÎÎÙÅ ÔÏÒÇÏ×ÙÅ Ð ÒÏÅËÔÙ ---- FAILED ================================================================================ 001- úwow-factorÁÐÕÝÅÎÎÙÅ 001+ úwow-factorÁÐÕÝÅÎÎÙÅ 002- ÔÏÒÇÏ×ÙÅ ÐÒÏÅËÔÙ 002+ 003+ ÔÏÒÇÏ×ÙÅ 004+ 005+ Ð 006+ ÒÏÅËÔÙ ================================================================================ ================================================================================ E:\devel\php4\ext\standard\tests\general_functions\007.phpt ================================================================================ ---- EXPECTED OUTPUT d41d8cd98f00b204e9800998ecf8427e 0cc175b9c0f1b6a831c399e269772661 900150983cd24fb0d6963f7d28e17f72 f96b697d7cb7938d525a2f31aaf161d0 c3fcd3d76192e4007dfb496cca67e13b d174ab98d277d9f5a5611c2c9f419d9f 57edf4a22be3c955ac49da2e2107b67a ---- ACTUAL OUTPUT d41d8cd98f00b204e9800998ecf8427e 0cc175b9c0f1b6a831c399e269772661 900150983cd24fb0d6963f7d28e17f72 f96b697d7cb7938d525a2f31aaf161d0 c3fcd3d76192e4007dfb496cca67e13b d174ab98d277d9f5a5611c2c9f419d9f 57edf4a22be3c955ac49da2e2107b67a ---- FAILED ================================================================================ 001- d41d8cd98f00b204e9800998ecf8427e 001+ d41d8cd98f00b204e9800998ecf8427e 002- 0cc175b9c0f1b6a831c399e269772661 002+ 0cc175b9c0f1b6a831c399e269772661 003- 900150983cd24fb0d6963f7d28e17f72 003+ 900150983cd24fb0d6963f7d28e17f72 004- f96b697d7cb7938d525a2f31aaf161d0 004+ f96b697d7cb7938d525a2f31aaf161d0 005- c3fcd3d76192e4007dfb496cca67e13b 005+ c3fcd3d76192e4007dfb496cca67e13b 006- d174ab98d277d9f5a5611c2c9f419d9f 006+ d174ab98d277d9f5a5611c2c9f419d9f ================================================================================ ================================================================================ E:\devel\php4\ext\standard\tests\general_functions\getopt.phpt ================================================================================ ---- EXPECTED OUTPUT array(5) { ["v"]=> bool(false) ["h"]=> bool(false) ["d"]=> string(4) "test" ["m"]=> string(4) "1234" ["t"]=> bool(false) } ---- ACTUAL OUTPUT Fatal error: Call to undefined function: getopt() in E:\devel\php4\ext\standard\tests\general_functions\getopt.php on line 2 ---- FAILED ================================================================================ 001- array(5) { 001+ Fatal error: Call to undefined function: getopt() in E:\devel\php4\ext\standard\tests\general_functions\getopt.php on line 2 002- ["v"]=> 003- bool(false) 004- ["h"]=> 005- bool(false) 006- ["d"]=> 007- string(4) "test" 008- ["m"]=> 009- string(4) "1234" 010- ["t"]=> 011- bool(false) 012- } ================================================================================ ================================================================================ E:\devel\php4\ext\standard\tests\general_functions\proc_open.phpt ================================================================================ ---- EXPECTED OUTPUT I didn't segfault! ---- ACTUAL OUTPUT ---- FAILED ================================================================================ 001- I didn't segfault! 001+ ================================================================================ ================================================================================ E:\devel\php4\ext\standard\tests\math\pow.phpt ================================================================================ ---- EXPECTED OUTPUT 1,1,0,0 On failure, please mail result to php-dev@lists.php.net OK ---- ACTUAL OUTPUT 1,1,0,0 On failure, please mail result to php-dev@lists.php.net Assert failed: TRUE === is_infinite(pow(0,-2)) Left: bool(true) Right: bool(false) Assert failed: TRUE === is_infinite(pow(0,-1)) Left: bool(true) Right: bool(false) Assert failed: TRUE === is_infinite(pow(0,-2.0)) Left: bool(true) Right: bool(false) Assert failed: TRUE === is_infinite(pow(0,-1.0)) Left: bool(true) Right: bool(false) Assert failed: TRUE === is_infinite(pow(0.0,-2.0)) Left: bool(true) Right: bool(false) Assert failed: TRUE === is_infinite(pow(0.0,-1.0)) Left: bool(true) Right: bool(false) Assert failed: TRUE === is_infinite(pow( 0.0,-2)) Left: bool(true) Right: bool(false) Assert failed: TRUE === is_infinite(pow( 0.0,-1)) Left: bool(true) Right: bool(false) ---- FAILED ================================================================================ 003- OK 003+ 004+ Assert failed: 005+ TRUE === is_infinite(pow(0,-2)) 006+ Left: bool(true) 007+ Right: bool(false) 008+ 009+ Assert failed: 010+ TRUE === is_infinite(pow(0,-1)) 011+ Left: bool(true) 012+ Right: bool(false) 013+ 014+ Assert failed: 015+ TRUE === is_infinite(pow(0,-2.0)) 016+ Left: bool(true) 017+ Right: bool(false) 018+ 019+ Assert failed: 020+ TRUE === is_infinite(pow(0,-1.0)) 021+ Left: bool(true) 022+ Right: bool(false) 023+ 024+ Assert failed: 025+ TRUE === is_infinite(pow(0.0,-2.0)) 026+ Left: bool(true) 027+ Right: bool(false) 028+ 029+ Assert failed: 030+ TRUE === is_infinite(pow(0.0,-1.0)) 031+ Left: bool(true) 032+ Right: bool(false) 033+ 034+ Assert failed: 035+ TRUE === is_infinite(pow( 0.0,-2)) 036+ Left: bool(true) 037+ Right: bool(false) 038+ 039+ Assert failed: 040+ TRUE === is_infinite(pow( 0.0,-1)) 041+ Left: bool(true) 042+ Right: bool(false) ================================================================================ ================================================================================ E:\devel\php4\ext\standard\tests\reg\009.phpt ================================================================================ ---- EXPECTED OUTPUT 4 this is a test ---- ACTUAL OUTPUT 5 this is a test ---- FAILED ================================================================================ 001- 4 001+ 5 005- test 005+ 006+ test ================================================================================ ================================================================================ E:\devel\php4\ext\standard\tests\serialize\003.phpt ================================================================================ ---- EXPECTED OUTPUT d:100; float(100) d:5.2E+25; float(5.2E+25) d:8.529E-22; float(8.529E-22) d:9E-09; float(9.E-9) ---- ACTUAL OUTPUT d:100; float(100) d:5.2E+025; float(5.2E+25) d:8.529E-022; float(8.529E-22) d:9E-009; float(9.E-9) ---- FAILED ================================================================================ 004- d:5.2E+25; 004+ d:5.2E+025; 007- d:8.529E-22; 007+ d:8.529E-022; 010- d:9E-09; 010+ d:9E-009; ================================================================================ ================================================================================ E:\devel\php4\ext\standard\tests\strings\nl2br.phpt ================================================================================ ---- EXPECTED OUTPUT string(4) "test" string(0) "" string(0) "" string(8) "<br /> " string(7) "<br /> " string(7) "<br /> " string(8) "<br /> " string(44) "<br /> <br /> <br /> <br /> <br /> <br /> " string(47) "<br /> <br /> <br /> <br /> <br /> <br /> " string(66) "<br /> <br /> <br /> <br /> <br /> <br /> <br /> <br /> <br /> " ---- ACTUAL OUTPUT string(4) "test" string(0) "" string(0) "" string(8) "<br /> " string(7) "<br /> " string(7) "<br /> " string(8) "<br /> " string(44) "<br /> <br /> <br /> <br /> <br /> <br /> " string(47) "<br /> <br /> <br /> <br /> <br /> <br /> " string(66) "<br /> <br /> <br /> <br /> <br /> <br /> <br /> <br /> <br /> " ---- FAILED ================================================================================ 004- string(8) "<br /> 004+ string(8) "<br /> 012- <br /> 012+ <br /> 018- <br /> 018+ <br /> 019- <br /> 019+ <br /> 026- <br /> <br /> <br /> 026+ <br /> <br /> <br /> ================================================================================ ================================================================================ E:\devel\php4\ext\standard\tests\strings\wordwrap.phpt ================================================================================ ---- EXPECTED OUTPUT OK ---- ACTUAL OUTPUT WARNING: unknown operator in ' ' (1) ---- FAILED ================================================================================ 001- OK 001+ WARNING: unknown operator in ' ' (1) ================================================================================ ================================================================================ E:\devel\php4\ext\standard\tests\time\002.phpt ================================================================================ ---- EXPECTED OUTPUT 1999-10-13 00:00:00 1999-10-13 00:00:00 2000-01-19 00:00:00 2000-01-19 00:00:00 2001-12-21 00:00:00 2001-12-21 00:00:00 2001-12-21 12:16:00 2001-12-21 12:16:00 1969-12-31 23:59:59 2001-10-22 21:19:58 2001-10-22 23:19:58 2001-10-22 23:32:58 2001-10-22 19:19:58 2001-10-22 19:06:58 1999-10-13 00:00:00 1999-10-13 00:00:00 2000-01-19 00:00:00 2000-01-19 00:00:00 2001-12-21 00:00:00 2001-12-21 00:00:00 2001-12-21 12:16:00 2001-12-21 12:16:00 1970-01-01 00:59:59 2001-10-22 21:19:58 2001-10-23 01:19:58 2001-10-23 01:32:58 2001-10-22 21:19:58 2001-10-22 21:06:58 ---- ACTUAL OUTPUT 1999-10-13 00:00:00 1999-10-13 00:00:00 2000-01-19 00:00:00 2000-01-19 00:00:00 2001-12-21 00:00:00 2001-12-21 00:00:00 2001-12-21 12:16:00 2001-12-21 12:16:00 Warning: date() [/phpmanual/function.date.html]: Unexpected error in E:\devel\php4\ext\standard\tests\time\002.php on line 21 2001-10-22 21:19:58 2001-10-22 23:19:58 2001-10-22 23:32:58 2001-10-22 19:19:58 2001-10-22 19:06:58 1999-10-13 00:00:00 1999-10-13 00:00:00 2000-01-19 00:00:00 2000-01-19 00:00:00 2001-12-21 00:00:00 2001-12-21 00:00:00 2001-12-21 12:16:00 2001-12-21 12:16:00 Warning: date() [/phpmanual/function.date.html]: Unexpected error in E:\devel\php4\ext\standard\tests\time\002.php on line 26 2001-10-22 21:19:58 2001-10-23 00:19:58 2001-10-23 00:32:58 2001-10-22 20:19:58 2001-10-22 20:06:58 ---- FAILED ================================================================================ 009- 1969-12-31 23:59:59 009+ 010- 2001-10-22 21:19:58 010+ Warning: date() [/phpmanual/function.date.html]: Unexpected error in E:\devel\php4\ext\standard\tests\time\002.php on line 21 011- 2001-10-22 23:19:58 011+ 2001-10-22 21:19:58 012- 2001-10-22 23:32:58 012+ 2001-10-22 23:19:58 013- 2001-10-22 19:19:58 013+ 2001-10-22 23:32:58 014- 2001-10-22 19:06:58 014+ 2001-10-22 19:19:58 015- 1999-10-13 00:00:00 015+ 2001-10-22 19:06:58 017- 2000-01-19 00:00:00 017+ 1999-10-13 00:00:00 019- 2001-12-21 00:00:00 019+ 2000-01-19 00:00:00 021- 2001-12-21 12:16:00 021+ 2001-12-21 00:00:00 023- 1970-01-01 00:59:59 023+ 2001-12-21 12:16:00 024- 2001-10-22 21:19:58 024+ 025- 2001-10-23 01:19:58 025+ Warning: date() [/phpmanual/function.date.html]: Unexpected error in E:\devel\php4\ext\standard\tests\time\002.php on line 26 026- 2001-10-23 01:32:58 026+ 2001-10-22 21:19:58 027- 2001-10-22 21:19:58 027+ 2001-10-23 00:19:58 028- 2001-10-22 21:06:58 028+ 2001-10-23 00:32:58 029+ 2001-10-22 20:19:58 030+ 2001-10-22 20:06:58 ================================================================================ ================================================================================ E:\devel\php4\ext\standard\tests\time\003.phpt ================================================================================ ---- EXPECTED OUTPUT 2000-02-29 2000-02-28 2000-02-29 2001-02-28 2001-03-01 1999-11-30 2000-05-29 12:00:00 2000-05-29 13:00:00 2000-05-29 12:00:00 2000-01-31 12:00:00 2000-01-31 12:00:00 2000-01-31 11:00:00 2000-04-29 12:00:00 2000-04-29 13:00:00 2000-04-29 12:00:00 ---- ACTUAL OUTPUT 2000-02-29 2000-02-28 2000-02-29 2001-02-28 2001-03-01 1999-11-30 2000-05-29 12:00:00 2000-05-29 12:00:00 2000-05-29 11:00:00 2000-01-31 12:00:00 2000-01-31 12:00:00 2000-01-31 11:00:00 2000-04-29 12:00:00 2000-04-29 12:00:00 2000-04-29 11:00:00 ---- FAILED ================================================================================ 008- 2000-05-29 13:00:00 008+ 2000-05-29 12:00:00 009- 2000-05-29 12:00:00 009+ 2000-05-29 11:00:00 014- 2000-04-29 13:00:00 014+ 2000-04-29 12:00:00 015- 2000-04-29 12:00:00 015+ 2000-04-29 11:00:00 ================================================================================ ================================================================================ E:\devel\php4\tests\lang\bug20993.phpt ================================================================================ ---- EXPECTED OUTPUT 1 -b 1 -r 1 1 -b 1 -r 1 1 -b 1 -r 1 ---- ACTUAL OUTPUT 1 -b 1 -r 1 2 -b 1 -r 2 2 -b 1 -r 2 ---- FAILED ================================================================================ 002- 1 -b 1 -r 1 002+ 2 -b 1 -r 2 003- 1 -b 1 -r 1 003+ 2 -b 1 -r 2 ================================================================================ ================================================================================ BUILD ENVIRONMENT ================================================================================ OS: WINNT Automake: N/A Autoconf: N/A Libtool: N/A Compiler: N/A Bison: User's E-mail: sebastian at nohn dot net ================================================================================ PHPINFO ================================================================================ phpinfo() PHP Version => 4.4.0-dev System => Windows NT localhost 5.0 build 2195 Build Date => Dec 15 2002 16:14:18 Server API => Command Line Interface Virtual Directory Support => enabled Configuration File (php.ini) Path => C:\WINNT\php.ini PHP API => 20020918 PHP Extension => 20020429 Zend Extension => 20021010 Debug Build => no Thread Safety => enabled Registered PHP Streams => php, http, ftp This program makes use of the Zend Scripting Language Engine: Zend Engine v1.4.0, Copyright (c) 1998-2002 Zend Technologies _______________________________________________________________________ Configuration PHP Core Directive => Local Value => Master Value allow_call_time_pass_reference => Off => Off allow_url_fopen => On => On always_populate_raw_post_data => Off => Off arg_separator.input => &amp; => &amp; arg_separator.output => &amp; => &amp; asp_tags => Off => Off auto_append_file => no value => no value auto_prepend_file => no value => no value browscap => no value => no value default_charset => no value => no value default_mimetype => text/html => text/html define_syslog_variables => Off => Off disable_functions => no value => no value display_errors => Off => Off display_startup_errors => Off => Off doc_root => no value => no value docref_ext => no value => no value docref_root => http://www.php.net/ => http://www.php.net/ enable_dl => On => On error_append_string => no value => no value error_log => no value => no value error_prepend_string => no value => no value error_reporting => 2047 => 2047 expose_php => On => On extension_dir => ./ => ./ file_uploads => On => On gpc_order => GPC => GPC highlight.bg => #FFFFFF => #FFFFFF highlight.comment => #FF8000 => #FF8000 highlight.default => #0000BB => #0000BB highlight.html => #000000 => #000000 highlight.keyword => #007700 => #007700 highlight.string => #DD0000 => #DD0000 html_errors => Off => On ignore_repeated_errors => Off => Off ignore_repeated_source => Off => Off ignore_user_abort => Off => Off implicit_flush => On => Off include_path => .;c:\php4\pear => .;c:\php4\pear log_errors => On => On log_errors_max_len => 1024 => 1024 magic_quotes_gpc => Off => Off magic_quotes_runtime => Off => Off magic_quotes_sybase => Off => Off max_execution_time => 0 => 30 max_input_time => 60 => 60 open_basedir => no value => no value output_buffering => 0 => 0 output_handler => no value => no value post_max_size => 8M => 8M precision => 14 => 14 register_argc_argv => On => Off register_globals => Off => Off report_memleaks => On => On report_zend_debug => On => On safe_mode => Off => Off safe_mode_exec_dir => no value => no value safe_mode_gid => Off => Off safe_mode_include_dir => no value => no value sendmail_from => me@localhost.com => me@localhost.com sendmail_path => no value => no value short_open_tag => On => On SMTP => localhost => localhost smtp_port => 25 => 25 sql.safe_mode => Off => Off track_errors => Off => Off unserialize_callback_func => no value => no value upload_max_filesize => 2M => 2M upload_tmp_dir => no value => no value user_dir => no value => no value variables_order => GPCS => GPCS xmlrpc_error_number => 0 => 0 xmlrpc_errors => Off => Off y2k_compliance => On => On bcmath BCMath support => enabled calendar Calendar support => enabled com Directive => Local Value => Master Value com.allow_dcom => Off => Off com.autoregister_casesensitive => On => On com.autoregister_typelib => Off => Off com.autoregister_verbose => Off => Off com.typelib_file => no value => no value ctype ctype functions => enabled ftp FTP support => enabled mysql MySQL Support => enabled Active Persistent Links => 0 Active Links => 0 Client API version => 3.23.49 Directive => Local Value => Master Value mysql.allow_persistent => On => On mysql.connect_timeout => -1 => -1 mysql.default_host => no value => no value mysql.default_password => no value => no value mysql.default_port => no value => no value mysql.default_socket => no value => no value mysql.default_user => no value => no value mysql.max_links => Unlimited => Unlimited mysql.max_persistent => Unlimited => Unlimited mysql.trace_mode => Off => Off odbc ODBC Support => enabled Active Persistent Links => 0 Active Links => 0 ODBC library => Win32 Directive => Local Value => Master Value odbc.allow_persistent => On => On odbc.check_persistent => On => On odbc.default_db => no value => no value odbc.default_pw => <i>no value</i> => <i>no value</i> odbc.default_user => no value => no value odbc.defaultbinmode => return as is => return as is odbc.defaultlrl => return up to 4096 bytes => return up to 4096 bytes odbc.max_links => Unlimited => Unlimited odbc.max_persistent => Unlimited => Unlimited overload User-Space Object Overloading Support => enabled pcre PCRE (Perl Compatible Regular Expressions) Support => enabled PCRE Library Version => 3.92 11-Sep-2002 session Session Support => enabled Registered save handlers => files user Directive => Local Value => Master Value session.auto_start => Off => Off session.bug_compat_42 => Off => Off session.bug_compat_warn => On => On session.cache_expire => 180 => 180 session.cache_limiter => nocache => nocache session.cookie_domain => no value => no value session.cookie_lifetime => 0 => 0 session.cookie_path => / => / session.cookie_secure => Off => Off session.entropy_file => no value => no value session.entropy_length => 0 => 0 session.gc_dividend => 1000 => 1000 session.gc_maxlifetime => 1440 => 1440 session.gc_probability => 1 => 1 session.name => PHPSESSID => PHPSESSID session.referer_check => no value => no value session.save_handler => files => files session.save_path => /tmp => /tmp session.serialize_handler => php => php session.use_cookies => On => On session.use_only_cookies => Off => Off session.use_trans_sid => Off => Off standard Regex Library => Bundled library enabled Dynamic Library Support => enabled Internal Sendmail Support for Windows => enabled Directive => Local Value => Master Value assert.active => 1 => 1 assert.bail => 0 => 0 assert.callback => no value => no value assert.quiet_eval => 0 => 0 assert.warning => 1 => 1 auto_detect_line_endings => 0 => 0 default_socket_timeout => 60 => 60 safe_mode_allowed_env_vars => PHP_ => PHP_ safe_mode_protected_env_vars => LD_LIBRARY_PATH => LD_LIBRARY_PATH url_rewriter.tags => a=href,area=href,frame=src,input=src,form=fakeentry => a=href,area=href,frame=src,input=src,form=fakeentry user_agent => no value => no value tokenizer Tokenizer Support => enabled wddx WDDX Support => enabled xml XML Support => active XML Namespace Support => active EXPAT Version => 1.95.5 Additional Modules Module Name Environment Variable => Value ALLUSERSPROFILE => C:\Dokumente und Einstellungen\All Users APPDATA => C:\Dokumente und Einstellungen\root\Anwendungsdaten CLASSPATH => "d:\JavaSoft\JRE\1.3.1\lib\ext\QTJava.zip" CommonProgramFiles => C:\Programme\Gemeinsame Dateien COMPUTERNAME => SEBASTIAN ComSpec => C:\WINNT\system32\cmd.exe HOMEDRIVE => C: HOMEPATH => \ include => D:\Microsoft Visual Studio\VC98\atl\include;D:\Microsoft Visual Studio\VC98\mfc\include;D:\Microsoft Visual Studio\VC98\include lib => D:\Microsoft Visual Studio\VC98\mfc\lib;D:\Microsoft Visual Studio\VC98\lib LOGONSERVER => \\SEBASTIAN NUMBER_OF_PROCESSORS => 1 OS => Windows_NT Os2LibPath => C:\WINNT\system32\os2\dll; Path => D:\Perl\bin\;C:\WINNT\system32;C:\WINNT;C:\WINNT\System32\Wbem;d:\Network Associates\PGPNT;D:\Microsoft Visual Studio\Common\Tools\WinNT;D:\Microsoft Visual Studio\Common\MSDev98\Bin;D:\Microsoft Visual Studio\Common\Tools;D:\Microsoft Visual Studio\VC98\bin;D:\SSH Communications Security\SSH Secure Shell PATHEXT => .COM;.EXE;.BAT;.CMD;.VBS;.VBE;.JS;.JSE;.WSF;.WSH PATH_TRANSLATED => E:\devel\php4\tests\strings\004.php PROCESSOR_ARCHITECTURE => x86 PROCESSOR_IDENTIFIER => x86 Family 6 Model 8 Stepping 6, GenuineIntel PROCESSOR_LEVEL => 6 PROCESSOR_REVISION => 0806 ProgramFiles => C:\Programme PROMPT => $P$G QTJAVA => "d:\JavaSoft\JRE\1.3.1\lib\ext\QTJava.zip" QUERY_STRING => ab+cd+ef+123+test REDIRECT_STATUS => 1 REQUEST_METHOD => GET SCRIPT_FILENAME => E:\devel\php4\tests\strings\004.php SystemDrive => C: SystemRoot => C:\WINNT TEMP => C:\DOKUME~1\root\LOKALE~1\Temp TEST_PHP_EXECUTABLE => c:\progra~1\apache~1\php\php.exe TMP => C:\DOKUME~1\root\LOKALE~1\Temp USERDOMAIN => SEBASTIAN USERNAME => root USERPROFILE => C:\Dokumente und Einstellungen\root windir => C:\WINNT PHP Variables Variable => Value _SERVER["ALLUSERSPROFILE"] => C:\Dokumente und Einstellungen\All Users _SERVER["APPDATA"] => C:\Dokumente und Einstellungen\root\Anwendungsdaten _SERVER["CLASSPATH"] => "d:\JavaSoft\JRE\1.3.1\lib\ext\QTJava.zip" _SERVER["CommonProgramFiles"] => C:\Programme\Gemeinsame Dateien _SERVER["COMPUTERNAME"] => SEBASTIAN _SERVER["ComSpec"] => C:\WINNT\system32\cmd.exe _SERVER["HOMEDRIVE"] => C: _SERVER["HOMEPATH"] => \ _SERVER["include"] => D:\Microsoft Visual Studio\VC98\atl\include;D:\Microsoft Visual Studio\VC98\mfc\include;D:\Microsoft Visual Studio\VC98\include _SERVER["lib"] => D:\Microsoft Visual Studio\VC98\mfc\lib;D:\Microsoft Visual Studio\VC98\lib _SERVER["LOGONSERVER"] => \\SEBASTIAN _SERVER["NUMBER_OF_PROCESSORS"] => 1 _SERVER["OS"] => Windows_NT _SERVER["Os2LibPath"] => C:\WINNT\system32\os2\dll; _SERVER["Path"] => D:\Perl\bin\;C:\WINNT\system32;C:\WINNT;C:\WINNT\System32\Wbem;d:\Network Associates\PGPNT;D:\Microsoft Visual Studio\Common\Tools\WinNT;D:\Microsoft Visual Studio\Common\MSDev98\Bin;D:\Microsoft Visual Studio\Common\Tools;D:\Microsoft Visual Studio\VC98\bin;D:\SSH Communications Security\SSH Secure Shell _SERVER["PATHEXT"] => .COM;.EXE;.BAT;.CMD;.VBS;.VBE;.JS;.JSE;.WSF;.WSH _SERVER["PATH_TRANSLATED"] => _SERVER["PROCESSOR_ARCHITECTURE"] => x86 _SERVER["PROCESSOR_IDENTIFIER"] => x86 Family 6 Model 8 Stepping 6, GenuineIntel _SERVER["PROCESSOR_LEVEL"] => 6 _SERVER["PROCESSOR_REVISION"] => 0806 _SERVER["ProgramFiles"] => C:\Programme _SERVER["PROMPT"] => $P$G _SERVER["QTJAVA"] => "d:\JavaSoft\JRE\1.3.1\lib\ext\QTJava.zip" _SERVER["QUERY_STRING"] => ab+cd+ef+123+test _SERVER["REDIRECT_STATUS"] => 1 _SERVER["REQUEST_METHOD"] => GET _SERVER["SCRIPT_FILENAME"] => _SERVER["SystemDrive"] => C: _SERVER["SystemRoot"] => C:\WINNT _SERVER["TEMP"] => C:\DOKUME~1\root\LOKALE~1\Temp _SERVER["TEST_PHP_EXECUTABLE"] => c:\progra~1\apache~1\php\php.exe _SERVER["TMP"] => C:\DOKUME~1\root\LOKALE~1\Temp _SERVER["USERDOMAIN"] => SEBASTIAN _SERVER["USERNAME"] => root _SERVER["USERPROFILE"] => C:\Dokumente und Einstellungen\root _SERVER["windir"] => C:\WINNT _SERVER["PHP_SELF"] => _SERVER["SCRIPT_NAME"] => _SERVER["DOCUMENT_ROOT"] => _SERVER["argv"] => Array ( ) _SERVER["argc"] => 0 PHP License This program is free software; you can redistribute it and/or modify it under the terms of the PHP License as published by the PHP Group and included in the distribution in the file: LICENSE This program is distributed in the hope that it will be useful, but WITHOUT ANY WARRANTY; without even the implied warranty of MERCHANTABILITY or FITNESS FOR A PARTICULAR PURPOSE. If you did not receive a copy of the PHP license, or have any questions about PHP licensing, please contact license@php.net.

« previous php.qa (#7280) next »