Test results [unknown]

From: Date: Wed, 18 Dec 2002 23:15:14 +0000
Subject: Test results [unknown]
Groups: php.qa 
Request: Send a blank email to php-qa+get-7345@lists.php.net to get a copy of this message
===================================================================== FAILED TEST SUMMARY --------------------------------------------------------------------- Locale settings affecting float parsing [tests/lang/034.phpt] jpeg <--> png conversion test [ext/gd/tests/jpeg2png.phpt] File type functions [ext/standard/tests/file/001.phpt] getopt [ext/standard/tests/general_functions/getopt.phpt] ===================================================================== ================================================================================ /usr/local/src/php-4.3.0RC3/tests/lang/034.phpt ================================================================================ ---- EXPECTED OUTPUT 3,14 ---- ACTUAL OUTPUT 3.14 ---- FAILED ================================================================================ 001- 3,14 001+ 3.14 ================================================================================ ================================================================================ /usr/local/src/php-4.3.0RC3/ext/gd/tests/jpeg2png.phpt ================================================================================ ---- EXPECTED OUTPUT PNG to JPEG conversion: ok Generated JPEG to PNG conversion: ok JPEG to PNG conversion: ok Generated PNG to JPEG conversion: ok ---- ACTUAL OUTPUT PNG to JPEG conversion: Fatal error: Call to undefined function: imagejpeg() in /usr/local/src/php-4.3.0RC3/ext/gd/tests/jpeg2png.php on line 5 ---- FAILED ================================================================================ 001- PNG to JPEG conversion: ok 001+ PNG to JPEG conversion: 002- Generated JPEG to PNG conversion: ok 002+ Fatal error: Call to undefined function: imagejpeg() in /usr/local/src/php-4.3.0RC3/ext/gd/tests/jpeg2png.php on line 5 003- JPEG to PNG conversion: ok 004- Generated PNG to JPEG conversion: ok ================================================================================ ================================================================================ /usr/local/src/php-4.3.0RC3/ext/standard/tests/file/001.phpt ================================================================================ ---- EXPECTED OUTPUT test.file does not exist test.file exists test.link exists test.file is not a symlink test.link is a symlink test.file exists test.link lstat and stat differ at element 1 test.link lstat and stat differ at element 2 test.link lstat and stat differ at element 7 test.link lstat and stat differ at element 8 test.link lstat and stat differ at element 9 test.link lstat and stat differ at element 10 test.file is file test.link is link test.file permissions are 0744 test.file size is 0 test.file is writeable test.file is readable test.file is executable test.file is a regular file test.link is a regular file test.link is not a directory ../file is a directory test.file is not a directory test.file does not exist test.file does not exist ---- ACTUAL OUTPUT test.file does not exist test.file exists test.link exists test.file is not a symlink test.link is a symlink test.file exists test.link lstat and stat differ at element 1 test.link lstat and stat differ at element 2 test.link lstat and stat differ at element 4 test.link lstat and stat differ at element 7 test.link lstat and stat differ at element 8 test.link lstat and stat differ at element 9 test.link lstat and stat differ at element 10 test.file is file test.link is link test.file permissions are 0744 test.file size is 0 test.file is writeable test.file is readable test.file is executable test.file is a regular file test.link is a regular file test.link is not a directory ../file is a directory test.file is not a directory test.file does not exist test.file does not exist ---- FAILED ================================================================================ 009- test.link lstat and stat differ at element 7 009+ test.link lstat and stat differ at element 4 010- test.link lstat and stat differ at element 8 010+ test.link lstat and stat differ at element 7 011- test.link lstat and stat differ at element 9 011+ test.link lstat and stat differ at element 8 012- test.link lstat and stat differ at element 10 012+ test.link lstat and stat differ at element 9 013- test.file is file 013+ test.link lstat and stat differ at element 10 014- test.link is link 014+ test.file is file 015- test.file permissions are 0744 015+ test.link is link 016- test.file size is 0 016+ test.file permissions are 0744 017- test.file is writeable 017+ test.file size is 0 018- test.file is readable 018+ test.file is writeable 019- test.file is executable 019+ test.file is readable 020- test.file is a regular file 020+ test.file is executable 021- test.link is a regular file 021+ test.file is a regular file 022- test.link is not a directory 022+ test.link is a regular file 023- ../file is a directory 023+ test.link is not a directory 024- test.file is not a directory 024+ ../file is a directory 025- test.file does not exist 025+ test.file is not a directory 027+ test.file does not exist ================================================================================ ================================================================================ /usr/local/src/php-4.3.0RC3/ext/standard/tests/general_functions/getopt.phpt ================================================================================ ---- EXPECTED OUTPUT array(5) { ["v"]=> bool(false) ["h"]=> bool(false) ["d"]=> string(4) "test" ["m"]=> string(4) "1234" ["t"]=> bool(false) } ---- ACTUAL OUTPUT array(0) { } ---- FAILED ================================================================================ 001- array(5) { 001+ array(0) { 002- ["v"]=> 002+ } 003- bool(false) 004- ["h"]=> 005- bool(false) 006- ["d"]=> 007- string(4) "test" 008- ["m"]=> 009- string(4) "1234" 010- ["t"]=> 011- bool(false) 012- } ================================================================================ ================================================================================ BUILD ENVIRONMENT ================================================================================ OS: Darwin Automake: automake (GNU automake) 1.6.1 Written by Tom Tromey <tromey@redhat.com>. Copyright 2002 Free Software Foundation, Inc. This is free software; see the source for copying conditions. There is NO warranty; not even for MERCHANTABILITY or FITNESS FOR A PARTICULAR PURPOSE. Autoconf: autoconf (GNU Autoconf) 2.52 Written by David J. MacKenzie. Copyright 1992, 1993, 1994, 1996, 1999, 2000, 2001 Free Software Foundation, Inc. This is free software; see the source for copying conditions. There is NO warranty; not even for MERCHANTABILITY or FITNESS FOR A PARTICULAR PURPOSE. Libtool: Compiler: Reading specs from /usr/libexec/gcc/darwin/ppc/3.1/specs Thread model: posix Apple Computer, Inc. GCC version 1151, based on gcc version 3.1 20020420 (prerelease) Bison: GNU Bison version 1.28 User's E-mail: philipp dot suter at usa dot net ================================================================================ PHPINFO ================================================================================ phpinfo() PHP Version => 4.3.0RC3 System => Darwin artbase.local. 6.2 Darwin Kernel Version 6.2: Tue Nov 5 22:00:03 PST 2002; root:xnu/xnu-344.12.2.obj~1/RELEASE_PPC Power Macintosh Build Date => Dec 19 2002 00:02:10 Configure Command => './configure' '--prefix=/usr' '--sysconfdir=/etc' '--localstatedir=/var' '--mandir=/usr/share/man' '--with-xml' '--with-mysql' '--with-apxs' '--with-gd' '--with-zlib-dir=/usr' Server API => Command Line Interface Virtual Directory Support => disabled Configuration File (php.ini) Path => /usr/lib PHP API => 20020918 PHP Extension => 20020429 Zend Extension => 20021010 Debug Build => no Thread Safety => disabled Registered PHP Streams => php, http, ftp, compress.zlib This program makes use of the Zend Scripting Language Engine: Zend Engine v1.3.0, Copyright (c) 1998-2002 Zend Technologies _______________________________________________________________________ Configuration PHP Core Directive => Local Value => Master Value allow_call_time_pass_reference => On => On allow_url_fopen => On => On always_populate_raw_post_data => Off => Off arg_separator.input => &amp; => &amp; arg_separator.output => &amp; => &amp; asp_tags => Off => Off auto_append_file => no value => no value auto_prepend_file => no value => no value browscap => no value => no value default_charset => no value => no value default_mimetype => text/html => text/html define_syslog_variables => Off => Off disable_functions => no value => no value display_errors => On => On display_startup_errors => Off => Off doc_root => no value => no value docref_ext => no value => no value docref_root => http://www.php.net/ => http://www.php.net/ enable_dl => On => On error_append_string => no value => no value error_log => no value => no value error_prepend_string => no value => no value error_reporting => no value => no value expose_php => On => On extension_dir => /usr/lib/php/extensions/no-debug-non-zts-20020429 => /usr/lib/php/extensions/no-debug-non-zts-20020429 file_uploads => On => On gpc_order => GPC => GPC highlight.bg => #FFFFFF => #FFFFFF highlight.comment => #FF8000 => #FF8000 highlight.default => #0000BB => #0000BB highlight.html => #000000 => #000000 highlight.keyword => #007700 => #007700 highlight.string => #DD0000 => #DD0000 html_errors => Off => On ignore_repeated_errors => Off => Off ignore_repeated_source => Off => Off ignore_user_abort => Off => Off implicit_flush => On => Off include_path => .:/usr/lib/php => .:/usr/lib/php log_errors => Off => Off log_errors_max_len => 1024 => 1024 magic_quotes_gpc => On => On magic_quotes_runtime => Off => Off magic_quotes_sybase => Off => Off max_execution_time => 0 => 30 max_input_time => -1 => -1 open_basedir => no value => no value output_buffering => 0 => 0 output_handler => no value => no value post_max_size => 8M => 8M precision => 14 => 14 register_argc_argv => On => On register_globals => Off => Off report_memleaks => On => On safe_mode => Off => Off safe_mode_exec_dir => 1 => 1 safe_mode_gid => Off => Off safe_mode_include_dir => no value => no value sendmail_from => no value => no value sendmail_path => /usr/sbin/sendmail -t -i => /usr/sbin/sendmail -t -i short_open_tag => On => On SMTP => localhost => localhost smtp_port => 25 => 25 sql.safe_mode => Off => Off track_errors => Off => Off unserialize_callback_func => no value => no value upload_max_filesize => 2M => 2M upload_tmp_dir => no value => no value user_dir => no value => no value variables_order => no value => no value xmlrpc_error_number => 0 => 0 xmlrpc_errors => Off => Off y2k_compliance => On => On ctype ctype functions => enabled gd GD Support => enabled GD Version => bundled (2.0 compatible) GIF Read Support => enabled PNG Support => enabled WBMP Support => enabled mysql MySQL Support => enabled Active Persistent Links => 0 Active Links => 0 Client API version => 3.23.49 MYSQL_MODULE_TYPE => builtin MYSQL_SOCKET => /tmp/mysql.sock MYSQL_INCLUDE => MYSQL_LIBS => Directive => Local Value => Master Value mysql.allow_persistent => On => On mysql.connect_timeout => -1 => -1 mysql.default_host => no value => no value mysql.default_password => no value => no value mysql.default_port => no value => no value mysql.default_socket => no value => no value mysql.default_user => no value => no value mysql.max_links => Unlimited => Unlimited mysql.max_persistent => Unlimited => Unlimited mysql.trace_mode => Off => Off overload User-Space Object Overloading Support => enabled pcre PCRE (Perl Compatible Regular Expressions) Support => enabled PCRE Library Version => 3.92 11-Sep-2002 posix Revision => $Revision: 1.51 $ session Session Support => enabled Registered save handlers => files user Directive => Local Value => Master Value session.auto_start => Off => Off session.bug_compat_42 => On => On session.bug_compat_warn => On => On session.cache_expire => 180 => 180 session.cache_limiter => nocache => nocache session.cookie_domain => no value => no value session.cookie_lifetime => 0 => 0 session.cookie_path => / => / session.cookie_secure => Off => Off session.entropy_file => no value => no value session.entropy_length => 0 => 0 session.gc_dividend => 100 => 100 session.gc_maxlifetime => 1440 => 1440 session.gc_probability => 1 => 1 session.name => PHPSESSID => PHPSESSID session.referer_check => no value => no value session.save_handler => files => files session.save_path => /tmp => /tmp session.serialize_handler => php => php session.use_cookies => On => On session.use_only_cookies => Off => Off session.use_trans_sid => Off => Off standard Regex Library => Bundled library enabled Dynamic Library Support => enabled Path to sendmail => /usr/sbin/sendmail -t -i Directive => Local Value => Master Value assert.active => 1 => 1 assert.bail => 0 => 0 assert.callback => no value => no value assert.quiet_eval => 0 => 0 assert.warning => 1 => 1 auto_detect_line_endings => 0 => 0 default_socket_timeout => 60 => 60 safe_mode_allowed_env_vars => PHP_ => PHP_ safe_mode_protected_env_vars => LD_LIBRARY_PATH => LD_LIBRARY_PATH url_rewriter.tags => a=href,area=href,frame=src,form=,fieldset= => a=href,area=href,frame=src,form=,fieldset= user_agent => no value => no value tokenizer Tokenizer Support => enabled xml XML Support => active XML Namespace Support => active EXPAT Version => 1.95.2 zlib ZLib Support => enabled Compiled Version => 1.1.3 Linked Version => 1.1.3 Directive => Local Value => Master Value zlib.output_compression => Off => Off zlib.output_compression_level => -1 => -1 zlib.output_handler => no value => no value Additional Modules Module Name Environment Variable => Value PWD => /usr/local/src/php-4.3.0RC3 MAKEFLAGS => VENDOR => apple MFLAGS => REDIRECT_STATUS => TEST_PHP_EXECUTABLE => /usr/local/src/php-4.3.0RC3/sapi/cli/php TERM_PROGRAM => Apple_Terminal CC => gcc SUDO_GID => 20 USER => root MACHTYPE => powerpc SCRIPT_FILENAME => LC_ALL => C PATH_TRANSLATED => SUDO_UID => 501 LANG => en_US QUERY_STRING => CONTENT_LENGTH => HOST => artbase.local. MAKELEVEL => 1 SHLVL => 3 LOGNAME => root GROUP => staff _ => /usr/local/src/php-4.3.0RC3/sapi/cli/php SUDO_COMMAND => /usr/bin/make test REQUEST_METHOD => SHELL => /bin/sh HOSTTYPE => macintosh TEST_PHP_SRCDIR => /usr/local/src/php-4.3.0RC3 OSTYPE => darwin TERM => vt100 HOME => /Users/philipp TERM_PROGRAM_VERSION => 81 PATH => /bin:/sbin:/usr/bin:/usr/sbin __CF_USER_TEXT_ENCODING => 0x1F5:0:0 SUDO_USER => philipp CONTENT_TYPE => PHP Variables Variable => Value _SERVER["PWD"] => /usr/local/src/php-4.3.0RC3 _SERVER["MAKEFLAGS"] => _SERVER["VENDOR"] => apple _SERVER["MFLAGS"] => _SERVER["REDIRECT_STATUS"] => _SERVER["TEST_PHP_EXECUTABLE"] => /usr/local/src/php-4.3.0RC3/sapi/cli/php _SERVER["TERM_PROGRAM"] => Apple_Terminal _SERVER["CC"] => gcc _SERVER["SUDO_GID"] => 20 _SERVER["USER"] => root _SERVER["MACHTYPE"] => powerpc _SERVER["SCRIPT_FILENAME"] => _SERVER["LC_ALL"] => C _SERVER["PATH_TRANSLATED"] => _SERVER["SUDO_UID"] => 501 _SERVER["LANG"] => en_US _SERVER["QUERY_STRING"] => _SERVER["CONTENT_LENGTH"] => _SERVER["HOST"] => artbase.local. _SERVER["MAKELEVEL"] => 1 _SERVER["SHLVL"] => 3 _SERVER["LOGNAME"] => root _SERVER["GROUP"] => staff _SERVER["_"] => /usr/local/src/php-4.3.0RC3/sapi/cli/php _SERVER["SUDO_COMMAND"] => /usr/bin/make test _SERVER["REQUEST_METHOD"] => _SERVER["SHELL"] => /bin/sh _SERVER["HOSTTYPE"] => macintosh _SERVER["TEST_PHP_SRCDIR"] => /usr/local/src/php-4.3.0RC3 _SERVER["OSTYPE"] => darwin _SERVER["TERM"] => vt100 _SERVER["HOME"] => /Users/philipp _SERVER["TERM_PROGRAM_VERSION"] => 81 _SERVER["PATH"] => /bin:/sbin:/usr/bin:/usr/sbin _SERVER["__CF_USER_TEXT_ENCODING"] => 0x1F5:0:0 _SERVER["SUDO_USER"] => philipp _SERVER["CONTENT_TYPE"] => _SERVER["PHP_SELF"] => _SERVER["SCRIPT_NAME"] => _SERVER["DOCUMENT_ROOT"] => _SERVER["argv"] => Array ( ) _SERVER["argc"] => 0 _ENV["PWD"] => /usr/local/src/php-4.3.0RC3 _ENV["MAKEFLAGS"] => _ENV["VENDOR"] => apple _ENV["MFLAGS"] => _ENV["REDIRECT_STATUS"] => _ENV["TEST_PHP_EXECUTABLE"] => /usr/local/src/php-4.3.0RC3/sapi/cli/php _ENV["TERM_PROGRAM"] => Apple_Terminal _ENV["CC"] => gcc _ENV["SUDO_GID"] => 20 _ENV["USER"] => root _ENV["MACHTYPE"] => powerpc _ENV["SCRIPT_FILENAME"] => _ENV["LC_ALL"] => C _ENV["PATH_TRANSLATED"] => _ENV["SUDO_UID"] => 501 _ENV["LANG"] => en_US _ENV["QUERY_STRING"] => _ENV["CONTENT_LENGTH"] => _ENV["HOST"] => artbase.local. _ENV["MAKELEVEL"] => 1 _ENV["SHLVL"] => 3 _ENV["LOGNAME"] => root _ENV["GROUP"] => staff _ENV["_"] => /usr/local/src/php-4.3.0RC3/sapi/cli/php _ENV["SUDO_COMMAND"] => /usr/bin/make test _ENV["REQUEST_METHOD"] => _ENV["SHELL"] => /bin/sh _ENV["HOSTTYPE"] => macintosh _ENV["TEST_PHP_SRCDIR"] => /usr/local/src/php-4.3.0RC3 _ENV["OSTYPE"] => darwin _ENV["TERM"] => vt100 _ENV["HOME"] => /Users/philipp _ENV["TERM_PROGRAM_VERSION"] => 81 _ENV["PATH"] => /bin:/sbin:/usr/bin:/usr/sbin _ENV["__CF_USER_TEXT_ENCODING"] => 0x1F5:0:0 _ENV["SUDO_USER"] => philipp _ENV["CONTENT_TYPE"] => PHP License This program is free software; you can redistribute it and/or modify it under the terms of the PHP License as published by the PHP Group and included in the distribution in the file: LICENSE This program is distributed in the hope that it will be useful, but WITHOUT ANY WARRANTY; without even the implied warranty of MERCHANTABILITY or FITNESS FOR A PARTICULAR PURPOSE. If you did not receive a copy of the PHP license, or have any questions about PHP licensing, please contact license@php.net.

« previous php.qa (#7345) next »