Test results [failed]
| From: | noreply@php.net | Date: | Thu, 19 Dec 2002 16:22:58 +0000 |
| Subject: | Test results [failed] | ||
| Groups: | php.qa | ||
| Request: | Send a blank email to php-qa+get-7351@lists.php.net to get a copy of this message | ||
=====================================================================
FAILED TEST SUMMARY
---------------------------------------------------------------------
jdtojewish() function [E:\devel\php4\ext\calendar\tests\jdtojewish.phpt]
File type functions [E:\devel\php4\ext\standard\tests\file\001.phpt]
is_*() and file_exists() return values are boolean. [E:\devel\php4\ext\standard\tests\file\003.phpt]
quoted_printable_decode() function test with CR/LF
[E:\devel\php4\ext\standard\tests\general_functions\006.phpt]
MD5 / Base64 [E:\devel\php4\ext\standard\tests\general_functions\007.phpt]
getopt [E:\devel\php4\ext\standard\tests\general_functions\getopt.phpt]
proc_open [E:\devel\php4\ext\standard\tests\general_functions\proc_open.phpt]
Various pow() tests [E:\devel\php4\ext\standard\tests\math\pow.phpt]
Test split() [E:\devel\php4\ext\standard\tests\reg\009.phpt]
unserialize() floats with E notation (#18654) [E:\devel\php4\ext\standard\tests\serialize\003.phpt]
nl2br() function [E:\devel\php4\ext\standard\tests\strings\nl2br.phpt]
wordwrap() function [E:\devel\php4\ext\standard\tests\strings\wordwrap.phpt]
microtime() function [E:\devel\php4\ext\standard\tests\time\001.phpt]
strtotime() function [E:\devel\php4\ext\standard\tests\time\002.phpt]
Check for mktime with out-of-range parameters [E:\devel\php4\ext\standard\tests\time\003.phpt]
Bug #20993 (referenced array key, makes array global) [E:\devel\php4\tests\lang\bug20993.phpt]
=====================================================================
=====================================================================
TEST RESULT SUMMARY
---------------------------------------------------------------------
Exts skipped : 75
Exts tested : 14
---------------------------------------------------------------------
Number of tests : 452
Tests skipped : 228 (50.4%)
Tests failed : 16 ( 3.5%)
Tests passed : 208 (46.0%)
---------------------------------------------------------------------
Time taken : 154 seconds
=====================================================================
================================================================================
E:\devel\php4\ext\calendar\tests\jdtojewish.phpt
================================================================================
---- EXPECTED OUTPUT
string(184) "2/22/5763
ëá çùåï äúùñâ
ëá çùåï ä'úùñâ
ëá çùåï ä àìôéí úùñâ
ëá çùåï ä' àìôéí úùñâ
ë"á çùåï äúùñ"â
á' çùåï äúùñ"â
á' çùåï ä'úùñ"â
á' çùåï ä àìôéí úùñ"â
á' çùåï ä' àìôéí úùñ"â
"
---- ACTUAL OUTPUT
Notice: Use of undefined constant CAL_JEWISH_ADD_ALAFIM_GERESH - assumed
'CAL_JEWISH_ADD_ALAFIM_GERESH' in E:\devel\php4\ext\calendar\tests\jdtojewish.php on line
5
Warning: Wrong parameter count for jdtojewish() in E:\devel\php4\ext\calendar\tests\jdtojewish.php
on line 5
Notice: Use of undefined constant CAL_JEWISH_ADD_ALAFIM - assumed 'CAL_JEWISH_ADD_ALAFIM'
in E:\devel\php4\ext\calendar\tests\jdtojewish.php on line 6
Warning: Wrong parameter count for jdtojewish() in E:\devel\php4\ext\calendar\tests\jdtojewish.php
on line 6
Notice: Use of undefined constant CAL_JEWISH_ADD_ALAFIM_GERESH - assumed
'CAL_JEWISH_ADD_ALAFIM_GERESH' in E:\devel\php4\ext\calendar\tests\jdtojewish.php on line
7
Notice: Use of undefined constant CAL_JEWISH_ADD_ALAFIM - assumed 'CAL_JEWISH_ADD_ALAFIM'
in E:\devel\php4\ext\calendar\tests\jdtojewish.php on line 7
Warning: Wrong parameter count for jdtojewish() in E:\devel\php4\ext\calendar\tests\jdtojewish.php
on line 7
Notice: Use of undefined constant CAL_JEWISH_ADD_GERESHAYIM - assumed
'CAL_JEWISH_ADD_GERESHAYIM' in E:\devel\php4\ext\calendar\tests\jdtojewish.php on line 8
Warning: Wrong parameter count for jdtojewish() in E:\devel\php4\ext\calendar\tests\jdtojewish.php
on line 8
Notice: Use of undefined constant CAL_JEWISH_ADD_GERESHAYIM - assumed
'CAL_JEWISH_ADD_GERESHAYIM' in E:\devel\php4\ext\calendar\tests\jdtojewish.php on line 9
Warning: Wrong parameter count for jdtojewish() in E:\devel\php4\ext\calendar\tests\jdtojewish.php
on line 9
Notice: Use of undefined constant CAL_JEWISH_ADD_GERESHAYIM - assumed
'CAL_JEWISH_ADD_GERESHAYIM' in E:\devel\php4\ext\calendar\tests\jdtojewish.php on line 10
Notice: Use of undefined constant CAL_JEWISH_ADD_ALAFIM_GERESH - assumed
'CAL_JEWISH_ADD_ALAFIM_GERESH' in E:\devel\php4\ext\calendar\tests\jdtojewish.php on line
10
Warning: Wrong parameter count for jdtojewish() in E:\devel\php4\ext\calendar\tests\jdtojewish.php
on line 10
Notice: Use of undefined constant CAL_JEWISH_ADD_GERESHAYIM - assumed
'CAL_JEWISH_ADD_GERESHAYIM' in E:\devel\php4\ext\calendar\tests\jdtojewish.php on line 11
Notice: Use of undefined constant CAL_JEWISH_ADD_ALAFIM - assumed 'CAL_JEWISH_ADD_ALAFIM'
in E:\devel\php4\ext\calendar\tests\jdtojewish.php on line 11
Warning: Wrong parameter count for jdtojewish() in E:\devel\php4\ext\calendar\tests\jdtojewish.php
on line 11
Notice: Use of undefined constant CAL_JEWISH_ADD_GERESHAYIM - assumed
'CAL_JEWISH_ADD_GERESHAYIM' in E:\devel\php4\ext\calendar\tests\jdtojewish.php on line 12
Notice: Use of undefined constant CAL_JEWISH_ADD_ALAFIM - assumed 'CAL_JEWISH_ADD_ALAFIM'
in E:\devel\php4\ext\calendar\tests\jdtojewish.php on line 12
Notice: Use of undefined constant CAL_JEWISH_ADD_ALAFIM_GERESH - assumed
'CAL_JEWISH_ADD_ALAFIM_GERESH' in E:\devel\php4\ext\calendar\tests\jdtojewish.php on line
12
Warning: Wrong parameter count for jdtojewish() in E:\devel\php4\ext\calendar\tests\jdtojewish.php
on line 12
string(42) "2/22/5763
ëá çùåï äúùñâ
"
---- FAILED
================================================================================
001- string(184) "2/22/5763
001+ Notice: Use of undefined constant CAL_JEWISH_ADD_ALAFIM_GERESH - assumed
'CAL_JEWISH_ADD_ALAFIM_GERESH' in E:\devel\php4\ext\calendar\tests\jdtojewish.php on line
5
002- ëá çùåï äúùñâ
002+
003- ëá çùåï ä'úùñâ
003+ Warning: Wrong parameter count for jdtojewish() in
E:\devel\php4\ext\calendar\tests\jdtojewish.php on line 5
004- ëá çùåï ä àìôéí úùñâ
004+
005- ëá çùåï ä' àìôéí úùñâ
005+ Notice: Use of undefined constant CAL_JEWISH_ADD_ALAFIM - assumed
'CAL_JEWISH_ADD_ALAFIM' in E:\devel\php4\ext\calendar\tests\jdtojewish.php on line 6
006- ë"á çùåï äúùñ"â
006+
007- á' çùåï äúùñ"â
007+ Warning: Wrong parameter count for jdtojewish() in
E:\devel\php4\ext\calendar\tests\jdtojewish.php on line 6
008- á' çùåï ä'úùñ"â
008+
009- á' çùåï ä àìôéí úùñ"â
009+ Notice: Use of undefined constant CAL_JEWISH_ADD_ALAFIM_GERESH - assumed
'CAL_JEWISH_ADD_ALAFIM_GERESH' in E:\devel\php4\ext\calendar\tests\jdtojewish.php on line
7
010- á' çùåï ä' àìôéí úùñ"â
010+
011- "
011+ Notice: Use of undefined constant CAL_JEWISH_ADD_ALAFIM - assumed
'CAL_JEWISH_ADD_ALAFIM' in E:\devel\php4\ext\calendar\tests\jdtojewish.php on line 7
012+
013+ Warning: Wrong parameter count for jdtojewish() in
E:\devel\php4\ext\calendar\tests\jdtojewish.php on line 7
014+
015+ Notice: Use of undefined constant CAL_JEWISH_ADD_GERESHAYIM - assumed
'CAL_JEWISH_ADD_GERESHAYIM' in E:\devel\php4\ext\calendar\tests\jdtojewish.php on line 8
016+
017+ Warning: Wrong parameter count for jdtojewish() in
E:\devel\php4\ext\calendar\tests\jdtojewish.php on line 8
018+
019+ Notice: Use of undefined constant CAL_JEWISH_ADD_GERESHAYIM - assumed
'CAL_JEWISH_ADD_GERESHAYIM' in E:\devel\php4\ext\calendar\tests\jdtojewish.php on line 9
020+
021+ Warning: Wrong parameter count for jdtojewish() in
E:\devel\php4\ext\calendar\tests\jdtojewish.php on line 9
022+
023+ Notice: Use of undefined constant CAL_JEWISH_ADD_GERESHAYIM - assumed
'CAL_JEWISH_ADD_GERESHAYIM' in E:\devel\php4\ext\calendar\tests\jdtojewish.php on line 10
024+
025+ Notice: Use of undefined constant CAL_JEWISH_ADD_ALAFIM_GERESH - assumed
'CAL_JEWISH_ADD_ALAFIM_GERESH' in E:\devel\php4\ext\calendar\tests\jdtojewish.php on line
10
026+
027+ Warning: Wrong parameter count for jdtojewish() in
E:\devel\php4\ext\calendar\tests\jdtojewish.php on line 10
028+
029+ Notice: Use of undefined constant CAL_JEWISH_ADD_GERESHAYIM - assumed
'CAL_JEWISH_ADD_GERESHAYIM' in E:\devel\php4\ext\calendar\tests\jdtojewish.php on line 11
030+
031+ Notice: Use of undefined constant CAL_JEWISH_ADD_ALAFIM - assumed
'CAL_JEWISH_ADD_ALAFIM' in E:\devel\php4\ext\calendar\tests\jdtojewish.php on line 11
032+
033+ Warning: Wrong parameter count for jdtojewish() in
E:\devel\php4\ext\calendar\tests\jdtojewish.php on line 11
034+
035+ Notice: Use of undefined constant CAL_JEWISH_ADD_GERESHAYIM - assumed
'CAL_JEWISH_ADD_GERESHAYIM' in E:\devel\php4\ext\calendar\tests\jdtojewish.php on line 12
036+
037+ Notice: Use of undefined constant CAL_JEWISH_ADD_ALAFIM - assumed
'CAL_JEWISH_ADD_ALAFIM' in E:\devel\php4\ext\calendar\tests\jdtojewish.php on line 12
038+
039+ Notice: Use of undefined constant CAL_JEWISH_ADD_ALAFIM_GERESH - assumed
'CAL_JEWISH_ADD_ALAFIM_GERESH' in E:\devel\php4\ext\calendar\tests\jdtojewish.php on line
12
040+
041+ Warning: Wrong parameter count for jdtojewish() in
E:\devel\php4\ext\calendar\tests\jdtojewish.php on line 12
042+ string(42) "2/22/5763
043+ ëá çùåï äúùñâ
044+
045+
046+
047+
048+
049+
050+
051+
052+ "
================================================================================
================================================================================
E:\devel\php4\ext\standard\tests\file\001.phpt
================================================================================
---- EXPECTED OUTPUT
test.file does not exist
test.file exists
test.link exists
test.file is not a symlink
test.link is a symlink
test.file exists
test.link lstat and stat differ at element 1
test.link lstat and stat differ at element 2
test.link lstat and stat differ at element 7
test.link lstat and stat differ at element 8
test.link lstat and stat differ at element 9
test.link lstat and stat differ at element 10
test.file is file
test.link is link
test.file permissions are 0744
test.file size is 0
test.file is writeable
test.file is readable
test.file is executable
test.file is a regular file
test.link is a regular file
test.link is not a directory
../file is a directory
test.file is not a directory
test.file does not exist
test.file does not exist
---- ACTUAL OUTPUT
test.file does not exist
test.file exists
Fatal error: Call to undefined function: symlink() in E:\devel\php4\ext\standard\tests\file\001.php
on line 18
---- FAILED
================================================================================
003- test.link exists
003+
004- test.file is not a symlink
004+ Fatal error: Call to undefined function: symlink() in
E:\devel\php4\ext\standard\tests\file\001.php on line 18
005- test.link is a symlink
006- test.file exists
007- test.link lstat and stat differ at element 1
008- test.link lstat and stat differ at element 2
009- test.link lstat and stat differ at element 7
010- test.link lstat and stat differ at element 8
011- test.link lstat and stat differ at element 9
012- test.link lstat and stat differ at element 10
013- test.file is file
014- test.link is link
015- test.file permissions are 0744
016- test.file size is 0
017- test.file is writeable
018- test.file is readable
019- test.file is executable
020- test.file is a regular file
021- test.link is a regular file
022- test.link is not a directory
023- ../file is a directory
024- test.file is not a directory
025- test.file does not exist
026- test.file does not exist
================================================================================
================================================================================
E:\devel\php4\ext\standard\tests\file\003.phpt
================================================================================
---- EXPECTED OUTPUT
boolean
boolean
boolean
boolean
boolean
boolean
boolean
boolean
boolean
boolean
---- ACTUAL OUTPUT
boolean
boolean
Fatal error: Call to undefined function: is_executable() in
E:\devel\php4\ext\standard\tests\file\003.php on line 14
---- FAILED
================================================================================
003- boolean
003+
004- boolean
004+ Fatal error: Call to undefined function: is_executable() in
E:\devel\php4\ext\standard\tests\file\003.php on line 14
005- boolean
006- boolean
007- boolean
008- boolean
009- boolean
010- boolean
================================================================================
================================================================================
E:\devel\php4\ext\standard\tests\general_functions\006.phpt
================================================================================
---- EXPECTED OUTPUT
úwow-factorÁÐÕÝÅÎÎÙÅ
ÔÏÒÇÏ×ÙÅ ÐÒÏÅËÔÙ
---- ACTUAL OUTPUT
úwow-factorÁÐÕÝÅÎÎÙÅ
ÔÏÒÇÏ×ÙÅ
Ð
ÒÏÅËÔÙ
---- FAILED
================================================================================
001- úwow-factorÁÐÕÝÅÎÎÙÅ
001+ úwow-factorÁÐÕÝÅÎÎÙÅ
002- ÔÏÒÇÏ×ÙÅ ÐÒÏÅËÔÙ
002+
003+ ÔÏÒÇÏ×ÙÅ
004+
005+ Ð
006+ ÒÏÅËÔÙ
================================================================================
================================================================================
E:\devel\php4\ext\standard\tests\general_functions\007.phpt
================================================================================
---- EXPECTED OUTPUT
d41d8cd98f00b204e9800998ecf8427e
0cc175b9c0f1b6a831c399e269772661
900150983cd24fb0d6963f7d28e17f72
f96b697d7cb7938d525a2f31aaf161d0
c3fcd3d76192e4007dfb496cca67e13b
d174ab98d277d9f5a5611c2c9f419d9f
57edf4a22be3c955ac49da2e2107b67a
---- ACTUAL OUTPUT
d41d8cd98f00b204e9800998ecf8427e
0cc175b9c0f1b6a831c399e269772661
900150983cd24fb0d6963f7d28e17f72
f96b697d7cb7938d525a2f31aaf161d0
c3fcd3d76192e4007dfb496cca67e13b
d174ab98d277d9f5a5611c2c9f419d9f
57edf4a22be3c955ac49da2e2107b67a
---- FAILED
================================================================================
001- d41d8cd98f00b204e9800998ecf8427e
001+ d41d8cd98f00b204e9800998ecf8427e
002- 0cc175b9c0f1b6a831c399e269772661
002+ 0cc175b9c0f1b6a831c399e269772661
003- 900150983cd24fb0d6963f7d28e17f72
003+ 900150983cd24fb0d6963f7d28e17f72
004- f96b697d7cb7938d525a2f31aaf161d0
004+ f96b697d7cb7938d525a2f31aaf161d0
005- c3fcd3d76192e4007dfb496cca67e13b
005+ c3fcd3d76192e4007dfb496cca67e13b
006- d174ab98d277d9f5a5611c2c9f419d9f
006+ d174ab98d277d9f5a5611c2c9f419d9f
================================================================================
================================================================================
E:\devel\php4\ext\standard\tests\general_functions\getopt.phpt
================================================================================
---- EXPECTED OUTPUT
array(5) {
["v"]=>
bool(false)
["h"]=>
bool(false)
["d"]=>
string(4) "test"
["m"]=>
string(4) "1234"
["t"]=>
bool(false)
}
---- ACTUAL OUTPUT
Fatal error: Call to undefined function: getopt() in
E:\devel\php4\ext\standard\tests\general_functions\getopt.php on line 2
---- FAILED
================================================================================
001- array(5) {
001+ Fatal error: Call to undefined function: getopt() in
E:\devel\php4\ext\standard\tests\general_functions\getopt.php on line 2
002- ["v"]=>
003- bool(false)
004- ["h"]=>
005- bool(false)
006- ["d"]=>
007- string(4) "test"
008- ["m"]=>
009- string(4) "1234"
010- ["t"]=>
011- bool(false)
012- }
================================================================================
================================================================================
E:\devel\php4\ext\standard\tests\general_functions\proc_open.phpt
================================================================================
---- EXPECTED OUTPUT
I didn't segfault!
---- ACTUAL OUTPUT
---- FAILED
================================================================================
001- I didn't segfault!
001+
================================================================================
================================================================================
E:\devel\php4\ext\standard\tests\math\pow.phpt
================================================================================
---- EXPECTED OUTPUT
1,1,0,0
On failure, please mail result to php-dev@lists.php.net
OK
---- ACTUAL OUTPUT
1,1,0,0
On failure, please mail result to php-dev@lists.php.net
Assert failed:
TRUE === is_infinite(pow(0,-2))
Left: bool(true)
Right: bool(false)
Assert failed:
TRUE === is_infinite(pow(0,-1))
Left: bool(true)
Right: bool(false)
Assert failed:
TRUE === is_infinite(pow(0,-2.0))
Left: bool(true)
Right: bool(false)
Assert failed:
TRUE === is_infinite(pow(0,-1.0))
Left: bool(true)
Right: bool(false)
Assert failed:
TRUE === is_infinite(pow(0.0,-2.0))
Left: bool(true)
Right: bool(false)
Assert failed:
TRUE === is_infinite(pow(0.0,-1.0))
Left: bool(true)
Right: bool(false)
Assert failed:
TRUE === is_infinite(pow( 0.0,-2))
Left: bool(true)
Right: bool(false)
Assert failed:
TRUE === is_infinite(pow( 0.0,-1))
Left: bool(true)
Right: bool(false)
---- FAILED
================================================================================
003- OK
003+
004+ Assert failed:
005+ TRUE === is_infinite(pow(0,-2))
006+ Left: bool(true)
007+ Right: bool(false)
008+
009+ Assert failed:
010+ TRUE === is_infinite(pow(0,-1))
011+ Left: bool(true)
012+ Right: bool(false)
013+
014+ Assert failed:
015+ TRUE === is_infinite(pow(0,-2.0))
016+ Left: bool(true)
017+ Right: bool(false)
018+
019+ Assert failed:
020+ TRUE === is_infinite(pow(0,-1.0))
021+ Left: bool(true)
022+ Right: bool(false)
023+
024+ Assert failed:
025+ TRUE === is_infinite(pow(0.0,-2.0))
026+ Left: bool(true)
027+ Right: bool(false)
028+
029+ Assert failed:
030+ TRUE === is_infinite(pow(0.0,-1.0))
031+ Left: bool(true)
032+ Right: bool(false)
033+
034+ Assert failed:
035+ TRUE === is_infinite(pow( 0.0,-2))
036+ Left: bool(true)
037+ Right: bool(false)
038+
039+ Assert failed:
040+ TRUE === is_infinite(pow( 0.0,-1))
041+ Left: bool(true)
042+ Right: bool(false)
================================================================================
================================================================================
E:\devel\php4\ext\standard\tests\reg\009.phpt
================================================================================
---- EXPECTED OUTPUT
4
this
is
a
test
---- ACTUAL OUTPUT
5
this
is
a
test
---- FAILED
================================================================================
001- 4
001+ 5
005- test
005+
006+ test
================================================================================
================================================================================
E:\devel\php4\ext\standard\tests\serialize\003.phpt
================================================================================
---- EXPECTED OUTPUT
d:100;
float(100)
d:5.2E+25;
float(5.2E+25)
d:8.529E-22;
float(8.529E-22)
d:9E-09;
float(9.E-9)
---- ACTUAL OUTPUT
d:100;
float(100)
d:5.2E+025;
float(5.2E+25)
d:8.529E-022;
float(8.529E-22)
d:9E-009;
float(9.E-9)
---- FAILED
================================================================================
004- d:5.2E+25;
004+ d:5.2E+025;
007- d:8.529E-22;
007+ d:8.529E-022;
010- d:9E-09;
010+ d:9E-009;
================================================================================
================================================================================
E:\devel\php4\ext\standard\tests\strings\nl2br.phpt
================================================================================
---- EXPECTED OUTPUT
string(4) "test"
string(0) ""
string(0) ""
string(8) "<br />
"
string(7) "<br />
"
string(7) "<br />
"
string(8) "<br />
"
string(44) "<br />
<br />
<br />
<br />
<br />
<br />
"
string(47) "<br />
<br />
<br />
<br />
<br />
<br />
"
string(66) "<br />
<br />
<br />
<br />
<br />
<br />
<br />
<br />
<br />
"
---- ACTUAL OUTPUT
string(4) "test"
string(0) ""
string(0) ""
string(8) "<br />
"
string(7) "<br />
"
string(7) "<br />
"
string(8) "<br />
"
string(44) "<br />
<br />
<br />
<br />
<br />
<br />
"
string(47) "<br />
<br />
<br />
<br />
<br />
<br />
"
string(66) "<br />
<br />
<br />
<br />
<br />
<br />
<br />
<br />
<br />
"
---- FAILED
================================================================================
004- string(8) "<br />
004+ string(8) "<br />
012-
<br />
012+
<br />
018-
<br />
018+
<br />
019- <br />
019+ <br />
026-
<br />
<br />
<br />
026+
<br />
<br />
<br />
================================================================================
================================================================================
E:\devel\php4\ext\standard\tests\strings\wordwrap.phpt
================================================================================
---- EXPECTED OUTPUT
OK
---- ACTUAL OUTPUT
WARNING: unknown operator in '
' (1)
---- FAILED
================================================================================
001- OK
001+ WARNING: unknown operator in '
' (1)
================================================================================
================================================================================
E:\devel\php4\ext\standard\tests\time\001.phpt
================================================================================
---- EXPECTED OUTPUT
Passed: 100000
Failed: 0
---- ACTUAL OUTPUT
Passed: 99999
Failed: 1
023212: 1040314483 0.00000000 < 1040314483 0.99994600
---- FAILED
================================================================================
001- Passed: 100000
001+ Passed: 99999
002- Failed: 0
002+ Failed: 1
003+ 023212: 1040314483 0.00000000 < 1040314483 0.99994600
================================================================================
================================================================================
E:\devel\php4\ext\standard\tests\time\002.phpt
================================================================================
---- EXPECTED OUTPUT
1999-10-13 00:00:00
1999-10-13 00:00:00
2000-01-19 00:00:00
2000-01-19 00:00:00
2001-12-21 00:00:00
2001-12-21 00:00:00
2001-12-21 12:16:00
2001-12-21 12:16:00
1969-12-31 23:59:59
2001-10-22 21:19:58
2001-10-22 23:19:58
2001-10-22 23:32:58
2001-10-22 19:19:58
2001-10-22 19:06:58
1999-10-13 00:00:00
1999-10-13 00:00:00
2000-01-19 00:00:00
2000-01-19 00:00:00
2001-12-21 00:00:00
2001-12-21 00:00:00
2001-12-21 12:16:00
2001-12-21 12:16:00
1970-01-01 00:59:59
2001-10-22 21:19:58
2001-10-23 01:19:58
2001-10-23 01:32:58
2001-10-22 21:19:58
2001-10-22 21:06:58
---- ACTUAL OUTPUT
1999-10-13 00:00:00
1999-10-13 00:00:00
2000-01-19 00:00:00
2000-01-19 00:00:00
2001-12-21 00:00:00
2001-12-21 00:00:00
2001-12-21 12:16:00
2001-12-21 12:16:00
Warning: date() [/phpmanual/function.date.html]: Unexpected error in
E:\devel\php4\ext\standard\tests\time\002.php on line 21
2001-10-22 21:19:58
2001-10-22 23:19:58
2001-10-22 23:32:58
2001-10-22 19:19:58
2001-10-22 19:06:58
1999-10-13 00:00:00
1999-10-13 00:00:00
2000-01-19 00:00:00
2000-01-19 00:00:00
2001-12-21 00:00:00
2001-12-21 00:00:00
2001-12-21 12:16:00
2001-12-21 12:16:00
Warning: date() [/phpmanual/function.date.html]: Unexpected error in
E:\devel\php4\ext\standard\tests\time\002.php on line 26
2001-10-22 21:19:58
2001-10-23 00:19:58
2001-10-23 00:32:58
2001-10-22 20:19:58
2001-10-22 20:06:58
---- FAILED
================================================================================
009- 1969-12-31 23:59:59
009+
010- 2001-10-22 21:19:58
010+ Warning: date() [/phpmanual/function.date.html]: Unexpected error in
E:\devel\php4\ext\standard\tests\time\002.php on line 21
011- 2001-10-22 23:19:58
011+ 2001-10-22 21:19:58
012- 2001-10-22 23:32:58
012+ 2001-10-22 23:19:58
013- 2001-10-22 19:19:58
013+ 2001-10-22 23:32:58
014- 2001-10-22 19:06:58
014+ 2001-10-22 19:19:58
015- 1999-10-13 00:00:00
015+ 2001-10-22 19:06:58
017- 2000-01-19 00:00:00
017+ 1999-10-13 00:00:00
019- 2001-12-21 00:00:00
019+ 2000-01-19 00:00:00
021- 2001-12-21 12:16:00
021+ 2001-12-21 00:00:00
023- 1970-01-01 00:59:59
023+ 2001-12-21 12:16:00
024- 2001-10-22 21:19:58
024+
025- 2001-10-23 01:19:58
025+ Warning: date() [/phpmanual/function.date.html]: Unexpected error in
E:\devel\php4\ext\standard\tests\time\002.php on line 26
026- 2001-10-23 01:32:58
026+ 2001-10-22 21:19:58
027- 2001-10-22 21:19:58
027+ 2001-10-23 00:19:58
028- 2001-10-22 21:06:58
028+ 2001-10-23 00:32:58
029+ 2001-10-22 20:19:58
030+ 2001-10-22 20:06:58
================================================================================
================================================================================
E:\devel\php4\ext\standard\tests\time\003.phpt
================================================================================
---- EXPECTED OUTPUT
2000-02-29
2000-02-28
2000-02-29
2001-02-28
2001-03-01
1999-11-30
2000-05-29 12:00:00
2000-05-29 13:00:00
2000-05-29 12:00:00
2000-01-31 12:00:00
2000-01-31 12:00:00
2000-01-31 11:00:00
2000-04-29 12:00:00
2000-04-29 13:00:00
2000-04-29 12:00:00
---- ACTUAL OUTPUT
2000-02-29
2000-02-28
2000-02-29
2001-02-28
2001-03-01
1999-11-30
2000-05-29 12:00:00
2000-05-29 12:00:00
2000-05-29 11:00:00
2000-01-31 12:00:00
2000-01-31 12:00:00
2000-01-31 11:00:00
2000-04-29 12:00:00
2000-04-29 12:00:00
2000-04-29 11:00:00
---- FAILED
================================================================================
008- 2000-05-29 13:00:00
008+ 2000-05-29 12:00:00
009- 2000-05-29 12:00:00
009+ 2000-05-29 11:00:00
014- 2000-04-29 13:00:00
014+ 2000-04-29 12:00:00
015- 2000-04-29 12:00:00
015+ 2000-04-29 11:00:00
================================================================================
================================================================================
E:\devel\php4\tests\lang\bug20993.phpt
================================================================================
---- EXPECTED OUTPUT
1 -b 1 -r 1
1 -b 1 -r 1
1 -b 1 -r 1
---- ACTUAL OUTPUT
1 -b 1 -r 1
2 -b 1 -r 2
2 -b 1 -r 2
---- FAILED
================================================================================
002- 1 -b 1 -r 1
002+ 2 -b 1 -r 2
003- 1 -b 1 -r 1
003+ 2 -b 1 -r 2
================================================================================
================================================================================
BUILD ENVIRONMENT
================================================================================
OS:
WINNT
Automake:
N/A
Autoconf:
N/A
Libtool:
N/A
Compiler:
N/A
Bison:
User's E-mail:
================================================================================
PHPINFO
================================================================================
phpinfo()
PHP Version => 4.3.0-dev
System => Windows NT localhost 5.0 build 2195
Build Date => Dec 19 2002 10:14:14
Server API => Command Line Interface
Virtual Directory Support => enabled
Configuration File (php.ini) Path => C:\WINNT\php.ini
PHP API => 20020918
PHP Extension => 20020429
Zend Extension => 20021010
Debug Build => no
Thread Safety => enabled
Registered PHP Streams => php, http, ftp
This program makes use of the Zend Scripting Language Engine:
Zend Engine v1.3.0, Copyright (c) 1998-2002 Zend Technologies
_______________________________________________________________________
Configuration
PHP Core
Directive => Local Value => Master Value
allow_call_time_pass_reference => Off => Off
allow_url_fopen => On => On
always_populate_raw_post_data => Off => Off
arg_separator.input => & => &
arg_separator.output => & => &
asp_tags => Off => Off
auto_append_file => no value => no value
auto_prepend_file => no value => no value
browscap => no value => no value
default_charset => no value => no value
default_mimetype => text/html => text/html
define_syslog_variables => Off => Off
disable_functions => no value => no value
display_errors => Off => Off
display_startup_errors => Off => Off
doc_root => no value => no value
docref_ext => no value => no value
docref_root => http://www.php.net/ => http://www.php.net/
enable_dl => On => On
error_append_string => no value => no value
error_log => no value => no value
error_prepend_string => no value => no value
error_reporting => 2047 => 2047
expose_php => On => On
extension_dir => ./ => ./
file_uploads => On => On
gpc_order => GPC => GPC
highlight.bg => #FFFFFF => #FFFFFF
highlight.comment => #FF8000 => #FF8000
highlight.default => #0000BB => #0000BB
highlight.html => #000000 => #000000
highlight.keyword => #007700 => #007700
highlight.string => #DD0000 => #DD0000
html_errors => Off => On
ignore_repeated_errors => Off => Off
ignore_repeated_source => Off => Off
ignore_user_abort => Off => Off
implicit_flush => On => Off
include_path => .;c:\php4\pear => .;c:\php4\pear
log_errors => On => On
log_errors_max_len => 1024 => 1024
magic_quotes_gpc => Off => Off
magic_quotes_runtime => Off => Off
magic_quotes_sybase => Off => Off
max_execution_time => 0 => 30
max_input_time => 60 => 60
open_basedir => no value => no value
output_buffering => 0 => 0
output_handler => no value => no value
post_max_size => 8M => 8M
precision => 14 => 14
register_argc_argv => On => Off
register_globals => Off => Off
report_memleaks => On => On
safe_mode => Off => Off
safe_mode_exec_dir => no value => no value
safe_mode_gid => Off => Off
safe_mode_include_dir => no value => no value
sendmail_from => me@localhost.com => me@localhost.com
sendmail_path => no value => no value
short_open_tag => On => On
SMTP => localhost => localhost
smtp_port => 25 => 25
sql.safe_mode => Off => Off
track_errors => Off => Off
unserialize_callback_func => no value => no value
upload_max_filesize => 2M => 2M
upload_tmp_dir => no value => no value
user_dir => no value => no value
variables_order => GPCS => GPCS
xmlrpc_error_number => 0 => 0
xmlrpc_errors => Off => Off
y2k_compliance => On => On
bcmath
BCMath support => enabled
calendar
Calendar support => enabled
com
Directive => Local Value => Master Value
com.allow_dcom => Off => Off
com.autoregister_casesensitive => On => On
com.autoregister_typelib => Off => Off
com.autoregister_verbose => Off => Off
com.typelib_file => no value => no value
ctype
ctype functions => enabled
ftp
FTP support => enabled
mysql
MySQL Support => enabled
Active Persistent Links => 0
Active Links => 0
Client API version => 3.23.49
Directive => Local Value => Master Value
mysql.allow_persistent => On => On
mysql.connect_timeout => -1 => -1
mysql.default_host => no value => no value
mysql.default_password => no value => no value
mysql.default_port => no value => no value
mysql.default_socket => no value => no value
mysql.default_user => no value => no value
mysql.max_links => Unlimited => Unlimited
mysql.max_persistent => Unlimited => Unlimited
mysql.trace_mode => Off => Off
odbc
ODBC Support => enabled
Active Persistent Links => 0
Active Links => 0
ODBC library => Win32
Directive => Local Value => Master Value
odbc.allow_persistent => On => On
odbc.check_persistent => On => On
odbc.default_db => no value => no value
odbc.default_pw => <i>no value</i> => <i>no value</i>
odbc.default_user => no value => no value
odbc.defaultbinmode => return as is => return as is
odbc.defaultlrl => return up to 4096 bytes => return up to 4096 bytes
odbc.max_links => Unlimited => Unlimited
odbc.max_persistent => Unlimited => Unlimited
overload
User-Space Object Overloading Support => enabled
pcre
PCRE (Perl Compatible Regular Expressions) Support => enabled
PCRE Library Version => 3.92 11-Sep-2002
session
Session Support => enabled
Registered save handlers => files user
Directive => Local Value => Master Value
session.auto_start => Off => Off
session.bug_compat_42 => Off => Off
session.bug_compat_warn => On => On
session.cache_expire => 180 => 180
session.cache_limiter => nocache => nocache
session.cookie_domain => no value => no value
session.cookie_lifetime => 0 => 0
session.cookie_path => / => /
session.cookie_secure => Off => Off
session.entropy_file => no value => no value
session.entropy_length => 0 => 0
session.gc_dividend => 1000 => 1000
session.gc_maxlifetime => 1440 => 1440
session.gc_probability => 1 => 1
session.name => PHPSESSID => PHPSESSID
session.referer_check => no value => no value
session.save_handler => files => files
session.save_path => c:/temp => c:/temp
session.serialize_handler => php => php
session.use_cookies => On => On
session.use_only_cookies => Off => Off
session.use_trans_sid => Off => Off
standard
Regex Library => Bundled library enabled
Dynamic Library Support => enabled
Internal Sendmail Support for Windows => enabled
Directive => Local Value => Master Value
assert.active => 1 => 1
assert.bail => 0 => 0
assert.callback => no value => no value
assert.quiet_eval => 0 => 0
assert.warning => 1 => 1
auto_detect_line_endings => 0 => 0
default_socket_timeout => 60 => 60
safe_mode_allowed_env_vars => PHP_ => PHP_
safe_mode_protected_env_vars => LD_LIBRARY_PATH => LD_LIBRARY_PATH
url_rewriter.tags => a=href,area=href,frame=src,input=src,form=fakeentry =>
a=href,area=href,frame=src,input=src,form=fakeentry
user_agent => no value => no value
tokenizer
Tokenizer Support => enabled
wddx
WDDX Support => enabled
xml
XML Support => active
XML Namespace Support => active
EXPAT Version => 1.95.2
Additional Modules
Module Name
Environment
Variable => Value
ALLUSERSPROFILE => C:\Dokumente und Einstellungen\All Users
APPDATA => C:\Dokumente und Einstellungen\root\Anwendungsdaten
CLASSPATH => "d:\JavaSoft\JRE\1.3.1\lib\ext\QTJava.zip"
CommonProgramFiles => C:\Programme\Gemeinsame Dateien
COMPUTERNAME => SEBASTIAN
ComSpec => C:\WINNT\system32\cmd.exe
HOMEDRIVE => C:
HOMEPATH => \
include => D:\Microsoft Visual Studio\VC98\atl\include;D:\Microsoft Visual
Studio\VC98\mfc\include;D:\Microsoft Visual Studio\VC98\include
lib => D:\Microsoft Visual Studio\VC98\mfc\lib;D:\Microsoft Visual Studio\VC98\lib
LOGONSERVER => \\SEBASTIAN
NUMBER_OF_PROCESSORS => 1
OS => Windows_NT
Os2LibPath => C:\WINNT\system32\os2\dll;
Path => D:\Perl\bin\;C:\WINNT\system32;C:\WINNT;C:\WINNT\System32\Wbem;d:\Network
Associates\PGPNT;D:\Microsoft Visual Studio\Common\Tools\WinNT;D:\Microsoft Visual
Studio\Common\MSDev98\Bin;D:\Microsoft Visual Studio\Common\Tools;D:\Microsoft Visual
Studio\VC98\bin;D:\SSH Communications Security\SSH Secure Shell
PATHEXT => .COM;.EXE;.BAT;.CMD;.VBS;.VBE;.JS;.JSE;.WSF;.WSH
PATH_TRANSLATED => E:\devel\php4\tests\strings\004.php
PROCESSOR_ARCHITECTURE => x86
PROCESSOR_IDENTIFIER => x86 Family 6 Model 8 Stepping 6, GenuineIntel
PROCESSOR_LEVEL => 6
PROCESSOR_REVISION => 0806
ProgramFiles => C:\Programme
PROMPT => $P$G
QTJAVA => "d:\JavaSoft\JRE\1.3.1\lib\ext\QTJava.zip"
QUERY_STRING => ab+cd+ef+123+test
REDIRECT_STATUS => 1
REQUEST_METHOD => GET
SCRIPT_FILENAME => E:\devel\php4\tests\strings\004.php
SystemDrive => C:
SystemRoot => C:\WINNT
TEMP => C:\DOKUME~1\root\LOKALE~1\Temp
TEST_PHP_EXECUTABLE => c:\progra~1\apache~1\php\php.exe
TMP => C:\DOKUME~1\root\LOKALE~1\Temp
USERDOMAIN => SEBASTIAN
USERNAME => root
USERPROFILE => C:\Dokumente und Einstellungen\root
windir => C:\WINNT
PHP Variables
Variable => Value
_SERVER["ALLUSERSPROFILE"] => C:\Dokumente und Einstellungen\All Users
_SERVER["APPDATA"] => C:\Dokumente und Einstellungen\root\Anwendungsdaten
_SERVER["CLASSPATH"] => "d:\JavaSoft\JRE\1.3.1\lib\ext\QTJava.zip"
_SERVER["CommonProgramFiles"] => C:\Programme\Gemeinsame Dateien
_SERVER["COMPUTERNAME"] => SEBASTIAN
_SERVER["ComSpec"] => C:\WINNT\system32\cmd.exe
_SERVER["HOMEDRIVE"] => C:
_SERVER["HOMEPATH"] => \
_SERVER["include"] => D:\Microsoft Visual Studio\VC98\atl\include;D:\Microsoft Visual
Studio\VC98\mfc\include;D:\Microsoft Visual Studio\VC98\include
_SERVER["lib"] => D:\Microsoft Visual Studio\VC98\mfc\lib;D:\Microsoft Visual
Studio\VC98\lib
_SERVER["LOGONSERVER"] => \\SEBASTIAN
_SERVER["NUMBER_OF_PROCESSORS"] => 1
_SERVER["OS"] => Windows_NT
_SERVER["Os2LibPath"] => C:\WINNT\system32\os2\dll;
_SERVER["Path"] =>
D:\Perl\bin\;C:\WINNT\system32;C:\WINNT;C:\WINNT\System32\Wbem;d:\Network
Associates\PGPNT;D:\Microsoft Visual Studio\Common\Tools\WinNT;D:\Microsoft Visual
Studio\Common\MSDev98\Bin;D:\Microsoft Visual Studio\Common\Tools;D:\Microsoft Visual
Studio\VC98\bin;D:\SSH Communications Security\SSH Secure Shell
_SERVER["PATHEXT"] => .COM;.EXE;.BAT;.CMD;.VBS;.VBE;.JS;.JSE;.WSF;.WSH
_SERVER["PATH_TRANSLATED"] =>
_SERVER["PROCESSOR_ARCHITECTURE"] => x86
_SERVER["PROCESSOR_IDENTIFIER"] => x86 Family 6 Model 8 Stepping 6, GenuineIntel
_SERVER["PROCESSOR_LEVEL"] => 6
_SERVER["PROCESSOR_REVISION"] => 0806
_SERVER["ProgramFiles"] => C:\Programme
_SERVER["PROMPT"] => $P$G
_SERVER["QTJAVA"] => "d:\JavaSoft\JRE\1.3.1\lib\ext\QTJava.zip"
_SERVER["QUERY_STRING"] => ab+cd+ef+123+test
_SERVER["REDIRECT_STATUS"] => 1
_SERVER["REQUEST_METHOD"] => GET
_SERVER["SCRIPT_FILENAME"] =>
_SERVER["SystemDrive"] => C:
_SERVER["SystemRoot"] => C:\WINNT
_SERVER["TEMP"] => C:\DOKUME~1\root\LOKALE~1\Temp
_SERVER["TEST_PHP_EXECUTABLE"] => c:\progra~1\apache~1\php\php.exe
_SERVER["TMP"] => C:\DOKUME~1\root\LOKALE~1\Temp
_SERVER["USERDOMAIN"] => SEBASTIAN
_SERVER["USERNAME"] => root
_SERVER["USERPROFILE"] => C:\Dokumente und Einstellungen\root
_SERVER["windir"] => C:\WINNT
_SERVER["PHP_SELF"] =>
_SERVER["SCRIPT_NAME"] =>
_SERVER["DOCUMENT_ROOT"] =>
_SERVER["argv"] => Array
(
)
_SERVER["argc"] => 0
PHP License
This program is free software; you can redistribute it and/or modify
it under the terms of the PHP License as published by the PHP Group
and included in the distribution in the file: LICENSE
This program is distributed in the hope that it will be useful,
but WITHOUT ANY WARRANTY; without even the implied warranty of
MERCHANTABILITY or FITNESS FOR A PARTICULAR PURPOSE.
If you did not receive a copy of the PHP license, or have any
questions about PHP licensing, please contact license@php.net.