Test results [failed]

From: Date: Wed, 25 Dec 2002 16:54:43 +0000
Subject: Test results [failed]
Groups: php.qa 
Request: Send a blank email to php-qa+get-7492@lists.php.net to get a copy of this message
===================================================================== FAILED TEST SUMMARY --------------------------------------------------------------------- Locale settings affecting float parsing [tests/lang/034.phpt] Bug #20993 (referenced array key, makes array global) [tests/lang/bug20993.phpt] PostgreSQL optional functions [ext/pgsql/tests/07optional.phpt] PostgreSQL escape functions [ext/pgsql/tests/08escape.phpt] PostgreSQL notice function [ext/pgsql/tests/09notice.phpt] PostgreSQL pg_convert() [ext/pgsql/tests/10pg_convert.phpt] PostgreSQL pg_insert() [ext/pgsql/tests/12pg_insert.phpt] PostgreSQL pg_select() [ext/pgsql/tests/13pg_select.phpt] PostgreSQL pg_update() [ext/pgsql/tests/14pg_update.phpt] PostgreSQL pg_escape_bytea() functions [ext/pgsql/tests/18pg_escape_bytea.phpt] PostgreSQL old api [ext/pgsql/tests/98old_api.phpt] File type functions [ext/standard/tests/file/001.phpt] ===================================================================== ===================================================================== TEST RESULT SUMMARY --------------------------------------------------------------------- Exts skipped : 76 Exts tested : 12 --------------------------------------------------------------------- Number of tests : 442 Tests skipped : 147 (33.3%) Tests failed : 12 ( 2.7%) Tests passed : 283 (64.0%) --------------------------------------------------------------------- Time taken : 182 seconds ===================================================================== ================================================================================ /Users/toru/Desktop/DownLoad/php-4.3.0RC4/tests/lang/034.phpt ================================================================================ ---- EXPECTED OUTPUT 3,14 ---- ACTUAL OUTPUT 3.14 ---- FAILED ================================================================================ 001- 3,14 001+ 3.14 ================================================================================ ================================================================================ /Users/toru/Desktop/DownLoad/php-4.3.0RC4/tests/lang/bug20993.phpt ================================================================================ ---- EXPECTED OUTPUT 1 -b 1 -r 1 1 -b 1 -r 1 1 -b 1 -r 1 ---- ACTUAL OUTPUT 1 -b 1 -r 1 2 -b 1 -r 2 2 -b 1 -r 2 ---- FAILED ================================================================================ 002- 1 -b 1 -r 1 002+ 2 -b 1 -r 2 003- 1 -b 1 -r 1 003+ 2 -b 1 -r 2 ================================================================================ ================================================================================ /Users/toru/Desktop/DownLoad/php-4.3.0RC4/ext/pgsql/tests/07optional.phpt ================================================================================ ---- EXPECTED OUTPUT OK ---- ACTUAL OUTPUT Fatal error: Call to undefined function: pg_client_encoding() in /Users/toru/Desktop/DownLoad/php-4.3.0RC4/ext/pgsql/tests/optional.inc on line 7 ---- FAILED ================================================================================ 001- OK 001+ Fatal error: Call to undefined function: pg_client_encoding() in /Users/toru/Desktop/DownLoad/php-4.3.0RC4/ext/pgsql/tests/optional.inc on line 7 ================================================================================ ================================================================================ /Users/toru/Desktop/DownLoad/php-4.3.0RC4/ext/pgsql/tests/08escape.phpt ================================================================================ ---- EXPECTED OUTPUT pg_escape_string() is NOT Ok string(9) "ABC\ABC\'" string(12) "ABC\\ABC\\''" string(10) "ABC\\ABC\'" pg_escape_bytea() is Ok ---- ACTUAL OUTPUT Fatal error: Call to undefined function: pg_escape_string() in /Users/toru/Desktop/DownLoad/php-4.3.0RC4/ext/pgsql/tests/escape.inc on line 9 ---- FAILED ================================================================================ 001- pg_escape_string() is NOT Ok 001+ Fatal error: Call to undefined function: pg_escape_string() in /Users/toru/Desktop/DownLoad/php-4.3.0RC4/ext/pgsql/tests/escape.inc on line 9 002- string(9) "ABC\ABC\'" 003- string(12) "ABC\\ABC\\''" 004- string(10) "ABC\\ABC\'" 005- pg_escape_bytea() is Ok ================================================================================ ================================================================================ /Users/toru/Desktop/DownLoad/php-4.3.0RC4/ext/pgsql/tests/09notice.phpt ================================================================================ ---- EXPECTED OUTPUT NOTICE: BEGIN: already a transaction in progress NOTICE: BEGIN: already a transaction in progress pg_last_notice() is Ok ---- ACTUAL OUTPUT WARNING: BEGIN: already a transaction in progress WARNING: BEGIN: already a transaction in progress pg_last_notice() is Ok ---- FAILED ================================================================================ 001- NOTICE: BEGIN: already a transaction in progress 001+ WARNING: BEGIN: already a transaction in progress 003- NOTICE: BEGIN: already a transaction in progress 003+ WARNING: BEGIN: already a transaction in progress ================================================================================ ================================================================================ /Users/toru/Desktop/DownLoad/php-4.3.0RC4/ext/pgsql/tests/10pg_convert.phpt ================================================================================ ---- EXPECTED OUTPUT array(3) { ["num"]=> string(4) "1234" ["str"]=> string(5) "'AAA'" ["bin"]=> string(5) "'BBB'" } ---- ACTUAL OUTPUT Notice: pg_convert() [/phpmanual/function.pg-convert.html]: Unknown or system data type 'bytea' for 'bin'. in /Users/toru/Desktop/DownLoad/php-4.3.0RC4/ext/pgsql/tests/pg_convert.inc on line 9 bool(false) ---- FAILED ================================================================================ 001- array(3) { 001+ Notice: pg_convert() [/phpmanual/function.pg-convert.html]: Unknown or system data type 'bytea' for 'bin'. in /Users/toru/Desktop/DownLoad/php-4.3.0RC4/ext/pgsql/tests/pg_convert.inc on line 9 002- ["num"]=> 002+ bool(false) 003- string(4) "1234" 004- ["str"]=> 005- string(5) "'AAA'" 006- ["bin"]=> 007- string(5) "'BBB'" 008- } ================================================================================ ================================================================================ /Users/toru/Desktop/DownLoad/php-4.3.0RC4/ext/pgsql/tests/12pg_insert.phpt ================================================================================ ---- EXPECTED OUTPUT INSERT INTO php_pgsql_test (num,str,bin) VALUES (1234,'AAA','BBB'); Ok ---- ACTUAL OUTPUT Notice: pg_insert() [/phpmanual/function.pg-insert.html]: Unknown or system data type 'bytea' for 'bin'. in /Users/toru/Desktop/DownLoad/php-4.3.0RC4/ext/pgsql/tests/pg_insert.inc on line 9 Error in test 1 Notice: pg_insert() [/phpmanual/function.pg-insert.html]: Unknown or system data type 'bytea' for 'bin'. in /Users/toru/Desktop/DownLoad/php-4.3.0RC4/ext/pgsql/tests/pg_insert.inc on line 10 Ok ---- FAILED ================================================================================ 001- INSERT INTO php_pgsql_test (num,str,bin) VALUES (1234,'AAA','BBB'); 001+ Notice: pg_insert() [/phpmanual/function.pg-insert.html]: Unknown or system data type 'bytea' for 'bin'. in /Users/toru/Desktop/DownLoad/php-4.3.0RC4/ext/pgsql/tests/pg_insert.inc on line 9 002- Ok 002+ Error in test 1 003+ 004+ Notice: pg_insert() [/phpmanual/function.pg-insert.html]: Unknown or system data type 'bytea' for 'bin'. in /Users/toru/Desktop/DownLoad/php-4.3.0RC4/ext/pgsql/tests/pg_insert.inc on line 10 005+ 006+ Ok ================================================================================ ================================================================================ /Users/toru/Desktop/DownLoad/php-4.3.0RC4/ext/pgsql/tests/13pg_select.phpt ================================================================================ ---- EXPECTED OUTPUT array(1) { [0]=> array(3) { ["num"]=> string(4) "1234" ["str"]=> string(3) "AAA" ["bin"]=> string(3) "BBB" } } SELECT * FROM php_pgsql_test WHERE num=1234; Ok ---- ACTUAL OUTPUT Error bool(false) Ok ---- FAILED ================================================================================ 001- array(1) { 001+ Error 002- [0]=> 002+ bool(false) 003- array(3) { 003+ 004- ["num"]=> 004+ Ok 005- string(4) "1234" 006- ["str"]=> 007- string(3) "AAA" 008- ["bin"]=> 009- string(3) "BBB" 010- } 011- } 012- SELECT * FROM php_pgsql_test WHERE num=1234; 013- Ok ================================================================================ ================================================================================ /Users/toru/Desktop/DownLoad/php-4.3.0RC4/ext/pgsql/tests/14pg_update.phpt ================================================================================ ---- EXPECTED OUTPUT UPDATE php_pgsql_test SET num=1234,str='ABC',bin='XYZ' WHERE num=1234; Ok ---- ACTUAL OUTPUT Notice: pg_update() [/phpmanual/function.pg-update.html]: Unknown or system data type 'bytea' for 'bin'. in /Users/toru/Desktop/DownLoad/php-4.3.0RC4/ext/pgsql/tests/pg_update.inc on line 10 Error in test 1 Notice: pg_update() [/phpmanual/function.pg-update.html]: Unknown or system data type 'bytea' for 'bin'. in /Users/toru/Desktop/DownLoad/php-4.3.0RC4/ext/pgsql/tests/pg_update.inc on line 11 Ok ---- FAILED ================================================================================ 001- UPDATE php_pgsql_test SET num=1234,str='ABC',bin='XYZ' WHERE num=1234; 001+ Notice: pg_update() [/phpmanual/function.pg-update.html]: Unknown or system data type 'bytea' for 'bin'. in /Users/toru/Desktop/DownLoad/php-4.3.0RC4/ext/pgsql/tests/pg_update.inc on line 10 002- Ok 002+ Error in test 1 003+ 004+ Notice: pg_update() [/phpmanual/function.pg-update.html]: Unknown or system data type 'bytea' for 'bin'. in /Users/toru/Desktop/DownLoad/php-4.3.0RC4/ext/pgsql/tests/pg_update.inc on line 11 005+ 006+ Ok ================================================================================ ================================================================================ /Users/toru/Desktop/DownLoad/php-4.3.0RC4/ext/pgsql/tests/18pg_escape_bytea.phpt ================================================================================ ---- EXPECTED OUTPUT OK ---- ACTUAL OUTPUT Fatal error: Call to undefined function: pg_escape_bytea() in /Users/toru/Desktop/DownLoad/php-4.3.0RC4/ext/pgsql/tests/pg_escape_bytea.inc on line 9 ---- FAILED ================================================================================ 001- OK 001+ Fatal error: Call to undefined function: pg_escape_bytea() in /Users/toru/Desktop/DownLoad/php-4.3.0RC4/ext/pgsql/tests/pg_escape_bytea.inc on line 9 ================================================================================ ================================================================================ /Users/toru/Desktop/DownLoad/php-4.3.0RC4/ext/pgsql/tests/98old_api.phpt ================================================================================ ---- EXPECTED OUTPUT OK ---- ACTUAL OUTPUT Warning: pg_cmdtuples() [/phpmanual/function.pg-cmdtuples.html]: Not supportted under this build. in /Users/toru/Desktop/DownLoad/php-4.3.0RC4/ext/pgsql/tests/old_api.inc on line 21 OK ---- FAILED ================================================================================ 001- OK 001+ Warning: pg_cmdtuples() [/phpmanual/function.pg-cmdtuples.html]: Not supportted under this build. in /Users/toru/Desktop/DownLoad/php-4.3.0RC4/ext/pgsql/tests/old_api.inc on line 21 002+ OK ================================================================================ ================================================================================ /Users/toru/Desktop/DownLoad/php-4.3.0RC4/ext/standard/tests/file/001.phpt ================================================================================ ---- EXPECTED OUTPUT test.file does not exist test.file exists test.link exists test.file is not a symlink test.link is a symlink test.file exists test.link lstat and stat differ at element 1 test.link lstat and stat differ at element 2 test.link lstat and stat differ at element 7 test.link lstat and stat differ at element 8 test.link lstat and stat differ at element 9 test.link lstat and stat differ at element 10 test.file is file test.link is link test.file permissions are 0744 test.file size is 0 test.file is writeable test.file is readable test.file is executable test.file is a regular file test.link is a regular file test.link is not a directory ../file is a directory test.file is not a directory test.file does not exist test.file does not exist ---- ACTUAL OUTPUT test.file does not exist test.file exists test.link exists test.file is not a symlink test.link is a symlink test.file exists test.link lstat and stat differ at element 1 test.link lstat and stat differ at element 2 test.link lstat and stat differ at element 7 test.link lstat and stat differ at element 8 test.link lstat and stat differ at element 9 test.file is file test.link is link test.file permissions are 0744 test.file size is 0 test.file is writeable test.file is readable test.file is executable test.file is a regular file test.link is a regular file test.link is not a directory ../file is a directory test.file is not a directory test.file does not exist test.file does not exist ---- FAILED ================================================================================ 012- test.link lstat and stat differ at element 10 012+ test.file is file 013- test.file is file 013+ test.link is link 014- test.link is link 014+ test.file permissions are 0744 015- test.file permissions are 0744 015+ test.file size is 0 016- test.file size is 0 016+ test.file is writeable 017- test.file is writeable 017+ test.file is readable 018- test.file is readable 018+ test.file is executable 019- test.file is executable 019+ test.file is a regular file 020- test.file is a regular file 020+ test.link is a regular file 021- test.link is a regular file 021+ test.link is not a directory 022- test.link is not a directory 022+ ../file is a directory 023- ../file is a directory 023+ test.file is not a directory 024- test.file is not a directory 024+ test.file does not exist 026- test.file does not exist ================================================================================ ================================================================================ BUILD ENVIRONMENT ================================================================================ OS: Darwin Automake: automake (GNU automake) 1.6.1 Written by Tom Tromey <tromey@redhat.com>. Copyright 2002 Free Software Foundation, Inc. This is free software; see the source for copying conditions. There is NO warranty; not even for MERCHANTABILITY or FITNESS FOR A PARTICULAR PURPOSE. Autoconf: autoconf (GNU Autoconf) 2.52 Written by David J. MacKenzie. Copyright 1992, 1993, 1994, 1996, 1999, 2000, 2001 Free Software Foundation, Inc. This is free software; see the source for copying conditions. There is NO warranty; not even for MERCHANTABILITY or FITNESS FOR A PARTICULAR PURPOSE. Libtool: ltmain.sh (GNU libtool) 1.4.2 (1.922.2.53 2001/09/11 03:18:52) Compiler: Reading specs from /usr/libexec/gcc/darwin/ppc/3.1/specs Thread model: posix Apple Computer, Inc. GCC version 1175, based on gcc version 3.1 20020420 (prerelease) Bison: GNU Bison version 1.28 User's E-mail: tandc at plala dot to ================================================================================ PHPINFO ================================================================================ phpinfo() PHP Version => 4.3.0RC4 System => Darwin tandc.plala.jp 6.3 Darwin Kernel Version 6.3: Sat Dec 14 03:11:25 PST 2002; root:xnu/xnu-344.23.obj~4/RELEASE_PPC Power Macintosh Build Date => Dec 26 2002 01:27:55 Configure Command => './configure' '--prefix=/usr/local' '--with-apxs=/usr/sbin/apxs' '--enable-mbstring' '--enable-mbregex' '--with-pgsql' '--disable-cgi' '--without-openssl' Server API => Command Line Interface Virtual Directory Support => disabled Configuration File (php.ini) Path => /usr/local/lib/php.ini PHP API => 20020918 PHP Extension => 20020429 Zend Extension => 20021010 Debug Build => no Thread Safety => disabled Registered PHP Streams => php, http, ftp This program makes use of the Zend Scripting Language Engine: Zend Engine v1.3.0, Copyright (c) 1998-2002 Zend Technologies _______________________________________________________________________ Configuration PHP Core Directive => Local Value => Master Value allow_call_time_pass_reference => On => On allow_url_fopen => On => On always_populate_raw_post_data => Off => Off arg_separator.input => &amp; => &amp; arg_separator.output => &amp; => &amp; asp_tags => Off => Off auto_append_file => no value => no value auto_prepend_file => no value => no value browscap => no value => no value default_charset => no value => no value default_mimetype => text/html => text/html define_syslog_variables => Off => Off disable_functions => no value => no value display_errors => On => On display_startup_errors => Off => Off doc_root => no value => no value docref_ext => no value => no value docref_root => http://www.php.net/ => http://www.php.net/ enable_dl => On => On error_append_string => no value => no value error_log => no value => no value error_prepend_string => no value => no value error_reporting => 2039 => 2039 expose_php => On => On extension_dir => ./ => ./ file_uploads => On => On gpc_order => GPC => GPC highlight.bg => #FFFFFF => #FFFFFF highlight.comment => #FF8000 => #FF8000 highlight.default => #0000BB => #0000BB highlight.html => #000000 => #000000 highlight.keyword => #007700 => #007700 highlight.string => #DD0000 => #DD0000 html_errors => Off => On ignore_repeated_errors => Off => Off ignore_repeated_source => Off => Off ignore_user_abort => Off => Off implicit_flush => On => Off include_path => .:/usr/local/lib/php => .:/usr/local/lib/php log_errors => Off => Off log_errors_max_len => 1024 => 1024 magic_quotes_gpc => On => On magic_quotes_runtime => Off => Off magic_quotes_sybase => Off => Off max_execution_time => 0 => 30 max_input_time => 60 => 60 open_basedir => no value => no value output_buffering => no value => no value output_handler => no value => no value post_max_size => 8M => 8M precision => 12 => 12 register_argc_argv => On => On register_globals => Off => Off report_memleaks => On => On safe_mode => Off => Off safe_mode_exec_dir => no value => no value safe_mode_gid => Off => Off safe_mode_include_dir => no value => no value sendmail_from => me@localhost.com => me@localhost.com sendmail_path => /usr/sbin/sendmail -t -i => /usr/sbin/sendmail -t -i short_open_tag => On => On SMTP => localhost => localhost smtp_port => 25 => 25 sql.safe_mode => Off => Off track_errors => Off => Off unserialize_callback_func => no value => no value upload_max_filesize => 2M => 2M upload_tmp_dir => no value => no value user_dir => no value => no value variables_order => EGPCS => EGPCS xmlrpc_error_number => 0 => 0 xmlrpc_errors => Off => Off y2k_compliance => On => On ctype ctype functions => enabled mbstring Multibyte Support => enabled Japanese support => enabled Multibyte (japanese) regex support => enabled Directive => Local Value => Master Value mbstring.detect_order => auto => auto mbstring.encoding_translation => Off => Off mbstring.func_overload => 0 => 0 mbstring.http_input => auto => auto mbstring.http_output => SJIS => SJIS mbstring.internal_encoding => EUC-JP => EUC-JP mbstring.language => Japanese => Japanese mbstring.substitute_character => no value => no value mysql MySQL Support => enabled Active Persistent Links => 0 Active Links => 0 Client API version => 3.23.49 MYSQL_MODULE_TYPE => builtin MYSQL_SOCKET => /tmp/mysql.sock MYSQL_INCLUDE => MYSQL_LIBS => Directive => Local Value => Master Value mysql.allow_persistent => On => On mysql.connect_timeout => -1 => -1 mysql.default_host => no value => no value mysql.default_password => no value => no value mysql.default_port => no value => no value mysql.default_socket => no value => no value mysql.default_user => no value => no value mysql.max_links => Unlimited => Unlimited mysql.max_persistent => Unlimited => Unlimited mysql.trace_mode => Off => Off openssl OpenSSL support => enabled OpenSSL Version => OpenSSL 0.9.6e 30 Jul 2002 overload User-Space Object Overloading Support => enabled pcre PCRE (Perl Compatible Regular Expressions) Support => enabled PCRE Library Version => 3.92 11-Sep-2002 pgsql PostgreSQL Support => enabled PostgreSQL(libpq) Version => 7.3 Multibyte charater support => enabled SSL support => enabled Active Persistent Links => 0 Active Links => 0 Directive => Local Value => Master Value pgsql.allow_persistent => On => On pgsql.auto_reset_persistent => Off => Off pgsql.ignore_notice => Off => Off pgsql.log_notice => Off => Off pgsql.max_links => Unlimited => Unlimited pgsql.max_persistent => Unlimited => Unlimited posix Revision => $Revision: 1.51 $ session Session Support => enabled Registered save handlers => files user Directive => Local Value => Master Value session.auto_start => Off => Off session.bug_compat_42 => On => On session.bug_compat_warn => On => On session.cache_expire => 180 => 180 session.cache_limiter => nocache => nocache session.cookie_domain => no value => no value session.cookie_lifetime => 0 => 0 session.cookie_path => / => / session.cookie_secure => Off => Off session.entropy_file => no value => no value session.entropy_length => 0 => 0 session.gc_dividend => 100 => 100 session.gc_maxlifetime => 1440 => 1440 session.gc_probability => 1 => 1 session.name => PHPSESSID => PHPSESSID session.referer_check => no value => no value session.save_handler => files => files session.save_path => /tmp => /tmp session.serialize_handler => php => php session.use_cookies => On => On session.use_only_cookies => Off => Off session.use_trans_sid => Off => Off standard Regex Library => Bundled library enabled Dynamic Library Support => enabled Path to sendmail => /usr/sbin/sendmail -t -i Directive => Local Value => Master Value assert.active => 1 => 1 assert.bail => 0 => 0 assert.callback => no value => no value assert.quiet_eval => 0 => 0 assert.warning => 1 => 1 auto_detect_line_endings => 0 => 0 default_socket_timeout => 60 => 60 safe_mode_allowed_env_vars => PHP_ => PHP_ safe_mode_protected_env_vars => LD_LIBRARY_PATH => LD_LIBRARY_PATH url_rewriter.tags => a=href,area=href,frame=src,input=src,form=,fieldset= => a=href,area=href,frame=src,input=src,form=,fieldset= user_agent => no value => no value tokenizer Tokenizer Support => enabled xml XML Support => active XML Namespace Support => active EXPAT Version => 1.95.2 Additional Modules Module Name Environment Variable => Value PWD => /Users/toru/Desktop/DownLoad/php-4.3.0RC4 MAKEFLAGS => MFLAGS => LD_LIBRARY_PATH => /usr/X11R6/lib:/usr/local/lib REDIRECT_STATUS => PERL5LIB => /sw/lib/perl5:/sw/lib/perl5 TEST_PHP_EXECUTABLE => /Users/toru/Desktop/DownLoad/php-4.3.0RC4/sapi/cli/php MANPATH => /sw/share/man:/sw/man:/sw/share/man:/sw/man:/usr/local/share/man:/usr/local/man:/usr/share/man:/usr/X11R6/man:/usr/X11R6/man CC => gcc USER => toru SCRIPT_FILENAME => PATH_TRANSLATED => QUERY_STRING => CONTENT_LENGTH => JAVA_HOME => /usr/bin MAKELEVEL => 1 INFOPATH => /sw/share/info:/sw/info:/sw/share/info:/sw/info:/usr/local/share/info:/usr/local/lib/info:/usr/local/info:/usr/share/info SHLVL => 3 _ => /Users/toru/Desktop/DownLoad/php-4.3.0RC4/sapi/cli/php REQUEST_METHOD => SHELL => /bin/sh DYLD_LIBRARY_PATH => /usr/X11R6/lib:/usr/local/lib TEST_PHP_SRCDIR => /Users/toru/Desktop/DownLoad/php-4.3.0RC4 TERM => xterm-color HOME => /Users/toru PATH => /usr/local/bin:/usr/local/ant/bin:/sw/bin:/sw/sbin:/usr/local/bin:/sw/bin:/sw/sbin:/bin:/sbin:/usr/bin:/usr/sbin:/usr/X11R6/bin:/usr/X11R6/bin __CF_USER_TEXT_ENCODING => 0x1F5:1:14 CONTENT_TYPE => PHP Variables Variable => Value _SERVER["PWD"] => /Users/toru/Desktop/DownLoad/php-4.3.0RC4 _SERVER["MAKEFLAGS"] => _SERVER["MFLAGS"] => _SERVER["LD_LIBRARY_PATH"] => /usr/X11R6/lib:/usr/local/lib _SERVER["REDIRECT_STATUS"] => _SERVER["PERL5LIB"] => /sw/lib/perl5:/sw/lib/perl5 _SERVER["TEST_PHP_EXECUTABLE"] => /Users/toru/Desktop/DownLoad/php-4.3.0RC4/sapi/cli/php _SERVER["MANPATH"] => /sw/share/man:/sw/man:/sw/share/man:/sw/man:/usr/local/share/man:/usr/local/man:/usr/share/man:/usr/X11R6/man:/usr/X11R6/man _SERVER["CC"] => gcc _SERVER["USER"] => toru _SERVER["SCRIPT_FILENAME"] => _SERVER["PATH_TRANSLATED"] => _SERVER["QUERY_STRING"] => _SERVER["CONTENT_LENGTH"] => _SERVER["JAVA_HOME"] => /usr/bin _SERVER["MAKELEVEL"] => 1 _SERVER["INFOPATH"] => /sw/share/info:/sw/info:/sw/share/info:/sw/info:/usr/local/share/info:/usr/local/lib/info:/usr/local/info:/usr/share/info _SERVER["SHLVL"] => 3 _SERVER["_"] => /Users/toru/Desktop/DownLoad/php-4.3.0RC4/sapi/cli/php _SERVER["REQUEST_METHOD"] => _SERVER["SHELL"] => /bin/sh _SERVER["DYLD_LIBRARY_PATH"] => /usr/X11R6/lib:/usr/local/lib _SERVER["TEST_PHP_SRCDIR"] => /Users/toru/Desktop/DownLoad/php-4.3.0RC4 _SERVER["TERM"] => xterm-color _SERVER["HOME"] => /Users/toru _SERVER["PATH"] => /usr/local/bin:/usr/local/ant/bin:/sw/bin:/sw/sbin:/usr/local/bin:/sw/bin:/sw/sbin:/bin:/sbin:/usr/bin:/usr/sbin:/usr/X11R6/bin:/usr/X11R6/bin _SERVER["__CF_USER_TEXT_ENCODING"] => 0x1F5:1:14 _SERVER["CONTENT_TYPE"] => _SERVER["PHP_SELF"] => _SERVER["SCRIPT_NAME"] => _SERVER["DOCUMENT_ROOT"] => _SERVER["argv"] => Array ( ) _SERVER["argc"] => 0 _ENV["PWD"] => /Users/toru/Desktop/DownLoad/php-4.3.0RC4 _ENV["MAKEFLAGS"] => _ENV["MFLAGS"] => _ENV["LD_LIBRARY_PATH"] => /usr/X11R6/lib:/usr/local/lib _ENV["REDIRECT_STATUS"] => _ENV["PERL5LIB"] => /sw/lib/perl5:/sw/lib/perl5 _ENV["TEST_PHP_EXECUTABLE"] => /Users/toru/Desktop/DownLoad/php-4.3.0RC4/sapi/cli/php _ENV["MANPATH"] => /sw/share/man:/sw/man:/sw/share/man:/sw/man:/usr/local/share/man:/usr/local/man:/usr/share/man:/usr/X11R6/man:/usr/X11R6/man _ENV["CC"] => gcc _ENV["USER"] => toru _ENV["SCRIPT_FILENAME"] => _ENV["PATH_TRANSLATED"] => _ENV["QUERY_STRING"] => _ENV["CONTENT_LENGTH"] => _ENV["JAVA_HOME"] => /usr/bin _ENV["MAKELEVEL"] => 1 _ENV["INFOPATH"] => /sw/share/info:/sw/info:/sw/share/info:/sw/info:/usr/local/share/info:/usr/local/lib/info:/usr/local/info:/usr/share/info _ENV["SHLVL"] => 3 _ENV["_"] => /Users/toru/Desktop/DownLoad/php-4.3.0RC4/sapi/cli/php _ENV["REQUEST_METHOD"] => _ENV["SHELL"] => /bin/sh _ENV["DYLD_LIBRARY_PATH"] => /usr/X11R6/lib:/usr/local/lib _ENV["TEST_PHP_SRCDIR"] => /Users/toru/Desktop/DownLoad/php-4.3.0RC4 _ENV["TERM"] => xterm-color _ENV["HOME"] => /Users/toru _ENV["PATH"] => /usr/local/bin:/usr/local/ant/bin:/sw/bin:/sw/sbin:/usr/local/bin:/sw/bin:/sw/sbin:/bin:/sbin:/usr/bin:/usr/sbin:/usr/X11R6/bin:/usr/X11R6/bin _ENV["__CF_USER_TEXT_ENCODING"] => 0x1F5:1:14 _ENV["CONTENT_TYPE"] => PHP License This program is free software; you can redistribute it and/or modify it under the terms of the PHP License as published by the PHP Group and included in the distribution in the file: LICENSE This program is distributed in the hope that it will be useful, but WITHOUT ANY WARRANTY; without even the implied warranty of MERCHANTABILITY or FITNESS FOR A PARTICULAR PURPOSE. If you did not receive a copy of the PHP license, or have any questions about PHP licensing, please contact license@php.net.

« previous php.qa (#7492) next »