Test results [failed]
| From: | noreply@php.net | Date: | Thu, 26 Dec 2002 15:22:02 +0000 |
| Subject: | Test results [failed] | ||
| Groups: | php.qa | ||
| Request: | Send a blank email to php-qa+get-7502@lists.php.net to get a copy of this message | ||
=====================================================================
FAILED TEST SUMMARY
---------------------------------------------------------------------
Bug #20993 (referenced array key, makes array global) [tests/lang/bug20993.phpt]
OpenSSL private key functions [ext/openssl/tests/001.phpt]
strtotime() function [ext/standard/tests/time/002.phpt]
=====================================================================
=====================================================================
TEST RESULT SUMMARY
---------------------------------------------------------------------
Exts skipped : 71
Exts tested : 17
---------------------------------------------------------------------
Number of tests : 442
Tests skipped : 212 (48.0%)
Tests failed : 3 ( 0.7%)
Tests passed : 227 (51.4%)
---------------------------------------------------------------------
Time taken : 78 seconds
=====================================================================
================================================================================
/export/home/instaladores/php-4.3.0RC4/tests/lang/bug20993.phpt
================================================================================
---- EXPECTED OUTPUT
1 -b 1 -r 1
1 -b 1 -r 1
1 -b 1 -r 1
---- ACTUAL OUTPUT
1 -b 1 -r 1
2 -b 1 -r 2
2 -b 1 -r 2
---- FAILED
================================================================================
002- 1 -b 1 -r 1
002+ 2 -b 1 -r 2
003- 1 -b 1 -r 1
003+ 2 -b 1 -r 2
================================================================================
================================================================================
/export/home/instaladores/php-4.3.0RC4/ext/openssl/tests/001.phpt
================================================================================
---- EXPECTED OUTPUT
Creating private key
Export key to file
Load key from file - array syntax
Load key using direct syntax
Load key manually and use string syntax
OK!
---- ACTUAL OUTPUT
Creating private key
Warning: openssl_pkey_new() [/phpmanual/function.openssl-pkey-new.html]: unable to load random
state; not enough random data! in /export/home/instaladores/php-4.3.0RC4/ext/openssl/tests/001.php
on line 13
failed to create private key
---- FAILED
================================================================================
002- Export key to file
002+
003- Load key from file - array syntax
003+ Warning: openssl_pkey_new() [/phpmanual/function.openssl-pkey-new.html]: unable to load random
state; not enough random data! in /export/home/instaladores/php-4.3.0RC4/ext/openssl/tests/001.php
on line 13
004- Load key using direct syntax
004+ failed to create private key
005- Load key manually and use string syntax
006- OK!
================================================================================
================================================================================
/export/home/instaladores/php-4.3.0RC4/ext/standard/tests/time/002.phpt
================================================================================
---- EXPECTED OUTPUT
1999-10-13 00:00:00
1999-10-13 00:00:00
2000-01-19 00:00:00
2000-01-19 00:00:00
2001-12-21 00:00:00
2001-12-21 00:00:00
2001-12-21 12:16:00
2001-12-21 12:16:00
1969-12-31 23:59:59
2001-10-22 21:19:58
2001-10-22 23:19:58
2001-10-22 23:32:58
2001-10-22 19:19:58
2001-10-22 19:06:58
1999-10-13 00:00:00
1999-10-13 00:00:00
2000-01-19 00:00:00
2000-01-19 00:00:00
2001-12-21 00:00:00
2001-12-21 00:00:00
2001-12-21 12:16:00
2001-12-21 12:16:00
1970-01-01 00:59:59
2001-10-22 21:19:58
2001-10-23 01:19:58
2001-10-23 01:32:58
2001-10-22 21:19:58
2001-10-22 21:06:58
---- ACTUAL OUTPUT
1999-10-13 00:00:00
1999-10-13 00:00:00
2000-01-19 00:00:00
2000-01-19 00:00:00
2001-12-21 00:00:00
2001-12-21 00:00:00
2001-12-21 12:16:00
2001-12-21 12:16:00
1969-12-31 23:59:59
2001-10-22 21:19:58
2001-10-22 23:19:58
2001-10-22 23:32:58
2001-10-22 19:19:58
2001-10-22 19:06:58
1999-10-13 00:00:00
1999-10-13 00:00:00
2000-01-19 00:00:00
2000-01-19 00:00:00
2001-12-21 00:00:00
2001-12-21 00:00:00
2001-12-21 12:16:00
2001-12-21 12:16:00
1969-12-31 23:59:59
2001-10-22 21:19:58
2001-10-22 23:19:58
2001-10-22 23:32:58
2001-10-22 19:19:58
2001-10-22 19:06:58
---- FAILED
================================================================================
023- 1970-01-01 00:59:59
023+ 1969-12-31 23:59:59
025- 2001-10-23 01:19:58
025+ 2001-10-22 23:19:58
026- 2001-10-23 01:32:58
026+ 2001-10-22 23:32:58
027- 2001-10-22 21:19:58
027+ 2001-10-22 19:19:58
028- 2001-10-22 21:06:58
028+ 2001-10-22 19:06:58
================================================================================
================================================================================
BUILD ENVIRONMENT
================================================================================
OS:
SunOS
Automake:
automake (GNU automake) 1.7
Written by Tom Tromey <tromey@redhat.com>.
Copyright 2002 Free Software Foundation, Inc.
This is free software; see the source for copying conditions. There is NO
warranty; not even for MERCHANTABILITY or FITNESS FOR A PARTICULAR PURPOSE.
Autoconf:
autoconf (GNU Autoconf) 2.54
Written by David J. MacKenzie and Akim Demaille.
Copyright 2002 Free Software Foundation, Inc.
This is free software; see the source for copying conditions. There is NO
warranty; not even for MERCHANTABILITY or FITNESS FOR A PARTICULAR PURPOSE.
Libtool:
ltmain.sh (GNU libtool) 1.4.2 (1.922.2.53 2001/09/11 03:18:52)
Compiler:
Reading specs from /usr/local/lib/gcc-lib/sparc-sun-solaris2.8/2.95.3/specs
gcc version 2.95.3 20010315 (release)
Bison:
bison (GNU Bison) 1.75
Written by Robert Corbett and Richard Stallman.
Copyright (C) 2002 Free Software Foundation, Inc.
This is free software; see the source for copying conditions. There is NO
warranty; not even for MERCHANTABILITY or FITNESS FOR A PARTICULAR PURPOSE.
User's E-mail: Carlos dot Anibarro at EntelNET dot BO
================================================================================
PHPINFO
================================================================================
phpinfo()
PHP Version => 4.3.0RC4
System => SunOS desarrollo 5.8 Generic_108528-16 sun4u
Build Date => Dec 26 2002 10:15:50
Configure Command => './configure' '--with-apxs=/usr/local/apache/bin/apxs'
'--with-openssl' '--with-zlib' '--enable-bcmath'
'--enable-calendar' '--enable-filepro' '--enable-ftp'
'--with-gd' '--with-mysql' '--with-unixODBC'
Server API => Command Line Interface
Virtual Directory Support => disabled
Configuration File (php.ini) Path => /usr/local/lib/php.ini
PHP API => 20020918
PHP Extension => 20020429
Zend Extension => 20021010
Debug Build => no
Thread Safety => disabled
Registered PHP Streams => php, http, ftp, https, ftps, compress.zlib
This program makes use of the Zend Scripting Language Engine:
Zend Engine v1.3.0, Copyright (c) 1998-2002 Zend Technologies
_______________________________________________________________________
Configuration
PHP Core
Directive => Local Value => Master Value
allow_call_time_pass_reference => On => On
allow_url_fopen => On => On
always_populate_raw_post_data => Off => Off
arg_separator.input => & => &
arg_separator.output => & => &
asp_tags => Off => Off
auto_append_file => no value => no value
auto_prepend_file => no value => no value
browscap => no value => no value
default_charset => no value => no value
default_mimetype => text/html => text/html
define_syslog_variables => Off => Off
disable_functions => no value => no value
display_errors => On => On
display_startup_errors => Off => Off
doc_root => no value => no value
docref_ext => no value => no value
docref_root => http://www.php.net/ => http://www.php.net/
enable_dl => On => On
error_append_string => no value => no value
error_log => no value => no value
error_prepend_string => no value => no value
error_reporting => 2039 => 2039
expose_php => On => On
extension_dir => ./ => ./
file_uploads => On => On
gpc_order => GPC => GPC
highlight.bg => #FFFFFF => #FFFFFF
highlight.comment => #FF8000 => #FF8000
highlight.default => #0000BB => #0000BB
highlight.html => #000000 => #000000
highlight.keyword => #007700 => #007700
highlight.string => #DD0000 => #DD0000
html_errors => Off => On
ignore_repeated_errors => Off => Off
ignore_repeated_source => Off => Off
ignore_user_abort => Off => Off
implicit_flush => On => Off
include_path => .:/usr/local/lib/php => .:/usr/local/lib/php
log_errors => Off => Off
log_errors_max_len => 1024 => 1024
magic_quotes_gpc => On => On
magic_quotes_runtime => Off => Off
magic_quotes_sybase => Off => Off
max_execution_time => 0 => 30
max_input_time => 60 => 60
open_basedir => no value => no value
output_buffering => no value => no value
output_handler => no value => no value
post_max_size => 8M => 8M
precision => 12 => 12
register_argc_argv => On => On
register_globals => On => On
report_memleaks => On => On
safe_mode => Off => Off
safe_mode_exec_dir => no value => no value
safe_mode_gid => Off => Off
safe_mode_include_dir => no value => no value
sendmail_from => me@localhost.com => me@localhost.com
sendmail_path => /usr/lib/sendmail -t -i => /usr/lib/sendmail -t -i
short_open_tag => On => On
SMTP => localhost => localhost
smtp_port => 25 => 25
sql.safe_mode => Off => Off
track_errors => Off => Off
unserialize_callback_func => no value => no value
upload_max_filesize => 2M => 2M
upload_tmp_dir => no value => no value
user_dir => no value => no value
variables_order => EGPCS => EGPCS
xmlrpc_error_number => 0 => 0
xmlrpc_errors => Off => Off
y2k_compliance => On => On
bcmath
BCMath support => enabled
calendar
Calendar support => enabled
ctype
ctype functions => enabled
ftp
FTP support => enabled
gd
GD Support => enabled
GD Version => bundled (2.0 compatible)
GIF Read Support => enabled
PNG Support => enabled
WBMP Support => enabled
mysql
MySQL Support => enabled
Active Persistent Links => 0
Active Links => 0
Client API version => 3.23.49
MYSQL_MODULE_TYPE => builtin
MYSQL_SOCKET => /tmp/mysql.sock
MYSQL_INCLUDE => MYSQL_LIBS =>
Directive => Local Value => Master Value
mysql.allow_persistent => On => On
mysql.connect_timeout => -1 => -1
mysql.default_host => no value => no value
mysql.default_password => no value => no value
mysql.default_port => no value => no value
mysql.default_socket => no value => no value
mysql.default_user => no value => no value
mysql.max_links => Unlimited => Unlimited
mysql.max_persistent => Unlimited => Unlimited
mysql.trace_mode => Off => Off
odbc
ODBC Support => enabled
Active Persistent Links => 0
Active Links => 0
ODBC library => unixODBC
ODBC_INCLUDE => -I/usr/local/include
ODBC_LFLAGS => -L/usr/local/lib
ODBC_LIBS => -lodbc
Directive => Local Value => Master Value
odbc.allow_persistent => On => On
odbc.check_persistent => On => On
odbc.default_db => no value => no value
odbc.default_pw => <i>no value</i> => <i>no value</i>
odbc.default_user => no value => no value
odbc.defaultbinmode => return as is => return as is
odbc.defaultlrl => return up to 4096 bytes => return up to 4096 bytes
odbc.max_links => Unlimited => Unlimited
odbc.max_persistent => Unlimited => Unlimited
openssl
OpenSSL support => enabled
OpenSSL Version => OpenSSL 0.9.6g 9 Aug 2002
overload
User-Space Object Overloading Support => enabled
pcre
PCRE (Perl Compatible Regular Expressions) Support => enabled
PCRE Library Version => 3.92 11-Sep-2002
posix
Revision => $Revision: 1.51 $
session
Session Support => enabled
Registered save handlers => files user
Directive => Local Value => Master Value
session.auto_start => Off => Off
session.bug_compat_42 => On => On
session.bug_compat_warn => On => On
session.cache_expire => 180 => 180
session.cache_limiter => nocache => nocache
session.cookie_domain => no value => no value
session.cookie_lifetime => 0 => 0
session.cookie_path => / => /
session.cookie_secure => Off => Off
session.entropy_file => no value => no value
session.entropy_length => 0 => 0
session.gc_dividend => 100 => 100
session.gc_maxlifetime => 1440 => 1440
session.gc_probability => 1 => 1
session.name => PHPSESSID => PHPSESSID
session.referer_check => no value => no value
session.save_handler => files => files
session.save_path => /tmp => /tmp
session.serialize_handler => php => php
session.use_cookies => On => On
session.use_only_cookies => Off => Off
session.use_trans_sid => Off => Off
standard
Regex Library => Bundled library enabled
Dynamic Library Support => enabled
Path to sendmail => /usr/lib/sendmail -t -i
Directive => Local Value => Master Value
assert.active => 1 => 1
assert.bail => 0 => 0
assert.callback => no value => no value
assert.quiet_eval => 0 => 0
assert.warning => 1 => 1
auto_detect_line_endings => 0 => 0
default_socket_timeout => 60 => 60
safe_mode_allowed_env_vars => PHP_ => PHP_
safe_mode_protected_env_vars => LD_LIBRARY_PATH => LD_LIBRARY_PATH
url_rewriter.tags => a=href,area=href,frame=src,input=src,form=,fieldset= =>
a=href,area=href,frame=src,input=src,form=,fieldset=
user_agent => no value => no value
tokenizer
Tokenizer Support => enabled
xml
XML Support => active
XML Namespace Support => active
EXPAT Version => 1.95.2
zlib
ZLib Support => enabled
Compiled Version => 1.1.3
Linked Version => 1.1.3
Directive => Local Value => Master Value
zlib.output_compression => Off => Off
zlib.output_compression_level => -1 => -1
zlib.output_handler => no value => no value
Additional Modules
Module Name
filepro
Environment
Variable => Value
CC => gcc
CONTENT_LENGTH => CONTENT_TYPE => HOME => /
LD_LIBRARY_PATH => /usr/local/lib:/opt/sfw/lib:/opt/sfw/include
LIBPATH => /usr/local/lib:/opt/sfw/lib:/opt/sfw/include
LOGNAME => root
MAKEFLAGS => MAKELEVEL => 1
MFLAGS => OLDPWD => /export/home/instaladores/php-4.3.0RC4/tests
PATH =>
//bin:/usr/local/bin:/usr/ccs/bin/:/usr/local/mysql/bin:/opt/sfw/bin:/opt/sfw/lib:/usr/sbin:/usr/local/sbin:/usr/ucb:/bin:/usr/bin:/etc
PATH_TRANSLATED => PWD => /export/home/instaladores/php-4.3.0RC4
QUERY_STRING => REDIRECT_STATUS => REQUEST_METHOD => SCRIPT_FILENAME => SHELL =>
/bin/sh
SHLVL => 1
TERM => vt100
TEST_PHP_EXECUTABLE => /export/home/instaladores/php-4.3.0RC4/sapi/cli/php
TEST_PHP_SRCDIR => /export/home/instaladores/php-4.3.0RC4
USER => root
_ => /usr/local/bin/make
PHP Variables
Variable => Value
PHP_SELF => _SERVER["CC"] => gcc
_SERVER["CONTENT_LENGTH"] =>
_SERVER["CONTENT_TYPE"] =>
_SERVER["HOME"] => /
_SERVER["LD_LIBRARY_PATH"] => /usr/local/lib:/opt/sfw/lib:/opt/sfw/include
_SERVER["LIBPATH"] => /usr/local/lib:/opt/sfw/lib:/opt/sfw/include
_SERVER["LOGNAME"] => root
_SERVER["MAKEFLAGS"] =>
_SERVER["MAKELEVEL"] => 1
_SERVER["MFLAGS"] =>
_SERVER["OLDPWD"] => /export/home/instaladores/php-4.3.0RC4/tests
_SERVER["PATH"] =>
//bin:/usr/local/bin:/usr/ccs/bin/:/usr/local/mysql/bin:/opt/sfw/bin:/opt/sfw/lib:/usr/sbin:/usr/local/sbin:/usr/ucb:/bin:/usr/bin:/etc
_SERVER["PATH_TRANSLATED"] =>
_SERVER["PWD"] => /export/home/instaladores/php-4.3.0RC4
_SERVER["QUERY_STRING"] =>
_SERVER["REDIRECT_STATUS"] =>
_SERVER["REQUEST_METHOD"] =>
_SERVER["SCRIPT_FILENAME"] =>
_SERVER["SHELL"] => /bin/sh
_SERVER["SHLVL"] => 1
_SERVER["TERM"] => vt100
_SERVER["TEST_PHP_EXECUTABLE"] => /export/home/instaladores/php-4.3.0RC4/sapi/cli/php
_SERVER["TEST_PHP_SRCDIR"] => /export/home/instaladores/php-4.3.0RC4
_SERVER["USER"] => root
_SERVER["_"] => /usr/local/bin/make
_SERVER["PHP_SELF"] =>
_SERVER["SCRIPT_NAME"] =>
_SERVER["DOCUMENT_ROOT"] =>
_SERVER["argv"] => Array
(
)
_SERVER["argc"] => 0
_ENV["CC"] => gcc
_ENV["CONTENT_LENGTH"] =>
_ENV["CONTENT_TYPE"] =>
_ENV["HOME"] => /
_ENV["LD_LIBRARY_PATH"] => /usr/local/lib:/opt/sfw/lib:/opt/sfw/include
_ENV["LIBPATH"] => /usr/local/lib:/opt/sfw/lib:/opt/sfw/include
_ENV["LOGNAME"] => root
_ENV["MAKEFLAGS"] =>
_ENV["MAKELEVEL"] => 1
_ENV["MFLAGS"] =>
_ENV["OLDPWD"] => /export/home/instaladores/php-4.3.0RC4/tests
_ENV["PATH"] =>
//bin:/usr/local/bin:/usr/ccs/bin/:/usr/local/mysql/bin:/opt/sfw/bin:/opt/sfw/lib:/usr/sbin:/usr/local/sbin:/usr/ucb:/bin:/usr/bin:/etc
_ENV["PATH_TRANSLATED"] =>
_ENV["PWD"] => /export/home/instaladores/php-4.3.0RC4
_ENV["QUERY_STRING"] =>
_ENV["REDIRECT_STATUS"] =>
_ENV["REQUEST_METHOD"] =>
_ENV["SCRIPT_FILENAME"] =>
_ENV["SHELL"] => /bin/sh
_ENV["SHLVL"] => 1
_ENV["TERM"] => vt100
_ENV["TEST_PHP_EXECUTABLE"] => /export/home/instaladores/php-4.3.0RC4/sapi/cli/php
_ENV["TEST_PHP_SRCDIR"] => /export/home/instaladores/php-4.3.0RC4
_ENV["USER"] => root
_ENV["_"] => /usr/local/bin/make
PHP License
This program is free software; you can redistribute it and/or modify
it under the terms of the PHP License as published by the PHP Group
and included in the distribution in the file: LICENSE
This program is distributed in the hope that it will be useful,
but WITHOUT ANY WARRANTY; without even the implied warranty of
MERCHANTABILITY or FITNESS FOR A PARTICULAR PURPOSE.
If you did not receive a copy of the PHP license, or have any
questions about PHP licensing, please contact license@php.net.